{"text_format":"1","workbook":"xlsx","n_sheets":7,"sheets":["info","GA55","7pay matrix chart","TAX CALCULATION","OLD TAX REGIME","NEW TAX REGIME","PAY SLIP"],"not_rendered":{"charts":0,"images":4,"macros":1,"external_links":0,"defined_names":24,"comments":3,"pivot_tables":0},"unopened":[],"bounds":{"document_bytes":16777216,"sheet_cells":100000,"rows_first":2000,"rows_last":500,"rows_between":2000,"halvings":0,"cell_chars":16384,"cell_head_chars":4096},"cells_cut":0,"cells_raw":0,"read":"whole","date_system":"1900"}

{"sheet":"info","index":0,"n_rows":33,"n_cols":14,"rows_kept":33,"cut":false,"hidden":false,"merged":[[32,1,33,6],[32,7,33,9],[32,10,33,15],[4,1,8,1],[30,9,31,12],[30,3,31,8],[26,3,26,15],[27,3,29,5],[27,6,29,8],[27,9,29,12],[27,13,29,15],[22,3,22,15],[23,3,23,15],[24,3,24,15],[25,6,25,7],[25,8,25,15],[17,1,18,1],[17,2,17,15],[18,2,18,15],[19,2,19,15],[20,1,21,4],[20,5,21,8],[20,9,21,10],[20,11,21,15],[13,2,13,15],[14,2,14,15],[15,1,16,1],[15,2,15,15],[16,2,16,15],[30,13,31,15],[1,1,1,15],[6,2,6,15],[7,2,7,15],[4,2,4,15],[5,2,5,15],[2,1,2,15],[3,1,3,15],[8,2,8,15],[10,2,10,15],[12,2,12,15],[9,1,10,1],[9,2,9,15],[11,1,12,1],[11,2,11,15],[13,1,14,1]]}
[]
[null,"INCOMETAX 2022-23 SOFTWARE में आपका स्वागत है "]
[null,"करणीय कार्य"]
[null,"यह प्रोग्राम विशेषकर राजस्थान के सभी शिक्षा' विभाग के कर्मचारीगण हेतु सरल,सहज,एंव स्मार्ट तरीके से बनाया गया है"]
[null,1,"GA 55 SHEET"]
[null,null,"दोस्तों सबसे पहले GA55 SHEET में YELLO SHELL में ENTRY करे "]
[null,null,"इसके बाद मार्च माह का वेतन ENTER करे और आपसे संबधित जानकारी का चुनाव करे और आपका GA 55 तैयार है"]
[null,null,"आयकर स्लैब का चयन करे "]
[null,null,"कटौती में GPF,SIP,GPF LOAN,INCOMETAX इत्यादि की entry करे बाकी cell ऑटो जनरेट है BILL NO एंव TV NO MANUAL FEED करे"]
[null,2,"7 PAY MATRIX CHART"]
{"$rows_left_out":24}
{"sheet":"GA55","index":1,"n_rows":65,"n_cols":115,"rows_kept":65,"cut":false,"hidden":false,"merged":[[0,50,5,50],[21,35,21,36],[3,16,3,18],[3,19,3,21],[16,35,16,40],[17,35,17,36],[18,35,18,36],[19,35,19,36],[20,35,20,36],[6,1,6,24],[8,22,8,24],[7,22,7,24],[8,1,8,2],[2,23,3,24],[1,19,1,21],[4,1,4,10],[0,0,4,0],[2,19,2,21],[0,1,0,18],[0,19,0,21],[7,18,7,21],[4,12,4,21],[5,12,5,21],[7,1,7,17],[3,1,3,14],[2,1,2,7],[2,10,2,18],[2,8,2,9],[1,1,1,18],[5,1,5,4],[5,5,5,11],[37,2,37,4],[10,15,10,18],[10,19,10,21],[10,22,10,24],[10,3,10,6],[10,7,10,8],[10,9,10,11],[36,2,36,6],[36,19,36,23],[10,1,10,2],[10,12,10,14],[0,49,4,49],[9,1,9,2],[9,3,9,4],[9,22,9,24],[9,5,9,7],[9,8,9,10],[9,12,9,17],[9,19,9,21],[8,3,8,6],[8,8,8,10],[8,19,8,21],[1,23,1,24],[4,23,5,24],[15,62,16,64],[8,14,8,18],[35,2,35,6],[35,19,35,23],[36,9,36,15]]}
[null,"आप आयकर गणना प्रपत्र पुराना लेना चाहते है तो DROPDOWN MENU में OLD अथवा नए के लिए new का चयन करे |",null,null,null,null,null,null,null,null,null,null,null,null,null,null,null,null,null,null,null,null,"OLD","TAX",{"$f":"IF(W1=\"OLD\",'OLD TAX REGIME'!M56,'NEW TAX REGIME'!M57)","v":35219},null,null,null,null,null,null,null,null,null,null,null,null,null,null,null,null,null,null,null,null,null,null,null,null,null,"सबसे पहले मार्च basic डार्क cell में लिखे फिर SIP,SIL,GPF,LIC,  GIL,IT की कटोती MANUAL मार्च22 से करे  और PRINT करे"]
[null,"क्या आप 01.01.2004 के बाद नियुक्त है तो DROPDOWN मेनू में YES अथवा NO का चयन करे|",null,null,null,null,null,null,null,null,null,null,null,null,null,null,null,null,null,null,null,null,"YES","HRA",null,null,null,null,{"$f":"IF(W2=\"yes\",AB13,IF(W2=\"no\",AC16))","v":5541},null,null,null,null,null,null,null,null,null,1,{"$f":"W9","v":42300},31,{"$f":"AN2/AO2*15","v":20467.741935483871},{"$f":"ROUND(AP2,0)","v":20468},{"$f":"ROUND(AQ2*17/100,0)","v":3480}]
[null,"कर्मचारी का राज्य सेवा में प्रकार",null,null,null,null,null,null,"REGULAR",null,"क्या आपको बोनस मिला है तो YES अथवा NO का चयन करे",null,null,null,null,null,null,null,null,null,null,null,"YES",null,null,null,null,null,null,null,null,0.08,null,null,null,null,null,null,2,{"$f":"D14","v":42300},29,{"$f":"AN3/AO3*15","v":21879.310344827583},{"$f":"ROUND(AP3,0)","v":21879},{"$f":"ROUND(AQ3*17/100,0)","v":3719}]
[null,"क्या आपको समर्पित अवकाश मिला है तो YES अथवा NO का चयन करे",null,null,null,null,null,null,null,null,null,null,null,null,null,"YES","किस माह में उठाया",null,null,null,null,null,4,null,null,null,null,null,"YES",null,",uih,l",0.16,null,null,null,null,null,null,3,{"$f":"D15","v":42300},31,20467.741935483871,20468,3480,null,null,null,"OLD"]
[null,"क्या आपको विशेषयोग्यजन कर्मचारी भत्ता मिलता है|",null,null,null,null,null,null,null,null,null,"NO","क्या आपको HRA की छूट देय है  ",null,null,null,null,null,null,null,null,null,"YES",0.09,null,null,null,null,null,null,"thih,Q",null,null,null,null,null,null,null,4,{"$f":"D16","v":42300},30,21150,21150,3596,null,null,null,"NEW"]
[null,"आपके DDO का नाम/PRICIPAL",null,null,null,"श्री करमा राम",null,null,null,null,null,null,null,null,null,null,null,null,null,null,null,null,"YES",null,null,null,null,null,null,null,null,null,null,null,null,null,null,null,0,null,null,null,null,0]
[null,"OFFICE GOVT.SR.SEC.SCHOOL ALNIYAWAS DISTT.-NAGAUR",null,null,null,null,null,null,null,null,null,null,null,null,null,null,null,null,null,null,null,null,null,null,null,null,null,null,"REGULAR","YES",null,null,null,null,null,null,null,null,5,{"$f":"D17","v":43600},31,21096.774193548386,21097,3586,null,null,null,null,null,null,null,null,null,null,null,null,null,"OLD TAX REGIME"]
[null,"वेतन एंव कर निर्धारण वर्ष 2022-23",null,null,null,null,null,null,null,null,null,null,null,null,null,null,null,null,"आयकर स्लैब का चयन :-",null,null,null,"OLD TAX REGIME",null,null,null,null,null,"PROBATION","NO","YES","surender",2,null,null,"GPF",null,null,6,43600,30,21800,21800,3706,null,null,null,null,null,null,null,null,null,null,null,null,null,"NEW TAX REGIME"]
[null,"नाम कर्मचारी :",null,"VIJAY KUMAR PRAJAPAT",null,null,null,"पद :","LECTURER",null,null,"लेवल :","L-12","पेन न :","QYPP0000J",null,null,null,null,"Basic Pay (IN MARCH)",null,null,42300,null,null,null,null,null,null,{"$f":"IF(AC4>=\"YES\",(D13+E13)*10/100)","v":5541.3},"NO",null,null,null,null,"GPF04",null,null,7,43600,31,21096.774193548386,21097,{"$f":"ROUND(AQ9*31/100,0)","v":6540},null,null,null,null,null,null,null,null,null,"(    OLD TAX REGIME    )"]
[null,"राज्य बीमा  :",null,457858,null,"जीपीएफ/एनपीएस:",null,null,45,null,null,"बैंक ब्रांच","STATE BANK OF INDIA RIYAN BARI",null,null,null,null,null,null,"Bank A/c :",null,null,61000000000,null,null,null,{"$f":"ROUND(W9-(W9*0.03),2)","v":41031},{"$f":"ROUND(AA10,-2)","v":41000},null,null,null,{"$f":"VLOOKUP(L5,B13:E24,3,0)","v":{"$error":"#N/A"}},null,null,null,null,null,null,8,43600,31,21096.774193548386,21097,{"$f":"ROUND(AQ10*31/100,0)","v":6540},null,null,null,null,null,null,null,null,null,"(    NEW TAX REGIME        )"]
{"$rows_left_out":56}
{"sheet":"7pay matrix chart","index":2,"n_rows":48,"n_cols":31,"rows_kept":48,"cut":false,"hidden":false,"merged":[[22,23,25,24],[0,0,0,24],[0,25,0,30],[1,0,1,24],[1,25,1,30],[2,0,3,0],[2,1,3,9],[2,10,3,13],[2,14,3,20],[2,21,3,24],[2,25,6,25],[2,26,6,26],[2,27,6,27],[2,28,6,28],[2,29,6,29],[2,30,6,30],[34,21,34,22],[34,25,34,26],[26,21,26,24],[27,21,27,22],[28,21,28,22],[29,21,29,22],[30,21,30,22],[31,21,31,22],[31,25,31,28],[32,21,32,22],[32,25,32,26],[33,21,33,22],[33,25,33,26],[35,21,35,22],[35,25,35,26],[36,21,36,22],[36,25,36,26],[37,21,37,22],[37,25,37,26],[38,21,38,24],[38,25,38,26],[39,21,39,22],[40,19,41,20],[37,20,39,20],[40,21,40,22],[41,21,41,22],[42,21,42,22],[43,21,43,22],[44,21,44,30],[45,16,47,20],[44,17,44,20],[42,18,43,20]]}
["SCHEDULE-1 PART-B RULE NO.5 VI & VII",null,null,null,null,null,null,null,null,null,null,null,null,null,null,null,null,null,null,null,null,null,null,null,null,"SHEDULE IV  (RULE NO. 16"]
["PAY MATRIX OF STATE GOVT. SERVANTS",null,null,null,null,null,null,null,null,null,null,null,null,null,null,null,null,null,null,null,null,null,null,null,null,"FIX REMUNERATION FOR PROBATIONER-TRAINEE"]
["EXISTING R.P. BAND","                                  PB-1                                       5200-20000",null,null,null,null,null,null,null,null,"              PB -2                    9300-34800",null,null,null,"                             PB-3                                 15600-39100",null,null,null,null,null,null,"                 PB -4                  37400-67000",null,null,null,"S.NO.","EXITING G.P.","EXITING G.P.NO.","EXITING AMOUNT OF FIXED RENUANERATION","CORRESPONDING LEVEL","FIXED REMUNERATION (WEF 01-01-17)"]
[]
["EXIST.G.P.",1700,1750,1900,2000,2400,2400,2400,2800,2800,3600,4200,4800,5400,5400,6000,6600,6800,7200,7600,8200,8700,8900,9500,10000]
["EXIST.G.P.",2,3,4,5,9,"9A","9B",10,"10A",11,12,14,15,15,16,17,18,19,20,21,22,23,"23A",24]
["LEVELS‏‏‏‏-","L-1","L-2","L-3","L-4","L-5","L-6","L-7","L-8","L-9","L-10","L-11","L-12","L-13","L-14","L-15","L-16","L-17","L-18","L-19","L-20","L-21","L-22","L-23","L-24"]
["CELL NO",null,null,null,null,null,null,null,null,null,null,null,null,null,null,null,null,null,null,null,null,null,null,null,null,1,2,3,4,5,6]
[1,17700,17900,18200,19200,20800,21500,22400,26300,28700,33800,37800,44300,53100,56100,60700,67300,71000,75300,79900,88900,123100,129700,145800,148800,1,1700,2,6670,"L-1",12400]
[2,{"$f":"ROUND(B9+(B9*0.03),-2)","v":18200},{"$f":"ROUND(C9+(C9*0.03),-2)","v":18400},{"$f":"ROUND(D9+(D9*0.03),-2)","v":18700},19800,21400,22100,23100,27100,29600,34800,38900,45600,54700,57800,62500,69300,73100,77600,82300,91600,126800,133600,150200,153300,2,1750,3,7000,"L-2",12600]
{"$rows_left_out":39}
{"sheet":"TAX CALCULATION","index":3,"n_rows":28,"n_cols":13,"rows_kept":28,"cut":false,"hidden":false,"merged":[[0,9,0,11],[15,3,15,6],[17,3,17,6],[0,0,0,1],[1,5,1,6],[1,3,1,4],[0,3,0,6],[14,0,16,1],[16,5,16,6]]}
["ENTER DATA IN YELLOW TAB",null,null,"TAX CACULATION",null,null,null,null,null,"TAX SLAB ( YEAR 2021-22)"]
["ANNUAL GROSS SALARY",{"$f":"'GA55'!K32","v":788750},null,"OLD TAX REGIME",null,"NEW TAX REGIME  ( OPTIONAL)",null,null,null,"SLAB","OPTIONAL","EXITING"]
["STANDARD DEDUCTION",50000,null,"SLAB AMOUNT (OLD)","TAX","SLAB AMOUNT (NEW)","TAX",null,null,null,"NEW","OLD"]
["HRA",0,null,{"$f":"IF($B$13>250000,250000,$B$13)","v":250000},{"$f":"D4*L4","v":0},{"$f":"IF(B14>250000,250000,D13)","v":250000},{"$f":"F4*K4","v":0},null,null,"0-250000",0,0]
["PT AND ENTERTAINMENT ALLOWANCE",0,null,{"$f":"IF($B$13>500000,250000,$B$13-D4)","v":229017},{"$f":"IF(B13<=500000,0,(D5*L5))","v":0},{"$f":"IF($B$14>500000,250000,($B$14-F4))","v":250000},{"$f":"IF(B14<=500000,0,F5*K5)","v":12500},null,null,"250001-500000",0.05,0.05]
["GPF/NPS/GPF04",{"$f":"'GA55'!L32","v":34733},null,{"$f":"IF($B$13>750000,250000,$B$13-D5-D4)","v":0},{"$f":"ROUND(D6*L6,0)","v":0},{"$f":"IF($B$14>750000,250000,($B$14-F5-F4))","v":250000},{"$f":"ROUND(F6*K6,0)","v":25000},null,null,"500001-750000",0.1,0.2]
["HOM E LOAN ITEREST",null,null,{"$f":"IF($B$13>1000000,250000,$B$13-D6-D5-D4)","v":0},{"$f":"ROUND(D7*L7,0)","v":0},{"$f":"IF($B$14>1000000,250000,($B$14-F5-F6-F4))","v":4017},{"$f":"ROUND(F7*K7,0)","v":603},null,null,"750001-1000000",0.15,0.2]
["DEDUCTION OG US 80C",150000,null,{"$f":"IF($B$13>1250000,250000,$B$13-D7-D6-D5-D4)","v":0},0,{"$f":"IF($B$14>1250000,250000,($B$14-F6-F7-F5-F4))","v":0},0,null,null,"1000001-1250000",0.2,0.3]
["HEALTH  INSURANCE US 80D",null,null,{"$f":"IF($B$13>1500000,250000,$B$13-D8-D7-D6-D5-D4)","v":0},0,{"$f":"IF($B$14>1250000,250000,($B$14-F7-F8-F6-F5-F4))","v":0},0,null,null,"1250001-1500000",0.25,0.3]
["SAVING BANK INTEREST",0,null,{"$f":"IF($B$13>1500000,$B$13-1500000,0)","v":0},0,{"$f":"IF($B$14>1500000,$B$14-1500000,0)","v":0},0,null,null,"1500000 & ABOVE",0.3,0.3]
{"$rows_left_out":19}
{"sheet":"OLD TAX REGIME","index":4,"n_rows":68,"n_cols":13,"rows_kept":68,"cut":false,"hidden":false,"merged":[[51,2,51,10],[52,2,52,10],[53,2,53,10],[54,2,54,10],[55,2,55,10],[13,5,13,6],[56,1,56,12],[57,2,57,4],[50,2,50,10],[23,3,23,4],[38,1,38,10],[30,1,37,1],[39,2,39,10],[40,2,40,10],[26,2,26,10],[27,2,27,10],[28,2,28,10],[15,1,28,1],[29,1,29,12],[24,3,24,4],[24,6,24,9],[25,2,25,11],[16,12,24,12],[15,3,15,10],[63,2,63,10],[64,2,64,10],[65,2,65,10],[60,9,60,10],[61,9,61,10],[62,9,62,10],[57,12,59,12],[61,12,62,12],[60,2,60,4],[61,2,61,4],[62,2,62,4],[57,6,57,8],[58,6,58,8],[59,6,59,8],[60,6,60,8],[61,6,61,8],[62,6,62,8],[12,7,12,8],[10,7,10,8],[13,3,13,4],[13,7,13,8],[23,7,23,9],[20,7,20,9],[21,7,21,9],[22,7,22,9],[16,3,16,4],[17,3,17,4],[18,3,18,4],[19,3,19,4],[20,3,20,4],[21,3,21,4],[22,3,22,4],[16,7,16,9],[17,7,17,9],[18,7,18,9],[19,7,19,9],[13,9,13,10],[2,11,2,12],[14,3,14,10],[3,3,3,4],[3,5,3,7],[9,3,9,10],[0,1,0,12],[5,3,5,10],[4,3,4,10],[6,3,6,10],[7,1,8,1],[7,3,7,9],[8,3,8,9],[2,8,2,9],[3,8,3,9],[3,10,3,12],[2,4,2,6],[7,12,8,12],[1,1,1,9],[1,10,1,12],[10,1,12,1],[11,3,12,4],[11,5,11,6],[12,5,12,6],[11,7,11,8],[30,3,30,10],[31,3,31,10],[32,3,32,10],[33,3,33,10],[42,2,42,7],[42,8,42,10],[35,3,35,10],[36,3,36,10],[37,3,37,10],[34,3,34,10],[70,3,70,5],[67,3,67,5],[43,1,48,1],[43,8,43,10],[46,2,46,6],[47,2,47,6],[48,2,48,6],[41,2,41,10],[43,2,43,6],[44,2,44,6],[45,2,45,6],[44,8,44,10],[45,8,45,10],[46,8,46,10],[47,8,47,10],[48,8,48,10],[49,2,49,7],[49,8,49,10],[58,2,58,4],[59,2,59,4],[57,9,57,10],[58,9,58,10],[59,9,59,10],[67,10,67,12]]}
[null,{"$f":"'GA55'!B7","v":"OFFICE GOVT.SR.SEC.SCHOOL ALNIYAWAS DISTT.-NAGAUR"}]
[null,"आयकर गणना प्रपत्र 202-23 ( कर निर्धारण वर्ष 202-24)",null,null,null,null,null,null,null,null,"OLD TAX REGIME"]
[null,1,null,"नाम कर्मचारी",{"$f":"'GA55'!D9","v":"VIJAY KUMAR PRAJAPAT"},null,null,"पद",{"$f":"'GA55'!I9:K9","v":"LECTURER"},null,"PAN NO",{"$f":"'GA55'!O9","v":"QYPP0000J"}]
[null,null,null,"Bank Ac.No.--",null,{"$f":"'GA55'!W10","v":61000000000},null,null,"Name Of Bank :",null,{"$f":"'GA55'!M10","v":"STATE BANK OF INDIA RIYAN BARI"}]
[null,2,null,"कुल वेतन (कर योग्य सुविधाओ सहित NPS सहित )",null,null,null,null,null,null,null,"Rs.",{"$f":"'GA55'!K32","v":788750}]
[null,3,null,"ग्रह किराया धारा 10(13-I) के अंतर्गतएंव धारा 10(14) के अंतर्गतअन्यभत्ते जो करमुक्त हो",null,null,null,null,null,null,null,"Rs.",0]
[null,4,null,"शेष (2-3) -WITH EXEMPT STANDARD DEDUCTION MAX. 50000",null,null,null,null,null,null,null,"Rs.",{"$f":"M5-M6-50000","v":738750}]
[null,5,null,"(i) मनोरंजन भत्ता धारा 16(i) के अंतर्गत ( अधिकतम सीमा रू 5000 )",null,null,null,null,null,null,0,"Rs."]
[null,null,null,"(ii)  व्यवसाय कर धारा 16(ii) के अंतर्गत ( अधिकतम सीमा रू 5000 )",null,null,null,null,null,null,0,"Rs."]
[null,6,null,"शेष (4-5) ",null,null,null,null,null,null,null,"Rs.",{"$f":"M7-K8-K9","v":738750}]
{"$rows_left_out":59}
{"sheet":"NEW TAX REGIME","index":5,"n_rows":69,"n_cols":13,"rows_kept":69,"cut":false,"hidden":false,"merged":[[50,2,50,7],[50,8,50,10],[66,2,66,10],[68,10,68,12],[48,2,48,6],[48,8,48,10],[62,12,63,12],[63,2,63,4],[63,6,63,8],[63,9,63,10],[64,2,64,10],[65,2,65,10],[60,9,60,10],[61,2,61,4],[61,6,61,8],[61,9,61,10],[62,2,62,4],[62,6,62,8],[62,9,62,10],[57,1,57,12],[58,2,58,4],[58,6,58,8],[58,9,58,10],[58,12,60,12],[59,9,59,10],[60,2,60,4],[60,6,60,8],[51,2,51,10],[59,2,59,4],[59,6,59,8],[52,2,52,10],[53,2,53,10],[54,2,54,10],[55,2,55,10],[56,2,56,10],[47,8,47,10],[49,2,49,6],[49,8,49,10],[42,2,42,7],[42,8,42,10],[43,1,49,1],[43,2,43,6],[43,8,43,10],[44,2,44,6],[44,8,44,10],[46,2,46,6],[46,8,46,10],[47,2,47,6],[45,2,45,6],[45,8,45,10],[36,3,36,10],[37,3,37,10],[38,1,38,10],[39,2,39,10],[40,2,40,10],[41,2,41,10],[27,2,27,10],[28,2,28,10],[29,1,29,12],[30,1,37,1],[30,3,30,10],[31,3,31,10],[32,3,32,10],[33,3,33,10],[34,3,34,10],[35,3,35,10],[15,1,28,1],[15,3,15,10],[16,3,16,4],[16,7,16,9],[16,12,24,12],[17,3,17,4],[17,7,17,9],[18,3,18,4],[23,3,23,4],[23,7,23,9],[24,3,24,4],[24,6,24,9],[25,2,25,11],[26,2,26,10],[19,7,19,9],[20,3,20,4],[20,7,20,9],[21,3,21,4],[21,7,21,9],[22,3,22,4],[22,7,22,9],[18,7,18,9],[19,3,19,4],[9,3,9,10],[10,1,12,1],[10,12,12,12],[11,3,12,4],[14,3,14,10],[4,3,4,10],[5,3,5,10],[6,3,6,10],[7,1,8,1],[7,3,7,9],[7,12,8,12],[8,3,8,9],[10,7,10,8],[11,5,11,6],[11,7,11,8],[12,5,12,6],[12,7,12,8],[13,3,13,4],[13,7,13,8],[13,9,13,10],[13,5,13,6],[0,1,0,12],[2,4,2,6],[2,8,2,9],[2,11,2,12],[3,3,3,4],[3,5,3,7],[3,8,3,9],[3,10,3,12],[1,1,1,9],[1,10,1,12]]}
[null,{"$f":"'GA55'!B7","v":"OFFICE GOVT.SR.SEC.SCHOOL ALNIYAWAS DISTT.-NAGAUR"}]
[null,"आयकर गणना प्रपत्र 2021-22 ( कर निर्धारण वर्ष 2022-23)",null,null,null,null,null,null,null,null,"NEW TAX REGIME"]
[null,1,null,"नाम कर्मचारी",{"$f":"'GA55'!D9","v":"VIJAY KUMAR PRAJAPAT"},null,null,"पद",{"$f":"'GA55'!J9","v":0},null,"PAN NO",{"$f":"'GA55'!O9","v":"QYPP0000J"}]
[null,null,null,"Bank Ac.No.--",null,{"$f":"'GA55'!W10","v":61000000000},null,null,"Name Of Bank :",null,{"$f":"'GA55'!M10","v":"STATE BANK OF INDIA RIYAN BARI"}]
[null,2,null,"कुल वेतन (कर योग्य सुविधाओ सहित NPS सहित )",null,null,null,null,null,null,null,"Rs.",{"$f":"'GA55'!K32","v":788750}]
[null,3,null,"ग्रह किराया धारा 10(13-I) के अंतर्गतएंव धारा 10(14) के अंतर्गतअन्यभत्ते जो करमुक्त हो",null,null,null,null,null,null,null,"Rs.",0]
[null,4,null,"शेष (2-3) -WITH EXEMPT STANDARD DEDUCTION MAX. 50000",null,null,null,null,null,null,null,"Rs.",{"$f":"M5-M6-50000","v":738750}]
[null,5,null,"(i) मनोरंजन भत्ता धारा 16(i) के अंतर्गत ( अधिकतम सीमा रू 5000 )",null,null,null,null,null,null,0,"Rs."]
[null,null,null,"(ii)  व्यवसाय कर धारा 16(ii) के अंतर्गत ( अधिकतम सीमा रू 5000 )",null,null,null,null,null,null,0,"Rs."]
[null,6,null,"शेष (4-5) ",null,null,null,null,null,null,null,"Rs.",{"$f":"M7-K8-K9","v":738750}]
{"$rows_left_out":60}
{"sheet":"PAY SLIP","index":6,"n_rows":46,"n_cols":17,"rows_kept":46,"cut":false,"hidden":false,"merged":[[42,1,42,5],[42,6,42,9],[26,6,26,7],[27,1,27,2],[45,1,45,2],[43,1,43,5],[43,6,43,9],[30,8,30,9],[32,8,32,9],[33,8,33,9],[36,5,36,6],[45,3,45,4],[35,3,35,4],[36,3,36,4],[33,6,33,7],[30,1,30,2],[30,3,30,4],[30,6,30,7],[32,3,33,4],[32,1,33,2],[28,8,28,9],[29,1,29,2],[29,3,29,4],[29,6,29,7],[29,8,29,9],[28,1,28,2],[28,3,28,4],[28,6,28,7],[32,6,32,7],[31,1,31,2],[27,6,27,7],[27,8,27,9],[22,5,31,5],[24,1,24,2],[24,3,24,4],[24,6,24,7],[24,8,24,9],[25,1,25,2],[25,3,25,4],[25,6,25,7],[31,3,31,4],[31,6,31,7],[31,8,31,9],[21,6,22,9],[27,3,27,4],[26,8,26,9],[0,1,0,9],[1,1,1,9],[2,1,2,2],[2,3,2,9],[3,1,3,2],[3,3,3,5],[3,6,3,7],[3,8,3,9],[5,1,5,3],[5,6,5,7],[7,2,7,5],[7,6,7,7],[4,4,4,6],[19,3,19,9],[11,1,11,2],[11,3,11,5],[11,7,11,9],[15,1,15,2],[15,3,15,5],[15,7,15,9],[17,1,17,3],[17,6,17,8],[13,8,13,9],[13,1,13,3],[13,6,13,7],[7,8,7,9],[21,1,22,4],[37,1,37,2],[37,3,37,9],[34,1,34,4],[34,6,34,9],[9,1,9,3],[9,6,9,8],[25,8,25,9],[23,1,23,2],[23,3,23,4],[23,6,23,7],[23,8,23,9],[26,1,26,2],[26,3,26,4],[19,1,19,2]]}
[null,"वेतन पर्ची"]
[null,"Pay Slip"]
[null,"DDO   OFFICE   : ",null,{"$f":"'GA55'!B7","v":"OFFICE GOVT.SR.SEC.SCHOOL ALNIYAWAS DISTT.-NAGAUR"}]
[null,"TV NO.& DATE :",null,{"$f":"VLOOKUP(E5,'GA55'!C13:Y31,23,0)","v":0},null,null,"BILL NO. & DATE :",null,{"$f":"VLOOKUP(E5,'GA55'!C13:Y24,22,0)","v":0}]
[null,null,null,"Month :","2022-10-01",null,null,null,null,null,null,null,null,null,null,null,{"$f":"'GA55'!C13","v":"2022-03-01"}]
[null,"कर्मचारी का नाम",null,null,null,null,"पदनाम",null,null,null,null,null,null,null,null,null,{"$f":"'GA55'!C14","v":"2022-04-01"}]
[null,null,null,null,null,null,null,null,null,null,null,null,null,null,null,null,{"$f":"'GA55'!C15","v":"2022-05-01"}]
[null,"NAME",{"$f":"'GA55'!D9","v":"VIJAY KUMAR PRAJAPAT"},null,null,null,"Designation :",null,{"$f":"'GA55'!I9:K9","v":"LECTURER"},null,null,null,null,null,null,null,{"$f":"'GA55'!C16","v":"2022-06-01"}]
[null,null,null,null,null,null,null,null,null,null,null,null,null,null,null,null,{"$f":"'GA55'!C17","v":"2022-07-01"}]
[null,"कर्मचारी पहचान संख्या",null,null,null,null,"बैंक खाता संख्या",null,null,null,null,null,null,null,null,null,{"$f":"'GA55'!C18","v":"2022-08-01"}]
{"$rows_left_out":36}