{"text_format":"1","workbook":"xlsx","n_sheets":4,"sheets":["निर्देश","STUDENT_DATA","PAGE1","PAGE2"],"not_rendered":{"charts":0,"images":4,"macros":1,"external_links":0,"defined_names":4,"comments":1,"pivot_tables":0},"unopened":[],"bounds":{"document_bytes":16777216,"sheet_cells":100000,"rows_first":2000,"rows_last":500,"rows_between":2000,"halvings":0,"cell_chars":16384,"cell_head_chars":4096},"cells_cut":0,"cells_raw":0,"read":"whole","date_system":"1900"}

{"sheet":"निर्देश","index":0,"n_rows":13,"n_cols":16,"rows_kept":13,"cut":false,"hidden":false,"merged":[[1,1,1,12],[2,1,2,12],[3,1,3,12],[4,1,4,12],[5,1,5,12],[6,1,6,12],[12,2,12,12],[12,15,12,25],[9,1,9,13],[10,2,10,12],[11,2,11,12]]}
[]
[null,"महत्वपूर्ण निर्देश"]
[null,"सभी आवश्यक निर्देश ध्यान पूर्वक पढे "]
[null,"सबसे पहले STUDENT DATA शीट में अपने विद्यालय का नाम लिखे "]
[null,"जिस भी विधार्थी का फॉर्म भरना है उसकी जानकारी शीट STUDENT DATA में भरे आप जो भी जानकारी भरेगे वो फॉर्म में आने लग जाएगी "]
[null,"यद्यपि फॉर्म में सम्पूर्ण आवश्यक जानकारी शीट के माध्यम से भरी जाएगी फिर भी फॉर्म भरने के बाद यदि कोई \nजानकारी आपको आवश्यक लगती है तो मैनुअल भरे "]
[null,"जिस भी छात्र /छात्रा का भरा हुआ फॉर्म प्रिन्ट करना चाहते हो PAGE1 शीट में उस छात्र/छात्रा की क्रम संख्या \nलिखे जो STUDENT DATA शीट में भरते समय लिखी थी "]
[]
[]
[null,"हमारे द्वारा बनाई गई आवश्यक फाइल डॉक्यूमेंट एक्सल फाइल प्राप्त करने के लिए निमन्नालिखित लिंक पर क्लिक करे  "]
[null,{"$f":"_xlfn.UNICHAR(9758)","v":"☞"},"https://rajsevak.com/shivraj-meghwanshi/"]
[null,{"$f":"_xlfn.UNICHAR(9758)","v":"☞"},"https://rajteachers.net/shivraj-meghwanshi"]
[null,"☞","https://www.ashwinisharma.com/p/shivraj-meghwanshi-excel-program-excel.html",null,null,null,null,null,null,null,null,null,null,null,null,"टीम राउमावि मोराझड़ी "]

{"sheet":"STUDENT_DATA","index":1,"n_rows":349,"n_cols":68,"rows_kept":349,"cut":false,"hidden":false,"merged":[[0,0,0,7],[0,9,0,42]]}
["राजकीय उच्च माध्यमिक विद्यालय ",null,null,null,null,null,null,null,"2025-26"]
["SR NO","Name*","Dob*","प्रवेश दिनांक*","प्रवेशांक(SR NO)*","Religion*","FatherName*","MotherName*","प्रवेश कक्षा ","सेक्शन","Category*","Gender*","प्रवेश का प्रकार *","संकाय (कक्षा 11 ओर 12 )","वैकल्पिक विषय 1","वैकल्पिक विषय 2","वैकल्पिक विषय 3","वैकल्पिक विषय 4","तृतीय भाषा(6-10 )","वोकेशनल ट्रेड (9/10वीं)","पूर्व विद्यालय","पूर्व विद्यालय का S. R. नम्बरः","अंतिम कक्षा","परिणाम","Aadhar No of Student*","Jan Aadhar Card*","राशन कार्ड नम्बर","1. Mobile (Father/Mother/Guardian)*","2. Mobile (Father/Mother/Guardian)","CWSN Status","(YES)CWSN Status","राज्य का नाम*","कितने वर्षों से रह रहा है","Student Permanent Address*","पिता आधार नंबर ","पिता उच्चतम योग्यता","पिता व्यवसाय *","पिता वार्षिक आय ","माता आधार नंबर ","माता उच्चतम योग्यता","व्यवसाय *","वार्षिक आय ","Distance From School"]
[{"$f":"IF(ISBLANK(B3),\"\",COUNTA($B$3:B3))","v":1},"गणेश ","1999-07-03","2025-07-10",878,"हिंदू","जगदीश मेघवंशी ","मीनाक्षी देवी",12,"A","SC","पुरुष","नव प्रवेश","विज्ञान","हिन्दी साहित्य","भूगोल","राजनीति विज्ञान","हिंदी / अंग्रेज़ी","संस्कृत","कॉरपोरेट कम्युनिकेशन  ","GSSS RAMSAR",546,11,"अध्ययनरत",869546887691,2365444513,9210901008,9625256179,8725622934,"नहीं",null,"राजस्थान","जन्म से ","केरिया खुर्द",963673179412,"स्नातक ","कृषि मजदूर",6800,123456789124,"निरक्षर","गृहिणी",1000,3,null,null,null,null,null,null,null,null,null,null,null,null,null,null,null,null,null,null,null,null,null,null,null,"हिन्दी साहित्य"]
[{"$f":"IF(ISBLANK(B4),\"\",COUNTA($B$3:B4))","v":""},null,null,null,null,null,null,null,null,null,null,null,null,null,null,null,null,null,null,null,null,null,null,null,null,null,null,null,null,null,null,null,null,null,null,null,null,null,null,null,null,null,null,null,null,null,null,null,null,null,null,null,null,null,null,null,null,null,null,null,null,null,null,null,null,null,"अंग्रेज़ी साहित्य"]
[{"$f":"IF(ISBLANK(B5),\"\",COUNTA($B$3:B5))","v":""},null,null,null,null,null,null,null,null,null,null,null,null,null,null,null,null,null,null,null,null,null,null,null,null,null,null,null,null,null,null,null,null,null,null,null,null,null,null,null,null,null,null,null,null,null,null,null,null,null,null,null,null,null,null,null,null,null,null,null,null,null,null,null,null,null,"राजनीति विज्ञान"]
[{"$f":"IF(ISBLANK(B6),\"\",COUNTA($B$3:B6))","v":""},null,null,null,null,null,null,null,null,null,null,null,null,null,null,null,null,null,null,null,null,null,null,null,null,null,null,null,null,null,null,null,null,null,null,null,null,null,null,null,null,null,null,null,null,null,null,null,null,null,null,null,null,null,null,null,null,null,null,null,null,null,null,null,null,null,"इतिहास"]
[{"$f":"IF(ISBLANK(B7),\"\",COUNTA($B$3:B7))","v":""},null,null,null,null,null,null,null,null,null,null,null,null,null,null,null,null,null,null,null,null,null,null,null,null,null,null,null,null,null,null,null,null,null,null,null,null,null,null,null,null,null,null,null,null,null,null,null,null,null,null,null,null,null,null,null,null,null,null,null,null,null,null,null,null,null,"भूगोल"]
[{"$f":"IF(ISBLANK(B8),\"\",COUNTA($B$3:B8))","v":""},null,null,null,null,null,null,null,null,null,null,null,null,null,null,null,null,null,null,null,null,null,null,null,null,null,null,null,null,null,null,null,null,null,null,null,null,null,null,null,null,null,null,null,null,null,null,null,null,null,null,null,null,null,null,null,null,null,null,null,null,null,null,null,null,null,"नागरिक शास्त्र"]
[{"$f":"IF(ISBLANK(B9),\"\",COUNTA($B$3:B9))","v":""},null,null,null,null,null,null,null,null,null,null,null,null,null,null,null,null,null,null,null,null,null,null,null,null,null,null,null,null,null,null,null,null,null,null,null,null,null,null,null,null,null,null,null,null,null,null,null,null,null,null,null,null,null,null,null,null,null,null,null,null,null,null,null,null,null,"मनोविज्ञान","राजस्थान"]
[{"$f":"IF(ISBLANK(B10),\"\",COUNTA($B$3:B10))","v":""},null,null,null,null,null,null,null,null,null,null,null,null,null,null,null,null,null,null,null,null,null,null,null,null,null,null,null,null,null,null,null,null,null,null,null,null,null,null,null,null,null,null,null,null,null,null,null,null,null,null,null,null,null,null,null,null,null,null,null,null,null,null,null,null,null,"समाजशास्त्र","आंध्र प्रदेश"]
[{"$f":"IF(ISBLANK(B11),\"\",COUNTA($B$3:B11))","v":""},null,null,null,null,null,null,null,null,null,null,null,null,null,null,null,null,null,null,null,null,null,null,null,null,null,null,null,null,null,null,null,null,null,null,null,null,null,null,null,null,null,null,null,null,null,null,null,null,null,null,null,null,null,null,null,null,null,null,null,null,null,null,null,null,null,"दर्शनशास्त्र","अरुणाचल प्रदेश"]
[{"$f":"IF(ISBLANK(B12),\"\",COUNTA($B$3:B12))","v":""},null,null,null,null,null,null,null,null,null,null,null,null,null,null,null,null,null,null,null,null,null,null,null,null,null,null,null,null,null,null,null,null,null,null,null,null,null,null,null,null,null,null,null,null,null,null,null,null,null,null,null,null,null,null,null,null,null,null,null,null,null,null,null,null,null,"गृह विज्ञान","असम"]
[{"$f":"IF(ISBLANK(B13),\"\",COUNTA($B$3:B13))","v":""},null,null,null,null,null,null,null,null,null,null,null,null,null,null,null,null,null,null,null,null,null,null,null,null,null,null,null,null,null,null,null,null,null,null,null,null,null,null,null,null,null,null,null,null,null,null,null,null,null,null,null,null,null,null,null,null,null,null,null,null,null,null,null,null,null,"संगीत","बिहार"]
[{"$f":"IF(ISBLANK(B14),\"\",COUNTA($B$3:B14))","v":""},null,null,null,null,null,null,null,null,null,null,null,null,null,null,null,null,null,null,null,null,null,null,null,null,null,null,null,null,null,null,null,null,null,null,null,null,null,null,null,null,null,null,null,null,null,null,null,null,null,null,null,null,null,null,null,null,null,null,null,null,null,null,null,null,null,"चित्रकला","छत्तीसगढ़"]
[{"$f":"IF(ISBLANK(B15),\"\",COUNTA($B$3:B15))","v":""},null,null,null,null,null,null,null,null,null,null,null,null,null,null,null,null,null,null,null,null,null,null,null,null,null,null,null,null,null,null,null,null,null,null,null,null,null,null,null,null,null,null,null,null,null,null,null,null,null,null,null,null,null,null,null,null,null,null,null,null,null,null,null,null,null,"शारीरिक शिक्षा","गोवा"]
[{"$f":"IF(ISBLANK(B16),\"\",COUNTA($B$3:B16))","v":""},null,null,null,null,null,null,null,null,null,null,null,null,null,null,null,null,null,null,null,null,null,null,null,null,null,null,null,null,null,null,null,null,null,null,null,null,null,null,null,null,null,null,null,null,null,null,null,null,null,null,null,null,null,null,null,null,null,null,null,null,null,null,null,null,null,"शिक्षाशास्त्र","गुजरात"]
[{"$f":"IF(ISBLANK(B17),\"\",COUNTA($B$3:B17))","v":""},null,null,null,null,null,null,null,null,null,null,null,null,null,null,null,null,null,null,null,null,null,null,null,null,null,null,null,null,null,null,null,null,null,null,null,null,null,null,null,null,null,null,null,null,null,null,null,null,null,null,null,null,null,null,null,null,null,null,null,null,null,null,null,null,null,"अर्थशास्त्र","हरियाणा"]
[{"$f":"IF(ISBLANK(B18),\"\",COUNTA($B$3:B18))","v":""},null,null,null,null,null,null,null,null,null,null,null,null,null,null,null,null,null,null,null,null,null,null,null,null,null,null,null,null,null,null,null,null,null,null,null,null,null,null,null,null,null,null,null,null,null,null,null,null,null,null,null,null,null,null,null,null,null,null,null,null,null,null,null,null,null,"कंप्यूटर","हिमाचल प्रदेश"]
[{"$f":"IF(ISBLANK(B19),\"\",COUNTA($B$3:B19))","v":""},null,null,null,null,null,null,null,null,null,null,null,null,null,null,null,null,null,null,null,null,null,null,null,null,null,null,null,null,null,null,null,null,null,null,null,null,null,null,null,null,null,null,null,null,null,null,null,null,null,null,null,null,null,null,null,null,null,null,null,null,null,null,null,null,null,"पर्यावरण अध्ययन","झारखंड"]
[{"$f":"IF(ISBLANK(B20),\"\",COUNTA($B$3:B20))","v":""},null,null,null,null,null,null,null,null,null,null,null,null,null,null,null,null,null,null,null,null,null,null,null,null,null,null,null,null,null,null,null,null,null,null,null,null,null,null,null,null,null,null,null,null,null,null,null,null,null,null,null,null,null,null,null,null,null,null,null,null,null,null,null,null,null,"सैन्य विज्ञान / NCC","कर्नाटक"]
{"$rows_left_out":330}
{"sheet":"PAGE1","index":2,"n_rows":44,"n_cols":26,"rows_kept":44,"cut":false,"hidden":false,"merged":[[40,7,40,8],[41,7,41,8],[38,2,38,3],[38,4,38,5],[39,2,39,3],[40,2,40,3],[41,2,41,3],[39,4,39,5],[40,4,40,5],[41,4,41,5],[39,7,39,8],[38,7,38,8],[2,2,2,4],[5,0,5,2],[12,6,12,7],[12,8,12,9],[6,2,6,6],[10,3,10,4],[10,8,10,9],[3,0,3,1],[5,3,5,7],[16,0,16,3],[18,0,18,2],[20,4,20,6],[0,0,0,2],[2,0,2,1],[3,2,3,6],[14,0,14,5],[14,6,14,10],[4,2,4,4],[20,0,20,3],[17,0,17,5],[19,0,19,4],[19,5,19,8],[13,0,13,3],[13,6,13,8],[11,0,11,4],[36,8,36,10],[36,0,36,3],[36,5,36,7],[37,0,37,4],[12,0,12,3],[12,4,12,5],[32,0,32,2],[32,4,32,5],[34,2,34,10],[35,0,35,3],[35,4,35,6],[35,8,35,9],[34,0,34,1],[30,3,30,4],[15,0,15,3],[15,5,15,8],[31,0,31,3],[33,0,33,2],[30,5,30,8],[30,0,30,2],[28,0,28,1],[28,7,28,8],[28,2,28,3],[28,9,28,10],[29,0,29,2],[29,3,29,4],[29,5,29,6],[29,7,29,8],[27,0,27,1],[27,3,27,10],[23,3,23,5],[23,0,23,2],[23,6,23,8],[23,9,23,10],[24,3,24,5],[24,6,24,8],[24,0,24,2],[26,3,26,4],[26,0,26,2],[26,5,26,6],[25,0,25,4],[25,5,25,9],[26,7,26,9],[4,15,4,17],[0,12,0,14],[21,2,21,3],[21,5,21,6],[22,0,22,3],[22,4,22,5],[10,5,10,7],[1,12,1,14],[2,12,2,14],[4,7,4,8],[13,4,13,5],[13,9,13,10],[1,4,1,6],[1,7,1,8],[0,3,0,10],[4,0,4,1]]}
["विद्यालय का नाम",null,null,{"$f":"STUDENT_DATA!A1","v":"राजकीय उच्च माध्यमिक विद्यालय "},null,null,null,null,null,null,null,null,"फॉर्म भरने के लिए नीचे क्रम  संख्या लिखे",null,null,null,null,null,null,null,null,null,null,null,"OBC",{"$f":"INDEX(STUDENT_DATA!K:K, MATCH(M3, STUDENT_DATA!A:A, 0))=\"OBC\"","v":{"$error":"#N/A"}}]
[null,null,null,null,"प्रवेश आवेदन पत्र ",null,null,{"$f":"STUDENT_DATA!I1","v":"2025-26"},null,null,null,null,"SR NO (क्र. स.)",null,null,null,null,null,null,null,null,null,null,null,"SC",{"$f":"INDEX(STUDENT_DATA!K:K, MATCH(M3, STUDENT_DATA!A:A, 0))=\"SC\"","v":{"$error":"#N/A"}}]
["प्रवेश दिनांक",null,{"$f":"IFERROR(INDEX(STUDENT_DATA!D:D, MATCH(PAGE1!M3, STUDENT_DATA!A:A, 0)), \"\")","v":""},null,null,null,null,null,null,"प्रवेशांक",{"$f":"IFERROR(INDEX(STUDENT_DATA!E:E, MATCH(PAGE1!M3, STUDENT_DATA!A:A, 0)), \"\")","v":""},null,2,null,null,null,null,null,null,null,null,null,null,null,"ST",{"$f":"INDEX(STUDENT_DATA!K:K, MATCH(M3, STUDENT_DATA!A:A, 0))=\"ST\"","v":{"$error":"#N/A"}}]
["1.विद्यार्थी का नाम",null,{"$f":"IFERROR(INDEX(STUDENT_DATA!B:B, MATCH(PAGE1!M3, STUDENT_DATA!A:A, 0)), \"\")","v":""},null,null,null,null,null,null,null,null,null,null,null,null,null,null,null,null,null,null,null,null,null,"GEN",{"$f":"INDEX(STUDENT_DATA!K:K, MATCH(M3, STUDENT_DATA!A:A, 0))=\"GEN\"","v":{"$error":"#N/A"}}]
["2.जन्म तिथि",null,{"$f":"IFERROR(INDEX(STUDENT_DATA!C:C, MATCH(PAGE1!M3, STUDENT_DATA!A:A, 0)), \"\")","v":""},null,null,null,"3.धर्म",{"$f":"IFERROR(INDEX(STUDENT_DATA!F:F, MATCH(PAGE1!M3, STUDENT_DATA!A:A, 0)), \"\")","v":""},null,null,null,null,null,null,null,"shivraj meghwanshi",null,null,null,null,null,null,null,null,"SBC",{"$f":"INDEX(STUDENT_DATA!K:K, MATCH(M3, STUDENT_DATA!A:A, 0))=\"SBC\"","v":{"$error":"#N/A"}}]
["4.पिता/अभिभावक का नाम",null,null,{"$f":"IFERROR(INDEX(STUDENT_DATA!G:G, MATCH(PAGE1!M3, STUDENT_DATA!A:A, 0)), \"\")","v":""}]
["5.माता का नाम",null,{"$f":"IFERROR(INDEX(STUDENT_DATA!H:H, MATCH(PAGE1!M3, STUDENT_DATA!A:A, 0)), \"\")","v":""}]
["6.वर्ग",null,"GEN","OBC","SBC","SC","ST"]
["7.लिंग",null,"महिला ",null,"पुरुष ",null,null,null,null,null,null,null,null,null,"PRINT",null,null,null,null,null,null,null,null,null,"F",{"$f":"INDEX(STUDENT_DATA!L:L, MATCH(M3, STUDENT_DATA!A:A, 0))=\"महिला\"","v":{"$error":"#N/A"}}]
["8.कक्षा जिसमें प्रवेश चाहियेः",null,null,{"$f":"IFERROR(INDEX(STUDENT_DATA!I:I, MATCH(PAGE1!M3, STUDENT_DATA!A:A, 0)), \"\")","v":""},null,null,"9.सेक्शन",{"$f":"IFERROR(INDEX(STUDENT_DATA!J:J, MATCH(PAGE1!M3, STUDENT_DATA!A:A, 0)), \"\")","v":""},null,null,null,null,null,null,null,null,null,null,null,null,null,null,null,null,"M",{"$f":"INDEX(STUDENT_DATA!L:L, MATCH(M3, STUDENT_DATA!A:A, 0))=\"पुरुष\"","v":{"$error":"#N/A"}}]
["10.प्रवेश का प्रकारः",null,null,"स्थानांतरण",null,"नव प्रवेश",null,null,"पुनः प्रवेश",null,null,null,null,null,null,null,null,null,null,null,null,null,null,null,"TR",{"$f":"INDEX(STUDENT_DATA!M:M, MATCH(M3, STUDENT_DATA!A:A, 0))=\"स्थानंतरण\"","v":{"$error":"#N/A"}}]
["11.संकाय (सिर्फ कक्षा 11 और 12 के लिए):-",null,null,null,null,"कला वर्ग","वाणिज्य वर्ग",null,"विज्ञान वर्ग",null,null,null,null,null,null,null,null,null,null,null,null,null,null,null,"NEW",{"$f":"INDEX(STUDENT_DATA!M:M, MATCH(M3, STUDENT_DATA!A:A, 0))=\"नव प्रवेश\"","v":{"$error":"#N/A"}}]
["12.वैकल्पिक विषय (11 / 12वीं)",null,null,null,{"$f":"IFERROR(INDEX(STUDENT_DATA!O:O, MATCH(PAGE1!M3, STUDENT_DATA!A:A, 0)), \"\")","v":""},null,{"$f":"IFERROR(INDEX(STUDENT_DATA!P:P, MATCH(PAGE1!M3, STUDENT_DATA!A:A, 0)), \"\")","v":""},null,{"$f":"IFERROR(INDEX(STUDENT_DATA!Q:Q, MATCH(PAGE1!M3, STUDENT_DATA!A:A, 0)), \"\")","v":""},null,{"$f":"IFERROR(INDEX(STUDENT_DATA!R:R, MATCH(PAGE1!M3, STUDENT_DATA!A:A, 0)), \"\")","v":""},null,null,null,null,null,null,null,null,null,null,null,null,null,"PUNH",{"$f":"INDEX(STUDENT_DATA!M:M, MATCH(M3, STUDENT_DATA!A:A, 0))=\"पुनः प्रवेश\"","v":{"$error":"#N/A"}}]
["13.तृतीय भाषा (कक्षा 6-10 तक):-",null,null,null,{"$f":"IFERROR(INDEX(STUDENT_DATA!S:S, MATCH(PAGE1!M3, STUDENT_DATA!A:A, 0)), \"\")","v":""},null,"14. वोकेशनल ट्रेड (9/10वीं) :",null,null,{"$f":"IFERROR(INDEX(STUDENT_DATA!T:T, MATCH(PAGE1!M3, STUDENT_DATA!A:A, 0)), \"\")","v":""},null,null,null,null,null,null,null,null,null,null,null,null,null,null,"ART",{"$f":"INDEX(STUDENT_DATA!N:N, MATCH(M3, STUDENT_DATA!A:A, 0))=\"कला\"","v":{"$error":"#N/A"}}]
["15.पूर्व विद्यालय का नाम जहां विद्यार्थी अध्ययनरत रहा है",null,null,null,null,null,{"$f":"IFERROR(INDEX(STUDENT_DATA!U:U, MATCH(PAGE1!M3, STUDENT_DATA!A:A, 0)), \"\")","v":""},null,null,null,null,null,null,null,null,null,null,null,null,null,null,null,null,null,"COM",{"$f":"INDEX(STUDENT_DATA!N:N, MATCH(M3, STUDENT_DATA!A:A, 0))=\"वाणिज्य\"","v":{"$error":"#N/A"}}]
["16.पूर्व विद्यालय का S. R. नम्बरः-",null,null,null,{"$f":"IFERROR(INDEX(STUDENT_DATA!V:V, MATCH(PAGE1!M3, STUDENT_DATA!A:A, 0)), \"\")","v":""},"एवं शाला दर्पण कोड (केवल सरकारी हेतु) :",null,null,null,null,null,null,null,null,null,null,null,null,null,null,null,null,null,null,"SCI",{"$f":"INDEX(STUDENT_DATA!N:N, MATCH(M3, STUDENT_DATA!A:A, 0))=\"विज्ञान\"","v":{"$error":"#N/A"}}]
["17.पूर्व वि‌द्यालय की अंतिम कक्षा:- ",null,null,null,{"$f":"IFERROR(INDEX(STUDENT_DATA!W:W, MATCH(PAGE1!M3, STUDENT_DATA!A:A, 0)), \"\")","v":""},"18.अंतिम कक्षा का परिणामः",null,null,"उत्तीर्ण","अनुतीर्ण","अध्ययनरत",null,null,null,null,null,null,null,null,null,null,null,null,null,"FAIL",{"$f":"INDEX(STUDENT_DATA!X:X, MATCH(M3, STUDENT_DATA!A:A, 0))=\"अनुतीर्ण\"","v":{"$error":"#N/A"}}]
["18.क्या विद्यार्थी विद्यालय में कार्यरत कार्मिक की संतान हैं",null,null,null,null,null,"हाँ ","नहीं",null,null,null,null,null,null,null,null,null,null,null,null,null,null,null,null,"PASS",{"$f":"INDEX(STUDENT_DATA!X:X, MATCH(M3, STUDENT_DATA!A:A, 0))=\"उत्तीर्ण\"","v":{"$error":"#N/A"}}]
["19.बी.पी.एल. स्थितिः- ",null,null,"नहीं है । ",null,"राज्य बी०पी०एल०",null,null,"केंद बी०पी०एल०",null,null,null,null,null,null,null,null,null,null,null,null,null,null,null,"ADHY",{"$f":"INDEX(STUDENT_DATA!X:X, MATCH(M3, STUDENT_DATA!A:A, 0))=\"अध्ययनरत\"","v":{"$error":"#N/A"}}]
["20.अगर हाँ तो बी.पी.एल. प्रमाण पत्र क्रमांक:-",null,null,null,null,null,null,null,null,"व दिनांक:-"]
{"$rows_left_out":25}
{"sheet":"PAGE2","index":3,"n_rows":44,"n_cols":12,"rows_kept":44,"cut":false,"hidden":false,"merged":[[1,0,1,11],[3,10,3,11],[3,8,3,9],[2,8,2,11],[2,0,3,0],[2,1,3,3],[2,4,3,4],[2,5,3,7],[7,1,7,3],[4,5,4,7],[5,5,5,7],[6,5,6,7],[7,5,7,7],[4,1,4,3],[5,1,5,3],[6,1,6,3],[4,8,4,9],[5,8,5,9],[6,8,6,9],[7,8,7,9],[4,10,4,11],[5,10,5,11],[6,10,6,11],[7,10,7,11],[13,9,13,10],[15,0,15,11],[17,7,17,11],[17,1,17,3],[9,0,9,11],[11,0,11,11],[12,0,12,11],[13,0,13,3],[13,4,13,7],[10,1,10,3],[10,5,10,6],[10,8,10,9],[14,1,14,11],[29,0,29,11],[30,0,30,1],[30,2,30,3],[30,10,30,11],[26,5,26,11],[26,0,26,2],[28,1,28,2],[28,8,28,11],[41,0,41,11],[31,6,31,7],[32,6,32,7],[33,6,33,7],[35,0,35,1],[35,9,35,11],[35,5,35,7],[31,0,31,1],[32,0,32,1],[33,0,33,1],[31,3,31,4],[32,3,32,4],[33,3,33,4],[31,10,31,11],[32,10,32,11],[33,10,33,11],[43,8,43,9],[23,0,23,11],[24,8,24,10],[25,10,25,11],[25,7,25,9],[26,3,26,4],[42,0,42,1],[42,2,42,3],[42,10,42,11],[43,0,43,1],[43,5,43,7],[37,6,37,11],[37,1,37,3],[38,0,38,11],[40,8,40,11],[40,1,40,3],[18,0,18,11],[20,0,20,4],[20,7,20,10],[20,5,20,6],[25,0,25,6],[19,3,19,6],[19,8,19,10],[24,3,24,6],[22,1,22,2],[22,8,22,11]]}
["39.विद्यार्थी एकल कन्या हैं:-",null,null," हाँ","नहीं"]
["40.अगर विद्यार्थी के सगे भाई बहिन इसी विद्यालय में पढ़ रहें हैं तोः-"]
["क्र.सं","प्रवेशांक (S.R. No.)",null,null,"कक्षा","भाई/बहिन का नाम",null,null,"सम्बन्ध"]
[null,null,null,null,null,null,null,null,"भाई/बहिन",null,"बड़ा/छोटा"]
[1]
[2]
[3]
[4]
[]
["घोषणा शपथ पत्र"]
["मैं   ",{"$f":"PAGE1!D6","v":""},null,null,"जाति",null,null,"निवासी",{"$f":"PAGE1!C35","v":""},null,"आयु"]
["घोषणा करता/करती हूँ कि इस प्रवेश पत्र में भरी गई समस्त सूचनाएं सही हैं। मैं यह विश्वास दिलाता/दिलाती हूँ कि उक्त छात्र/छात्रा"]
["नियमित रूप से विद्यालय आएगा / आएगी और विद्यालय के समस्त नियमों व अनुशासन सम्बंधित निर्देशों का पालन"]
["करेगा/करेगी। मैं अपने पुत्र/पुत्री  ",null,null,null,{"$f":"PAGE1!C4","v":""},null,null,null,"जन्म तिथि",{"$f":"PAGE1!C5","v":""},null,"जिसे कक्षा"]
[{"$f":"PAGE1!E17","v":""},"में प्रवेश दिलवाना चाहता हूँ, का विवाह बालिग होने से पूर्व नहीं करूँगा / करूँगी एवं बाल विवाह, रोकथाम अधिनियम"]
["1929 की पालना करूँगा / करूँगी और मैं इन सब के लिए प्रतिबद्ध रहूँगा / रहेंगी।"]
[]
["दिनांक :-",{"$f":"PAGE1!C3","v":""},null,null,null,null,null,"हस्ताक्षर शपथ गृहिता (पिता/माता/संरक्षक)"]
["आय प्रमाण-पत्र"]
["प्रमाणित किया जाता है कि श्री/श्रीमती ",null,null,{"$f":"PAGE1!D6","v":""},null,null,null,"छात्र/छात्रा",{"$f":"PAGE1!C4","v":""},null,null,"के"]
{"$rows_left_out":24}