{"text_format":"1","workbook":"xlsx","n_sheets":3,"sheets":["निर्देश","Student Record","FORM"],"not_rendered":{"charts":0,"images":9,"macros":1,"external_links":0,"defined_names":1,"comments":0,"pivot_tables":0},"unopened":[],"bounds":{"document_bytes":16777216,"sheet_cells":100000,"rows_first":2000,"rows_last":500,"rows_between":2000,"halvings":0,"cell_chars":16384,"cell_head_chars":4096},"cells_cut":0,"cells_raw":0,"read":"whole","date_system":"1900"}

{"sheet":"निर्देश","index":0,"n_rows":35,"n_cols":11,"rows_kept":35,"cut":false,"hidden":false,"merged":[[32,2,32,11],[33,2,33,11],[34,2,34,11],[30,10,30,11],[31,0,31,12],[2,2,2,10],[23,1,23,11],[24,2,30,3],[24,6,30,7],[24,4,30,5],[24,8,29,9],[24,10,29,11],[10,1,10,11]]}
[]
[]
[null,null,"महत्वपूर्ण निर्देश "]
[null,"1. जैसे ही आप excle शीट ओपन करते है आपको सबसे पहला कार्य करना है की फॉर्म शीट में अपने विद्यालय ओर जिस सत्र के फॉर्म प्रिन्ट करने है "]
[null,"उस सत्र का नाम शीट में लिख दे|"]
[null,"2. अपनी स्कूल का स्टूडेंट डाटा डाउनलोड कर Student Record शीट में पेस्ट करे ताकि प्रिन्ट उसी अनुरूप आए "]
[null,"3. आपको यदि फॉर्म में स्टूडेंट की फोटो लगानी है तो अपने पीसी की स्क्रीन पर एक फ़ोल्डर बनाए उसका नाम STUDENT PHOTO जैसा यह लिखा है वैसा ही लिखे"]
[null,"उस फ़ोल्डर में आपको स्टूडेंट की फोटो डालनी है ओर उस फोटो का नाम उस स्टूडेंट के SR नंबर लिखने है (जैसे 878) "]
[null,"4. यदि आपके पीसी में फाइल काम नहीं कर रही है तो एक बार यह चेक करे  की आपका Developer tab ओपन है या नहीं "]
[null," यदि developer tab ओपन नहीं है तो नीचे दिए लिंक से विडिओ देख कर tab ओपन करे"]
[null,"विडिओ देखने के लिए क्लिक करे "]
[null,"7. यदि आपका डेवलपर टैब ओपन है तो नीचे दिए गई सेटिंग को चेक करे यदि फिर भी समस्या बनी रहती है तो हमे मेल करे shivrajmeghwanshibarola567@gmail.com"]
[]
[]
[]
[]
[]
[]
[]
[]
[]
[]
[]
[null,"मार्गदर्शक "]
[null,null," Ahwini Kumar",null,"Mr. Heera Lal Jat",null,"Ram Karan Beniwal"]
[]
[]
[]
[]
[]
[null,null,null,null,null,null,null,null,"Mr. Parmanand Meghwal",null,"Mr. Shivraj Meghwanshi"]
["हमारे द्वारा बनाई गई आवश्यक फाइल डॉक्यूमेंट एक्सल फाइल प्राप्त करने के लिए निमन्नालिखित लिंक पर क्लिक करे  "]
[null,{"$f":"_xlfn.UNICHAR(9758)","v":"☞"},"https://rajsevak.com/shivraj-meghwanshi/"]
[null,{"$f":"_xlfn.UNICHAR(9758)","v":"☞"},"https://rajteachers.net/shivraj-meghwanshi"]
[null,"☞","https://www.ashwinisharma.com/p/shivraj-meghwanshi-excel-program-excel.html"]

{"sheet":"Student Record","index":1,"n_rows":365,"n_cols":30,"rows_kept":365,"cut":false,"hidden":false,"merged":[]}
["Class","Section","SRNO","DOA","Name","Late Status","FatherName","MotherName","Gender","Dob","ClassRollNo","ExamRollNumber","School Total Working Days","Student Total Attendence","Category","Religion","Previous Year Marks","Name Of School","School UDise Code","Aadhar No of Student","Bhamashash Card","Mobile No Student(Father/Mother/Guardian","Student Permanent Address","Annual Parental Income","CWSN Status","BPL Status","Minority Status","Age On Present(In Years)","Co-Curricular Activity","Distance From School"]
[1,"A",926,"2025-07-09","Arti Prajapat",null,"Mukesh Kumhar","Shrwani","F","2020-05-15",null,null,null,null,"OBC","Hindu",null,"GOVT. SENIOR SECONDARY SCHOOL MORAJHADI (214242)",8210302201,null,null,7073998294,"morajhadi,shrinagar,morajhadi,305402",48000,"N","N","No",5,"None",0]
[1,"A",941,"2025-07-16","Jyoti",null,"Mukesh","Maina","F","2019-04-15",null,null,null,null,"OBC","Hindu",null,"GOVT. SENIOR SECONDARY SCHOOL MORAJHADI (214242)",8210302201,null,null,9898989898,"MORAJHADI,SHRINAGAR,MORAJHADI,305402",48000,"N","N","No",6,"None",1]
[1,"A",924,"2025-07-01","Kismat Choudhary",null,"Jay Prakash Choudhary","Bharti","F","2019-05-01",null,null,null,null,"OBC","Hindu",null,"GOVT. SENIOR SECONDARY SCHOOL MORAJHADI (214242)",8210302201,null,null,7073214434,"morajhadi,shrinagar,morajhadi,305402",60000,"N","N","No",6,"None",1]
[1,"A",940,"2025-07-16","Kumkum Meghwanshi",null,"Mukesh Meghwanshi","Munim Meghwanshi","F","2019-04-24",null,null,null,null,"SC","Hindu",null,"GOVT. SENIOR SECONDARY SCHOOL MORAJHADI (214242)",8210302201,null,null,9166104771,"morajhadi,shrinagar,morajhadi,305402",60000,"N","N","No",6,"None",1]
[1,"A",951,"2025-07-21","Neeraj Bansali",null,"Ranjeet Regar","Pushpa","M","2020-03-20",null,null,null,null,"SC",null,null,"GOVT. SENIOR SECONDARY SCHOOL MORAJHADI (214242)",8210302201,null,null,9636093254,null,null,"N","Y",null,5,null,1]
[1,"A",937,"2025-07-14","Payal",null,"Pankaj Kumar","Kanchan","F","2019-08-14",null,null,null,null,"OBC","Hindu",null,"GOVT. SENIOR SECONDARY SCHOOL MORAJHADI (214242)",8210302201,null,null,8290856599,"morajhadi,shrinagar,morajhadi,305402",48000,"N","N","No",6,"None",1]
[1,"A",934,"2025-07-14","Tannu Jat",null,"Sardar","Surgyan","F","2017-09-15",null,null,null,null,"OBC","Hindu",null,"GOVT. SENIOR SECONDARY SCHOOL MORAJHADI (214242)",8210302201,null,null,6376959531,"morajhadi,shrinagar,morajhadi,305402",48000,"N","N","No",8,"None",1]
[2,"A",907,"2024-07-25","Aarushi",null,"Satyanarayan Jat","Ajodya","F","2019-04-19",null,null,null,null,"OBC","Hindu",null,"GOVT. SENIOR SECONDARY SCHOOL MORAJHADI (214242)",8210302201,"XXXX5052",null,8529735978,"MORAJHADI,SHRINAGAR,MORAJHADI,305402",0,"N","N","No",6,"None",0]
[2,"A",920,"2024-08-20","Anjali Meghwanshi",null,"Shankar","Gyarsi Meghwanshi","F","2019-03-21",null,null,null,null,"SC","Hindu",null,"GOVT. SENIOR SECONDARY SCHOOL MORAJHADI (214242)",8210302201,"XXXX0328",null,9929812329,"morajhadi,shrinagar,morajhadi,305402",60000,"N","N","No",6,"None",0]
[2,"A",906,"2024-07-25","Annu Jat",null,"Ramswaroop","Bhagawati","F","2019-02-11",null,null,null,null,"OBC","Hindu",null,"GOVT. SENIOR SECONDARY SCHOOL MORAJHADI (214242)",8210302201,"XXXX6543",null,9680679728,"MORAJHADI,SHRINAGAR,MORAJHADI,305402",0,"N","N","No",6,"None",0]
[2,"A",901,"2024-07-19","Bhumika Sain",null,"Rajesh Sain","Lalita Sain","F","2019-03-28",null,null,null,null,"OBC","Hindu",null,"GOVT. SENIOR SECONDARY SCHOOL MORAJHADI (214242)",8210302201,"XXXX8084",null,9772866674,"MORAJHADI,SHRINAGAR,MORAJHADI,305402",0,"N","N","No",6,"None",0]
[2,"A",885,"2024-07-08","Dinesh Regar",null,"Kalu Ram","Rinku","M","2018-07-06",null,null,null,null,"SC","Hindu",null,"GOVT. SENIOR SECONDARY SCHOOL MORAJHADI (214242)",8210302201,"XXXX8689",null,8290504398,"MORAJHADI,SHRINAGAR,MORAJHADI,305402",0,"N","N","No",7,"None",0]
[2,"A",914,"2024-07-31","Jagdish Prajapat",null,"Hansraj","Prem","M","2019-08-01",null,null,null,null,"OBC","Hindu",null,"GOVT. SENIOR SECONDARY SCHOOL MORAJHADI (214242)",8210302201,"XXXX9393",null,9929611454,"MORAJHADI,SHRINAGAR,MORAJHADI,305402",0,"N","N","No",6,"None",0]
[2,"A",877,"2024-07-04","Khushi",null,"Mukesh","Shrwani","F","2018-05-19",null,null,null,null,"OBC","Hindu",null,"GOVT. SENIOR SECONDARY SCHOOL MORAJHADI (214242)",8210302201,"XXXX9543",null,9829757763,"MORAJHADI,SHRINAGAR,MORAJHADI,305402",55000,"N","N","No",7,"None",0]
[2,"A",922,"2024-09-02","Khushi Jat",null,"Parmeshwar","Shanti","F","2018-08-12",null,null,null,null,"OBC","Hindu",null,"GOVT. SENIOR SECONDARY SCHOOL MORAJHADI (214242)",8210302201,"XXXX6362",null,9216846229,"morajhadi ,shrinagar,morajhadi,305402",50000,"N","N","No",7,"None",0]
[2,"A",921,"2024-08-20","Lokesh Prajapat",null,"Hardayal","Sona","M","2018-05-15",null,null,null,null,"OBC","Hindu",null,"GOVT. SENIOR SECONDARY SCHOOL MORAJHADI (214242)",8210302201,"XXXX6114",null,9829116673,"morajhadi,shrinagar,morajhadi,305402",60000,"N","N","No",7,"None",0]
[2,"A",878,"2024-07-04","Mansha Jat",null,"Prem Chand Jat","Gamla Jat","F","2018-05-13",null,null,null,null,"OBC","Hindu",null,"GOVT. SENIOR SECONDARY SCHOOL MORAJHADI (214242)",8210302201,"XXXX9859",null,9784088071,"MORAJHADI,SHRINAGAR,MORAJHADI,305402",60000,"N","N","No",7,"None",0]
[2,"A",875,"2024-07-02","Mona",null,"Ramesh Chand","Gita Devi","F","2018-06-11",null,null,null,null,"SC","Hindu",null,"GOVT. SENIOR SECONDARY SCHOOL MORAJHADI (214242)",8210302201,"XXXX2685",null,8003238676,"BHAGWANTPURA,SARWAR,BHAGWANTPURA,305403",60000,"N","N","No",7,"None",0]
[2,"A",884,"2024-07-06","Monika Prajapat",null,"Prakash","Parvati","F","2018-04-20",null,null,null,null,"OBC","Hindu",null,"GOVT. SENIOR SECONDARY SCHOOL MORAJHADI (214242)",8210302201,"XXXX8935",null,9116833033,"MORAJHADI,SHRINAGAR,MORAJHADI,305402",0,"N","N","No",7,"None",0]
[2,"A",879,"2024-07-05","Pooja Jat",null,"Shankar","Sharda Devi","F","2018-08-25",null,null,null,null,"OBC","Hindu",null,"GOVT. SENIOR SECONDARY SCHOOL MORAJHADI (214242)",8210302201,"XXXX5942",null,7425880371,"MORAJHADI,SHRINAGAR,MORAJHADI,305402",0,"N","N","No",7,"None",0]
[2,"A",880,"2024-07-05","Priya Jat",null,"Ganesh","Saroj Devi","F","2017-12-30",null,null,null,null,"OBC","Hindu",null,"GOVT. SENIOR SECONDARY SCHOOL MORAJHADI (214242)",8210302201,"XXXX5265",null,9521435886,"MORAJHADI,SHRINAGAR,MORAJHADI,305402",0,"N","N","No",8,"None",0]
[2,"A",881,"2024-07-06","Radhika",null,"Dhanraj","Mathra","F","2018-06-01",null,null,null,null,"OBC","Hindu",null,"GOVT. SENIOR SECONDARY SCHOOL MORAJHADI (214242)",8210302201,"XXXX5589",null,9784100510,"MORAJHADI,SHRINAGAR,MORAJHADI,305402",0,"N","N","No",7,"None",0]
[2,"A",923,"2024-09-02","Rajveer Jat",null,"Prithviraj","Suman Devi","M","2019-11-09",null,null,null,null,"OBC","Hindu",null,"GOVT. SENIOR SECONDARY SCHOOL MORAJHADI (214242)",8210302201,"XXXX6423",null,9928775212,"morajhadi ,shrinagar,morajhadi,305402",55000,"N","N","No",6,"None",0]
[2,"A",905,"2024-07-19","Rinku Prajapat",null,"Kailash","Parvati","F","2018-11-15",null,null,null,null,"OBC","Hindu",null,"GOVT. SENIOR SECONDARY SCHOOL MORAJHADI (214242)",8210302201,"XXXX8744",null,9636679743,"MORAJHADI,SHRINAGAR,MORAJHADI,305402",0,"N","N","No",7,"None",0]
[2,"A",899,"2024-07-18","Shivangi",null,"Hanuman","Chaina","F","2017-03-23",null,null,null,null,"OBC","Hindu",null,"GOVT. SENIOR SECONDARY SCHOOL MORAJHADI (214242)",8210302201,"XXXX4862",null,9680248530,"MORAJHADI,SHRINAGAR,MORAJHADI,305402",0,"N","N","No",8,"None",0]
[2,"A",874,"2024-07-02","Shivani",null,"Prithvi Raj","Suman Devi","F","2018-10-20",null,null,null,null,"OBC","Hindu",null,"GOVT. SENIOR SECONDARY SCHOOL MORAJHADI (214242)",8210302201,"XXXX9004",null,9928775212,"MORAJHADI,SHRINAGAR,MORAJHADI,305402",60000,"N","N","No",7,"None",0]
[2,"A",882,"2024-07-06","Tannu",null,"Basram","Shila","F","2018-06-14",null,null,null,null,"OBC","Hindu",null,"GOVT. SENIOR SECONDARY SCHOOL MORAJHADI (214242)",8210302201,"XXXX8326",null,9680681475,"MORAJHADI,SHRINAGAR,MORAJHADI,305402",0,"N","N","No",7,"None",0]
[2,"A",876,"2024-07-02","Vinod Choudhary",null,"Mangi Lal Choudhary","Shobhag Devi Jat","M","2017-09-04",null,null,null,null,"OBC","Hindu",null,"GOVT. SENIOR SECONDARY SCHOOL MORAJHADI (214242)",8210302201,"XXXX7552",null,6350127158,"MORAJHADI,SHRINAGARA,MORAJHADI,305402",60000,"N","N","No",8,"None",0]
[3,"A",814,"2023-07-06","Achuki",null,"Sanwara","Samotra Devi","F","2016-02-06",null,null,null,null,"OBC","Hindu",null,"GOVT. SENIOR SECONDARY SCHOOL MORAJHADI (214242)",8210302201,"XXXX5082",null,7023292099,"moprajhadi,shri nagar,morajhadi,305402",0,"N","N","No",9,"None",0]
[3,"A",837,"2023-07-15","Asha",null,"Mahaveer","Foola","F","2016-05-08",null,null,null,null,"OBC","Hindu",null,"GOVT. SENIOR SECONDARY SCHOOL MORAJHADI (214242)",8210302201,"XXXX4366",null,8306250762,"morajhadi,shri nagar,morajhadi,35402",0,"N","N","No",9,"None",0]
[3,"A",853,"2023-07-21","Ashika",null,"Hariram","Lada Devi","F","2017-01-23",null,null,null,null,"OBC","Hindu",null,"GOVT. SENIOR SECONDARY SCHOOL MORAJHADI (214242)",8210302201,"XXXX1296",null,9571878347,"morajhadi,shri nagar,morajhadi,305402",0,"N","N","No",8,"None",0]
[3,"A",893,"2024-07-15","Bhawana Choudhary",null,"Mahaveer Prasad Jat","Sita","F","2017-08-31",null,null,null,null,"OBC","Hindu",null,"GOVT. SENIOR SECONDARY SCHOOL MORAJHADI (214242)",8210302201,"XXXX5647",null,9649377821,null,null,"N","N","No",8,"None",0]
[3,"A",863,"2023-08-10","Deepak Jat",null,"Ramprasad","Shila Devi","M","2017-10-19",null,null,null,null,"OBC","Hindu",null,"GOVT. SENIOR SECONDARY SCHOOL MORAJHADI (214242)",8210302201,"XXXX2722",null,8290200950,"morajhadi,shri nagar,morajhadi,305402",0,"N","N","No",8,"None",0]
[3,"A",810,"2023-07-04","Dilkhush",null,"Golu Ram","Ramkani","M","2017-06-03",null,null,null,null,"OBC","Hindu",null,"GOVT. SENIOR SECONDARY SCHOOL MORAJHADI (214242)",8210302201,"XXXX0307",null,9660614808,"morajhadi,shri nagar,morajhadi,305402",0,"N","N","No",8,"None",0]
[3,"A",902,"2024-07-19","Hansa Prajapat",null,"Prakash Prajapat","Parvati","F","2016-08-21",null,null,null,null,"OBC","Hindu",null,"GOVT. SENIOR SECONDARY SCHOOL MORAJHADI (214242)",8210302201,"XXXX3911",null,9116833033,"KALYANPURA ,Sarwar,Tantoti ,305627",40000,"N","N","No",9,"None",0]
[3,"A",844,"2023-07-18","Khushi",null,"Pardhan","Mamata","F","2017-01-16",null,null,null,null,"OBC","Hindu",null,"GOVT. SENIOR SECONDARY SCHOOL MORAJHADI (214242)",8210302201,"XXXX9153",null,9950951302,"morajhadi,shri nagar,morajhadi,305402",0,"N","N","No",8,"None",0]
[3,"A",929,"2025-07-10","Komal Prajapat",null,"Gopal Lal Kumhar","Rekha","F","2013-11-05",null,null,null,null,"OBC","Hindu",null,"GOVT. SENIOR SECONDARY SCHOOL MORAJHADI (214242)",8210302201,"XXXX7478",null,8890450366,"gharta,banera,gharta,311030",60000,"Y","N","No",12,"None",0]
[3,"A",822,"2023-07-11","Kumkum",null,"Shankar","Sharda Devi","F","2017-05-25",null,null,null,null,"OBC","Hindu",null,"GOVT. SENIOR SECONDARY SCHOOL MORAJHADI (214242)",8210302201,"XXXX6428",null,8890196371,"morajhadi,shri nagar,morajhadi,305402",0,"N","N","No",8,"None",0]
[3,"A",842,"2023-07-18","Mitali prajapat",null,"Shetan Prajapat","Ramkanya Devi","F","2017-11-07",null,null,null,null,"OBC","Hindu",null,"GOVT. SENIOR SECONDARY SCHOOL MORAJHADI (214242)",8210302201,"XXXX7768",null,9660632244,"morajhadi,shri nagar,morajhadi,305402",0,"N","N","No",8,"None",0]
{"$rows_left_out":326}
{"sheet":"FORM","index":2,"n_rows":55,"n_cols":12,"rows_kept":55,"cut":false,"hidden":false,"merged":[[48,7,48,9],[48,3,48,5],[54,7,55,9],[2,0,2,9],[5,0,5,2],[5,3,5,9],[51,3,51,4],[51,6,51,9],[51,0,51,2],[53,0,53,1],[53,3,53,9],[33,5,33,9],[34,1,34,7],[34,8,34,9],[29,1,29,4],[29,5,29,9],[4,11,4,12],[3,11,3,12],[6,0,6,4],[6,5,6,9],[52,0,52,9],[45,0,45,9],[38,1,38,7],[38,8,38,9],[39,1,39,7],[39,8,39,9],[40,1,40,7],[37,1,37,7],[37,8,37,9],[32,1,32,4],[32,5,32,9],[33,1,33,4],[0,0,0,9],[1,0,1,9],[50,0,50,9],[46,1,46,3],[46,4,46,9],[47,0,47,9],[48,0,48,1],[41,1,41,7],[41,8,41,9],[42,0,42,9],[44,7,44,9],[40,8,40,9],[35,1,35,7],[35,8,35,9],[36,1,36,7],[36,8,36,9],[30,1,30,4],[30,5,30,9],[31,1,31,4],[31,5,31,9],[21,1,21,4],[21,5,21,9],[28,1,28,4],[28,5,28,9],[22,1,22,4],[22,5,22,9],[23,1,23,4],[23,5,23,9],[24,1,24,4],[24,5,24,9],[25,0,25,9],[26,1,26,4],[27,1,27,4],[27,5,27,9],[18,1,18,4],[18,5,18,9],[19,1,19,4],[19,5,19,9],[20,1,20,4],[20,5,20,9],[15,1,15,4],[15,5,15,9],[16,0,17,0],[16,1,17,4],[26,5,26,9],[12,1,12,4],[12,5,12,9],[13,1,13,4],[13,5,13,9],[14,1,14,4],[14,5,14,9],[9,0,10,0],[9,5,10,9],[9,1,10,4],[11,1,11,4],[11,5,11,9],[3,0,3,3],[3,4,3,7],[7,0,7,9],[8,1,8,4],[8,5,8,9]]}
["राजस्थान सरकार"]
[{"$f":"IF(AND(F14>=0,F14<=10),\"पूर्व मैट्रिक छात्रवृत्ति योजनाओं के लिए आवेदन पत्र प्रारूप\",IF(AND(F14>=11,F14<=12),\"उत्तर मैट्रिक छात्रवृत्ति योजनाओं के लिए आवेदन पत्र प्रारूप\",\"\"))","v":"पूर्व मैट्रिक छात्रवृत्ति योजनाओं के लिए आवेदन पत्र प्रारूप"}]
["वर्ष 2025-26"]
["विद्यार्थी की छात्रवृत्ति यूनीक आई.डी.",null,null,null,null,null,null,null,null,null,null,"विधार्थी के SR नंबर डाले "]
["(पूर्ति संस्था प्रधान द्वारा शालादर्पण पोर्टल से की जायेगी)",null,null,null,null,null,null,null,null,null,null,950]
["विद्यालय का नाम",null,null,{"$f":"IFERROR(IF(INDEX('Student Record'!R:R, MATCH(L5, 'Student Record'!C:C, 0))=\"\", \"\", INDEX('Student Record'!R:R, MATCH(L5, 'Student Record'!C:C, 0))), \"\")","v":"GOVT. SENIOR SECONDARY SCHOOL MORAJHADI (214242)"}]
["छात्रवृत्ति योजना का नाम जिसके लिए आवेदन किया जा रहा है |"]
["विद्यार्थी का विवरण"]
[1,"विद्यार्थी का नाम",null,null,null,{"$f":"IFERROR(IF(INDEX('Student Record'!E:E, MATCH(L5, 'Student Record'!C:C, 0))=\"\", \"\", INDEX('Student Record'!E:E, MATCH(L5, 'Student Record'!C:C, 0))), \"\")","v":"NARAJ CHOUDHARY"}]
[2,"जन्म तिथि",null,null,null,{"$f":"IFERROR(IF(INDEX('Student Record'!J:J, MATCH(L5, 'Student Record'!C:C, 0))=\"\", \"\", INDEX('Student Record'!J:J, MATCH(L5, 'Student Record'!C:C, 0))), \"\")","v":"2011-06-07"}]
[]
[3,"धर्म (हिन्दू/मुस्लिम /सिख/ईसाई/ पारसी/बौद्ध/जैन/अन्य)",null,null,null,{"$f":"IFERROR(IF(INDEX('Student Record'!P:P, MATCH(L5, 'Student Record'!C:C, 0))=\"\", \"\", INDEX('Student Record'!P:P, MATCH(L5, 'Student Record'!C:C, 0))), \"\")","v":"Hindu"}]
[4,"लिंग (पुरुष/ महिला/ ट्रांसजेंडर)",null,null,null,{"$f":"IFERROR(IF(INDEX('Student Record'!I:I, MATCH(L5, 'Student Record'!C:C, 0))=\"\", \"\", INDEX('Student Record'!I:I, MATCH(L5, 'Student Record'!C:C, 0))), \"\")","v":"F"}]
[5,"कक्षा जिसमे अध्ययनरत है",null,null,null,{"$f":"IFERROR(IF(INDEX('Student Record'!A:A, MATCH(L5, 'Student Record'!C:C, 0))=\"\", \"\", INDEX('Student Record'!A:A, MATCH(L5, 'Student Record'!C:C, 0))), \"\")","v":8}]
[6,"विद्यार्थी का S.R. नम्बर (विद्यालय द्वारा भरा जाये)",null,null,null,{"$f":"IFERROR(IF(INDEX('Student Record'!C:C, MATCH(L5, 'Student Record'!C:C, 0))=\"\", \"\", INDEX('Student Record'!C:C, MATCH(L5, 'Student Record'!C:C, 0))), \"\")","v":950}]
[7,"गत कक्षा के विद्यालय का नाम व पता "]
[8,"गत वर्ष की कक्षा का क्रमोन्नत प्रमाण पत्र",null,null,null,"कक्षा","पूर्णांक","प्राप्तांक","ग्रेड/प्रतिशत","कक्षा क्रमोन्नत"]
[]
[9,"जाति वर्ग (अजा/अजजा/अन्य पिछड़ा वर्ग/अति पिछड़ा वर्ग/सामान्य/अल्पसंख्यक)",null,null,null,{"$f":"IFERROR(IF(INDEX('Student Record'!O:O, MATCH(L5, 'Student Record'!C:C, 0))=\"\", \"\", INDEX('Student Record'!O:O, MATCH(L5, 'Student Record'!C:C, 0))), \"\")","v":"OBC"}]
[10,"डे-स्कॉलर / होस्टलर"]
[11,"विद्यार्थी का आधार नम्बर/एनरोलमेंट नम्बर "]
[12,"जन-आधार/ एनरोलमेंट नम्बर "]
[13,"छात्र का बैंक खाता जन-आधार कार्ड से लिंक है (हाँ / नहीं)"]
[14,"विद्यार्थी का मोबाइल नम्बर",null,null,null,{"$f":"IFERROR(IF(INDEX('Student Record'!V:V, MATCH(L5, 'Student Record'!C:C, 0))=\"\", \"\", INDEX('Student Record'!V:V, MATCH(L5, 'Student Record'!C:C, 0))), \"\")","v":9925775941}]
[15,"विद्यार्थी का ई-मेल आई.डी."]
["विद्यार्थी के परिवार का विवरण"]
[16,"पिता का नाम",null,null,null,{"$f":"IFERROR(IF(INDEX('Student Record'!G:G, MATCH(L5, 'Student Record'!C:C, 0))=\"\", \"\", INDEX('Student Record'!G:G, MATCH(L5, 'Student Record'!C:C, 0))), \"\")","v":"PARMESHWAR"}]
[17,"माता का नाम",null,null,null,{"$f":"IFERROR(IF(INDEX('Student Record'!H:H, MATCH(L5, 'Student Record'!C:C, 0))=\"\", \"\", INDEX('Student Record'!H:H, MATCH(L5, 'Student Record'!C:C, 0))), \"\")","v":"Amari Devi"}]
[18,"संरक्षक का नाम (माता-पिता के जीवित ना होने पर)"]
[19,"परिवार की वार्षिक आय",null,null,null,{"$f":"IFERROR(IF(INDEX('Student Record'!X:X, MATCH(L5, 'Student Record'!C:C, 0))=\"\", \"\", INDEX('Student Record'!X:X, MATCH(L5, 'Student Record'!C:C, 0))), \"\")","v":40000}]
[20,"स्थाई पता/जिले का नाम / राज्य का नाम",null,null,null,{"$f":"IFERROR(IF(INDEX('Student Record'!W:W, MATCH(L5, 'Student Record'!C:C, 0))=\"\", \"\", INDEX('Student Record'!W:W, MATCH(L5, 'Student Record'!C:C, 0))), \"\")","v":"WARD NO 5,SRINAGAR,TIHARI,305025"}]
[21,"राशन कार्ड नम्बर"]
[22,"क्या विद्यार्थी इस छात्रवृति के अतिरिक्त अन्य किसी संस्था या सरकारी विभाग से कोई सहायता प्राप्त कर रहा है (हां/नहीं) यदि हाँ तो विवरण दे "]
[23,"केवल अस्वच्छकार योजनान्तर्गत अग्रलिखित प्रमाण-पत्र का उल्लेख करें जैसे:- (1) हाथ से मैला ढोने का (2) टेनर और फ्लेयर्स (चर्म एवं चर्मशोध से संबंधित) (3)कचरा बीनने का, (4) जोखिम के कार्यों में लगे होने का"]
["क्र.सं.","योजना के विस्तृत दिशानिर्देशों के अनुसार संलग्न किए जाने वाले दस्तावेज",null,null,null,null,null,null,"संलग्न कर टिक करें"]
[1,"माता-पिता (माता-पिता के जीवित न होने पर संरक्षक) का आय स्वघोषणा-पत्र",null,null,null,null,null,null,{"$f":"IF(A1=\"Yes\", \"☑\", \"☐\")","v":"☐"}]
[2,"छात्र/छात्रा की गत वर्ष की परीक्षा की अकवालिका/ कमोन्नत प्रमाण पत्र (स्वप्रमाणित प्रति) |",null,null,null,null,null,null,{"$f":"IF(A1=\"Yes\", \"☑\", \"☐\")","v":"☐"}]
[3,"विद्यार्थी का स्वयं का जाति प्रमाण-पत्र (स्वप्रमाणित प्रति)",null,null,null,null,null,null,{"$f":"IF(A1=\"Yes\", \"☑\", \"☐\")","v":"☐"}]
[4,"विद्यार्थी की आधार कार्ड तथा जन-आधार / भामाशाह कार्ड (स्वप्रमाणित प्रति)",null,null,null,null,null,null,{"$f":"IF(A1=\"Yes\", \"☑\", \"☐\")","v":"☐"}]
[5,"माता-पिता (माता-पिता के जीवित न होने पर संरक्षक) के सफाई से जुड़े और स्वास्थ्य के लिए जोखिमपूर्ण व्यवसाय में लिप्त होने का प्रमाण-पत्र",null,null,null,null,null,null,{"$f":"IF(A1=\"Yes\", \"☑\", \"☐\")","v":"☐"}]
{"$rows_left_out":15}