{"text_format":"1","workbook":"xlsx","n_sheets":18,"sheets":["Home","Mat Leave","PL","Leave Table","Leave Report","Sheet1","Sheet2","Rules","Leave Print","Blank Format","Data","EOL","Table-Probation","CHART","How to use","DA","Rule","Sheet3"],"not_rendered":{"charts":0,"images":14,"macros":1,"external_links":1,"defined_names":21,"comments":2,"pivot_tables":0},"unopened":[],"bounds":{"document_bytes":16777216,"sheet_cells":100000,"rows_first":2000,"rows_last":500,"rows_between":2000,"halvings":0,"cell_chars":16384,"cell_head_chars":4096},"cells_cut":0,"cells_raw":0,"read":"whole","date_system":"1900"}

{"sheet":"Home","index":0,"n_rows":27,"n_cols":12,"rows_kept":27,"cut":false,"hidden":false,"merged":[[10,2,10,4],[7,11,8,14],[6,0,6,10],[0,1,1,14],[7,1,8,4],[7,6,8,9],[3,1,5,9],[2,0,2,10],[3,11,5,14],[10,6,10,9],[26,1,27,3],[26,5,27,9],[12,11,13,14],[16,11,17,14],[20,11,22,14],[18,1,19,3],[22,1,23,3],[15,5,16,9],[18,5,20,9],[22,5,24,9],[12,1,13,9],[15,1,16,3]]}
[null,"Design & Prepaired by Pravesh Kumar Sharma, Accountant, please call-9460100093 or write mail to  praveshbkn@gmail.com for further query/error/updation/suggestion"]
[]
[]
[null,"Determination of closing balance of Privilege Leave(PL)  at End of Service or any other period",null,null,null,null,null,null,null,null,null,"Home/Back "]
[]
[]
[]
[null," PL Calculation",null,null,null,null,"PL Leave Report",null,null,null,null,"Other Key-Calculation "]
[]
[]
[null,null,"Hint-How to use",null,null,null,"View/Update DA Rate"]
[]
[null,"Prepare Leave application in excel format",null,null,null,null,null,null,null,null,null,"Treatment of Extraordinary leave for Probation-trainees"]
[]
[]
[null,"Input Data",null,null,null,"Fill all the fileds in this sheet. Use proper font and drop down menu, wheres required."]
[null,null,null,null,null,null,null,null,null,null,null,"View EOL order and silent points in tabular format"]
[]
[null,"Print Leave Application",null,null,null,"Use cell \"L1\" for take print based on input data, if any updatation requird, go back to sheet \"Input Data\""]
[]
[null,null,null,null,null,null,null,null,null,null,null,"Calculate Maternity Leave under FD order \nF.1(6)FD(Rules)/2021 dated  23-12-2021"]
[]
[null,"Blank Format",null,null,null,"It is bank format of GA 45 , user may take print with or without fill data ,as required"]
[]
[]
[]
[null,"General Notes on PL (Rules)",null,null,null,"Some useful key points/information"]

{"sheet":"Mat Leave","index":1,"n_rows":13,"n_cols":7,"rows_kept":13,"cut":false,"hidden":false,"merged":[[0,6,0,7],[12,0,12,1],[12,2,12,3],[0,0,1,3],[2,2,4,2],[2,3,4,3],[5,0,5,3],[10,0,10,2]]}
["Calculate Maternity Leave under FD order \nF.1(6)FD(Rules)/2021 dated  23-12-2021",null,null,null,null,null,"Home"]
[]
["Child Birth Date","2021-12-24","Total Meternity Leave allowed in days",180]
["Date of Joining in Service","2022-03-04"]
["Maternity Leave applied on","2022-03-07"]
["Result on bais of input data"]
["Key features","Period Start","Period End","Days"]
["Confinement Period ",{"$f":"B3-15","v":"2021-12-09"},{"$f":"B3-1","v":"2021-12-23"},{"$f":"1+C8-B8","v":15}]
["Age of child (before joining of service)",{"$f":"B3","v":"2021-12-24"},{"$f":"B4-1","v":"2022-03-03"},{"$f":"1+C9-B9","v":70}]
["Maternity Leave applied period",{"$f":"B4","v":"2022-03-04"},{"$f":"B5-1","v":"2022-03-06"},{"$f":"1+C10-B10","v":3}]
["Total reduced period (in days)",null,null,{"$f":"SUM(D8:D10)","v":88}]
["Admissible Meternity Leave Period",{"$f":"B5","v":"2022-03-07"},{"$f":"B12+D12-1","v":"2022-06-06"},{"$f":"D3-D11","v":92}]
["Required date for applied Maternity Leave (before)",null,{"$f":"B4+15-1","v":"2022-03-18"}]

{"sheet":"PL","index":2,"n_rows":222,"n_cols":20,"rows_kept":222,"cut":false,"hidden":false,"merged":[[4,0,4,1],[4,2,4,4],[4,6,4,7],[12,2,12,3],[17,19,18,20],[6,0,6,7],[14,0,14,3],[13,2,13,3],[16,0,18,3],[7,7,8,7],[18,4,18,7],[12,4,12,6],[11,0,11,7],[10,0,10,4],[0,1,0,2],[0,8,0,9],[33,9,34,10],[1,0,2,7],[29,9,30,10],[14,4,14,6],[13,6,13,7],[13,4,13,5],[15,0,15,4],[17,8,20,8],[15,6,15,7],[19,4,19,7],[12,0,12,1],[13,0,13,1],[19,0,19,3],[0,5,0,6]]}
[null,"Home",null,null,null,"PL Leave Report",null,null,"Home"]
["Design & Prepaired by Pravesh Kumar Sharma, Accountant, please call-9460100093 or write mail to  praveshbkn@gmail.com for further query/error/updation/suggestion"]
[]
[]
["Name of Employe",null,"ABCD",null,null,"Designation","AAO"]
[]
["Determination of P.L. before  01-01-1983"]
["Condt.","Employee Department ","Employee Status ","Start Date","End Date","Days count","Earned Leave","Total Privilege Leave"]
["A","Others Deptt","Temporary","1976-01-01","1976-06-30",{"$f":"IF('Leave Table'!L463>1,'Leave Table'!L463,0)","v":182},{"$f":"'Leave Table'!F465","v":8.2727272727272734}]
["B","Others Deptt","Temporary","1976-01-01","1976-01-01",{"$f":"IF('Leave Table'!L471>1,'Leave Table'!L471,0)","v":0},{"$f":"'Leave Table'!F473","v":4.5454545454545456E-2},{"$f":"G9+G10","v":8.3181818181818183}]
["If acutal balance is differ from calculated P.L. balance (fill the bal.  in cell F11 & select condition \"YES\" in cell G11)",null,null,null,null,25,"No",{"$f":"IF(G11=\"YES\",F11,H10)","v":8.3181818181818183}]
["Determination of P.L. on or after 01-01-1983"]
["Leave Start Date",null,"1996-02-20",null,{"$f":"CONCATENATE(\"Opening balance of P.L.(if any) as on \",TEXT(C13,\"dd/mm/yyyy\"))","v":"Opening balance of P.L.(if any) as on 20/02/1996"},null,null,0]
["Leave End Date",null,"2023-08-31",null,"Employee Department (Status)",null,"Others Deptt"]
[null,null,null,null,"Maxi. Leave allowed in one month",null,null,{"$f":"'Leave Table'!M6","v":"2.5  Days "}]
[{"$f":"CONCATENATE(\"Closing Balance of P.L. upto\",\"  \",A14,\"  \",TEXT(C14,\"dd/mm/yyyy\"),\"  \")","v":"Closing Balance of P.L. upto  Leave End Date  31/08/2023  "},null,null,null,null,{"$f":"'Leave Table'!V95","v":315},{"$f":"IF(F16=300,\"(Max Limit)\",\"\")","v":""}]
["Find out total Privilege Leave taken/Surr. Leave/Joining Time/ Leave adjut. enared between two periods (year_year)",null,null,null,"Data Type","From","To","Total"]
[null,null,null,null,"Leave Taken ","1990-A","2023-A",{"$f":"'Leave Table'!BB13","v":0},"Duplicate/ Double entry in PL taken period (from)",null,null,null,null,null,null,null,null,null,null,"Home"]
[null,null,null,null,{"$f":"CONCATENATE(E18,\"  \",\"From\",\"  \",F18,\"  \",\"to\",\" \",G18,\"  \",\"=>>\",\"  \",H18,\" Days\")","v":"Leave Taken   From  1990-A  to 2023-A  =>>  0 Days"}]
["Privilege Leave (PL) Taken Period",null,null,null,"Other Data"]
["S.N.","From","To","No of Days","Object","Period  (Year)","No. of Days","Condition"]
[1,null,null,{"$f":"IF(C22>0,1+C22-B22,\"\")","v":""},null,null,null,null,{"$f":"IFERROR(INDEX($B$22:$B$221,MATCH(0,COUNTIF(I18:I$18,$B$22:$B$221)+IF(COUNTIF($B$22:$B$221,$B$22:$B$221)>1,0,1),0)),\"\")","v":""}]
[{"$f":"IF(B23>0,A22+1,\"\")","v":""},null,null,"",null,null,null,null,{"$f":"IFERROR(INDEX($B$22:$B$221,MATCH(0,COUNTIF(I$18:I22,$B$22:$B$221)+IF(COUNTIF($B$22:$B$221,$B$22:$B$221)>1,0,1),0)),\"\")","v":""},null," "]
["",null,null,"",null,null,null,null,{"$f":"IFERROR(INDEX($B$22:$B$221,MATCH(0,COUNTIF(I$18:I23,$B$22:$B$221)+IF(COUNTIF($B$22:$B$221,$B$22:$B$221)>1,0,1),0)),\"\")","v":""}]
["",null,null,"",null,null,null,null,{"$f":"IFERROR(INDEX($B$22:$B$221,MATCH(0,COUNTIF(I$18:I24,$B$22:$B$221)+IF(COUNTIF($B$22:$B$221,$B$22:$B$221)>1,0,1),0)),\"\")","v":""}]
["",null,null,"",null,null,null,null,{"$f":"IFERROR(INDEX($B$22:$B$221,MATCH(0,COUNTIF(I$18:I25,$B$22:$B$221)+IF(COUNTIF($B$22:$B$221,$B$22:$B$221)>1,0,1),0)),\"\")","v":""}]
["",null,null,"",null,null,null,null,{"$f":"IFERROR(INDEX($B$22:$B$221,MATCH(0,COUNTIF(I$18:I26,$B$22:$B$221)+IF(COUNTIF($B$22:$B$221,$B$22:$B$221)>1,0,1),0)),\"\")","v":""}]
["",null,null,"",null,null,null,null,{"$f":"IFERROR(INDEX($B$22:$B$221,MATCH(0,COUNTIF(I$18:I27,$B$22:$B$221)+IF(COUNTIF($B$22:$B$221,$B$22:$B$221)>1,0,1),0)),\"\")","v":""}]
["",null,null,"",null,null,null,null,{"$f":"IFERROR(INDEX($B$22:$B$221,MATCH(0,COUNTIF(I$18:I28,$B$22:$B$221)+IF(COUNTIF($B$22:$B$221,$B$22:$B$221)>1,0,1),0)),\"\")","v":""}]
["",null,null,"",null,null,null,null,{"$f":"IFERROR(INDEX($B$22:$B$221,MATCH(0,COUNTIF(I$18:I29,$B$22:$B$221)+IF(COUNTIF($B$22:$B$221,$B$22:$B$221)>1,0,1),0)),\"\")","v":""},"Select for clear PL data"]
["",null,null,"",null,null,null,null,{"$f":"IFERROR(INDEX($B$22:$B$221,MATCH(0,COUNTIF(I$18:I30,$B$22:$B$221)+IF(COUNTIF($B$22:$B$221,$B$22:$B$221)>1,0,1),0)),\"\")","v":""}]
["",null,null,"",null,null,null,null,{"$f":"IFERROR(INDEX($B$22:$B$221,MATCH(0,COUNTIF(I$18:I31,$B$22:$B$221)+IF(COUNTIF($B$22:$B$221,$B$22:$B$221)>1,0,1),0)),\"\")","v":""}]
["",null,null,"",null,null,null,null,{"$f":"IFERROR(INDEX($B$22:$B$221,MATCH(0,COUNTIF(I$18:I32,$B$22:$B$221)+IF(COUNTIF($B$22:$B$221,$B$22:$B$221)>1,0,1),0)),\"\")","v":""}]
["",null,null,"",null,null,null,null,"End_Line","Select for clear Other data"]
["",null,null,""]
["",null,null,""]
["",null,null,""]
["",null,null,""]
["",null,null,""]
["",null,null,""]
["",null,null,""]
["",null,null,""]
["",null,null,""]
["",null,null,""]
["",null,null,""]
["",null,null,""]
["",null,null,""]
["",null,null,""]
["",null,null,""]
["",null,null,""]
["",null,null,""]
["",null,null,""]
["",null,null,""]
["",null,null,{"$f":"IF(C54>0,1+C54-B54,\"\")","v":""}]
[{"$f":"IF(B55>0,A54+1,\"\")","v":""},null,null,""]
["",null,null,""]
["",null,null,""]
["",null,null,""]
["",null,null,""]
["",null,null,""]
["",null,null,""]
["",null,null,""]
["",null,null,""]
["",null,null,""]
["",null,null,""]
["",null,null,""]
["",null,null,""]
["",null,null,""]
["",null,null,""]
["",null,null,""]
["",null,null,""]
["",null,null,""]
["",null,null,""]
["",null,null,""]
["",null,null,""]
["",null,null,""]
["",null,null,""]
["",null,null,""]
["",null,null,""]
["",null,null,""]
["",null,null,""]
["",null,null,""]
["",null,null,""]
["",null,null,""]
["",null,null,""]
["",null,null,{"$f":"IF(C86>0,1+C86-B86,\"\")","v":""}]
[{"$f":"IF(B87>0,A86+1,\"\")","v":""},null,null,""]
["",null,null,""]
["",null,null,""]
["",null,null,""]
["",null,null,""]
["",null,null,""]
["",null,null,""]
["",null,null,""]
["",null,null,""]
["",null,null,""]
["",null,null,""]
["",null,null,""]
["",null,null,""]
["",null,null,""]
["",null,null,""]
["",null,null,""]
["",null,null,""]
["",null,null,""]
["",null,null,""]
["",null,null,""]
["",null,null,""]
["",null,null,""]
["",null,null,""]
["",null,null,""]
["",null,null,""]
["",null,null,""]
["",null,null,""]
["",null,null,""]
["",null,null,""]
["",null,null,""]
["",null,null,""]
["",null,null,{"$f":"IF(C118>0,1+C118-B118,\"\")","v":""}]
[{"$f":"IF(B119>0,A118+1,\"\")","v":""},null,null,""]
["",null,null,""]
["",null,null,""]
["",null,null,""]
["",null,null,""]
["",null,null,""]
["",null,null,""]
["",null,null,""]
["",null,null,""]
["",null,null,""]
["",null,null,""]
["",null,null,""]
["",null,null,""]
["",null,null,""]
["",null,null,""]
["",null,null,""]
["",null,null,""]
["",null,null,""]
["",null,null,""]
["",null,null,""]
["",null,null,""]
["",null,null,""]
["",null,null,""]
["",null,null,""]
["",null,null,""]
["",null,null,""]
["",null,null,""]
["",null,null,""]
["",null,null,""]
["",null,null,""]
["",null,null,""]
["",null,null,{"$f":"IF(C150>0,1+C150-B150,\"\")","v":""}]
[{"$f":"IF(B151>0,A150+1,\"\")","v":""},null,null,""]
["",null,null,""]
["",null,null,""]
["",null,null,""]
["",null,null,""]
["",null,null,""]
["",null,null,""]
["",null,null,""]
["",null,null,""]
["",null,null,""]
["",null,null,""]
["",null,null,""]
["",null,null,""]
["",null,null,""]
["",null,null,""]
["",null,null,""]
["",null,null,""]
["",null,null,""]
["",null,null,""]
["",null,null,""]
["",null,null,""]
["",null,null,""]
["",null,null,""]
["",null,null,""]
["",null,null,""]
["",null,null,""]
["",null,null,""]
["",null,null,""]
["",null,null,""]
["",null,null,""]
["",null,null,""]
["",null,null,{"$f":"IF(C182>0,1+C182-B182,\"\")","v":""}]
[{"$f":"IF(B183>0,A182+1,\"\")","v":""},null,null,""]
["",null,null,""]
["",null,null,""]
["",null,null,""]
["",null,null,""]
["",null,null,""]
["",null,null,""]
["",null,null,""]
["",null,null,""]
["",null,null,""]
["",null,null,""]
["",null,null,""]
["",null,null,""]
["",null,null,""]
["",null,null,""]
["",null,null,""]
["",null,null,""]
["",null,null,""]
["",null,null,""]
["",null,null,""]
["",null,null,""]
["",null,null,""]
["",null,null,""]
["",null,null,""]
["",null,null,""]
["",null,null,""]
["",null,null,""]
["",null,null,""]
["",null,null,""]
["",null,null,""]
["",null,null,""]
["",null,null,{"$f":"IF(C214>0,1+C214-B214,\"\")","v":""}]
[{"$f":"IF(B215>0,A214+1,\"\")","v":""},null,null,""]
["",null,null,""]
["",null,null,""]
["",null,null,""]
["",null,null,""]
["",null,null,""]
["",null,null,""]
["End_line","End_line","End_line",{"$f":"SUM(D22:D221)","v":0},"End_line","End_line","End_line","End_line"]

{"sheet":"Leave Table","index":3,"n_rows":473,"n_cols":99,"rows_kept":473,"cut":false,"hidden":true,"merged":[[13,50,13,52],[14,50,14,52],[15,50,15,52],[16,50,16,52],[472,5,472,6],[463,3,463,4],[464,5,464,6],[471,3,471,4],[1,12,2,12],[243,2,243,3],[9,4,9,5],[9,2,9,3],[3,12,4,12],[5,12,5,13],[1,1,1,2],[9,6,9,7]]}
[]
[null,"Leave_Limit",null,"Max_Limit",null,null,"PL_Limit_Deptt","Annual Leave Limit","CODE","Limit",null,"Monthly Leave Limit","Selected",{"$f":"PL!$G$14","v":"Others Deptt"},null,"Calculation of Last day of month",null,null,{"$f":"DATE(YEAR(P4),12,31)","v":"2023-12-31"},{"$f":"S2-$S$4","v":122},{"$f":"IF(T3>=0,S3,S2)","v":"2023-12-31"},"Date of Birth",{"$f":"PL!#REF!","v":{"$error":"#REF!"}},null,null,null,null,null,1,null,null,null,"Start date","Month end date","Days in month","Days diff",0,null,"Start date/code","Closedate","Days diff","Last day of month condt.",null,null,"today",null,null,null,null,null,null,null,null,null,null,null,null,null,null,null,null,null,null,null,null,null,null,null,null,null,null,null,null,null,null,null,null,null,null,null,null,null,null,null,null,null,null,null,null,null,null,null,null,"Last name","Middle name","First name"]
[null,"1951-04-01","1991-12-31",180,180,180,"Judicial Deptt.",12,"A",{"$f":"TODAY()","v":"2023-05-08"},12,{"$f":"H3/12","v":1},null,{"$f":"INDEX($I$3:$I$6,MATCH($N$2,PL_Limit_Deptt,0))","v":"B"},null,"Start date","month",null,{"$f":"EOMONTH(S2,-6)","v":"2023-06-30"},{"$f":"S3-$S$4","v":-62},null,"Date of Rite.",{"$f":"IF(DAY(W2)>1,DATE(YEAR(W2)+60,MONTH(W2),DAY(EOMONTH(W2,0))),DATE(YEAR(W2)+60,MONTH(W2),DAY(W2)))","v":{"$error":"#REF!"}},null,null,{"$f":"B12","v":"1996-02-20"},{"$f":"INDEX($AJ$7:$AJ$18,MATCH(MONTH(Z3),$AG$7:$AG$18,0))-(EOMONTH(Z3,0)-Z3+1)","v":18},{"$f":"(EOMONTH(Z3,0)-Z3+1)","v":"1900-01-10"},2,null,null,null,{"$f":"D11","v":"1996-02-20"},{"$f":"EOMONTH(AG3,0)","v":"1996-02-29"},{"$f":"MONTH(AH3)","v":2},{"$f":"IF(AH3>B10,B10-AG3+1,AH3-AG3+1)","v":10},{"$f":"IFERROR(DATEDIF(B12,C12,\"M\"),\"\")","v":4},null,{"$f":"AG3","v":"1996-02-20"},{"$f":"E7","v":"1996-06-30"},{"$f":"AN3-AM3+1","v":132},{"$f":"IF(AM5=AM6,\"YES\",\"NO\")","v":"NO"},{"$f":"IF(AM6>1,TRUNC(AO3/31,0),TRUNC(AO3/30,0))","v":4},null,{"$f":"TODAY()","v":"2023-05-08"},null,null,null,null,null,null,null,null,null,null,null,null,null,null,null,null,null,null,null,null,null,null,null,null,null,null,null,null,null,null,null,null,null,null,null,null,null,null,null,null,null,null,null,null,null,null,null,null,"PL_YEAR","PL_DAYS","PL_TYPE","Last name","Middle name","First name"]
[null,"1992-01-01","1997-12-31",240,240,240,"R.A.C Deptt",42,"B",{"$f":"TODAY()","v":"2023-05-08"},42,{"$f":"H4/12","v":3.5},"Leave limit",{"$f":"INDEX($H$3:$H$6,MATCH(N2,PL_Limit_Deptt,0))","v":30},null,{"$f":"B10","v":"2023-08-31"},{"$f":"EOMONTH(P4,-6)","v":"2023-02-28"},null,{"$f":"P4","v":"2023-08-31"},{"$f":"S4-$S$4","v":0},null,null,null,null,null,{"$f":"B13","v":"1996-07-01"},{"$f":"INDEX($AJ$7:$AJ$18,MATCH(MONTH(Z4),$AG$7:$AG$18,0))","v":31},{"$f":"N12","v":10},3,null,null,null,{"$f":"IF(OR(MOD(AG3,400)=0,AND(MOD(AG3,4)=0,MOD(AG3,100)<>0)),\"Leap Year\", \"NOT a Leap Year\")","v":"NOT a Leap Year"},{"$f":"AJ4/4","v":4.5},{"$f":"INDEX(AJ7:AJ18,MATCH(MONTH(AH3),AG7:AG18,0))","v":28},{"$f":"AI4-AJ3","v":18},{"$f":"IF(AJ4>0,AK3,AK3+1)","v":4},"Month Code",{"$f":"MONTH(AM3)","v":2},{"$f":"MONTH(AN3)","v":6},{"$f":"AO3-AK4*AM5","v":20},null,null,null,null,null,null,null,null,null,null,null,null,null,null,null,null,null,null,null,null,null,null,null,null,null,null,null,null,null,null,null,null,null,null,null,null,null,null,null,null,null,null,null,null,null,null,null,null,null,null,null,1,{"$f":"INDEX($BK$12:$BK$56,MATCH(ROWS($CO$4:CO4),$CO$4:$CO$48,0))","v":""},{"$f":"INDEX($BN$12:$BN$56,MATCH(ROWS($CO$4:CP4),$CO$4:$CO$48,0))","v":0},{"$f":"INDEX($BJ$12:$BJ$56,MATCH(ROWS($CO$4:CQ4),$CO$4:$CO$48,0))","v":""},{"$f":"CP4","v":""},{"$f":"CQ4","v":0},{"$f":"CR4","v":""}]
[null,"1998-01-01","2012-12-31",300,300,300,"Vacation Deptt",15,"A","1993-12-31",8,{"$f":"H5/12","v":1.25},null,{"$f":"INDEX($L$3:$L$6,MATCH(N2,PL_Limit_Deptt,0))","v":2.5},null,null,null,null,null,null,null,null,null,null,null,null,null,{"$f":"N13","v":15},4,null,null,null,{"$f":"IF(AG4=\"Leap Year\",1,0)","v":0},{"$f":"IF(AG5>0,\"NO\",\"YES\")","v":"YES"},null,"Diff in year",null,"Days in Month",{"$f":"INDEX($AJ$7:$AJ$18,MATCH(MONTH(AM3),$AG$7:$AG$18,0))","v":28},{"$f":"INDEX($AJ$7:$AJ$18,MATCH(MONTH(AN3),$AG$7:$AG$18,0))","v":30},{"$f":"IF(AO4>0,\"YES\",\"NO\")","v":"YES"},null,"IF(AL3>=AI7,IFERROR(DATEDIF(AI3,AJ3,\"M\")+1,\"\"),",null,null,null,null,null,null,null,null,null,null,null,null,null,null,null,null,null,null,null,null,null,null,null,null,null,null,null,null,null,null,null,null,null,null,null,null,null,null,null,null,null,null,null,null,null,null,null,null,null,2,{"$f":"INDEX($BK$12:$BK$56,MATCH(ROWS($CO$4:CO5),$CO$4:$CO$48,0))","v":""},{"$f":"INDEX($BN$12:$BN$56,MATCH(ROWS($CO$4:CP5),$CO$4:$CO$48,0))","v":0},{"$f":"INDEX($BJ$12:$BJ$56,MATCH(ROWS($CO$4:CQ5),$CO$4:$CO$48,0))","v":""},"",0,""]
[null,"2013-01-01",null,315,300,300,"Others Deptt",30,"B",{"$f":"TODAY()","v":"2023-05-08"},30,{"$f":"H6/12","v":2.5},{"$f":"CONCATENATE(N5,\"  \",\"Days\", \" \")","v":"2.5  Days "},null,null,"start date",{"$f":"D11","v":"1996-02-20"},null,null,"2019-01-01",305,null,null,null,null,null,null,{"$f":"N14","v":15},5,null,null,null,"Month code","Month code","Month name","Day-end","Day-calculted","Count of Days",{"$f":"DAY(AM3)","v":20},{"$f":"DAY(AN3)","v":30},{"$f":"INDEX($AJ$7:$AJ$18,MATCH(MONTH(AM3),$AG$7:$AG$18,0))-(EOMONTH(AM3,0)-AM3+1)","v":18},{"$f":"INDEX($AJ$7:$AJ$18,MATCH(MONTH(AN3),$AG$7:$AG$18,0))-(EOMONTH(AN3,0)-AN3+1)","v":29},null,null,null,null,null,null,null,null,null,null,null,null,null,null,null,null,null,null,null,null,null,null,null,null,null,null,null,null,null,null,null,null,null,null,null,null,null,null,null,null,null,null,null,null,null,null,null,null,null,null,3,{"$f":"INDEX($BK$12:$BK$56,MATCH(ROWS($CO$4:CO6),$CO$4:$CO$48,0))","v":""},{"$f":"INDEX($BN$12:$BN$56,MATCH(ROWS($CO$4:CP6),$CO$4:$CO$48,0))","v":0},{"$f":"INDEX($BJ$12:$BJ$56,MATCH(ROWS($CO$4:CQ6),$CO$4:$CO$48,0))","v":""},"",0,""]
[null,null,{"$f":"DATE(YEAR(D11),12,31)","v":"1996-12-31"},{"$f":"C7-$C$9","v":315},{"$f":"IF(D8>0,C8,C7)","v":"1996-06-30"},null,null,null,null,null,null,null,null,{"$f":"IFERROR(E39,\"NO\")","v":"YES"},null,"Limit date",null,null,null,"2019-07-01",15,null,null,null,null,null,null,{"$f":"N15","v":15},6,null,null,null,1,"01","January",31,{"$f":"AJ18","v":31},"Worked Days",{"$f":"AM5-AM6+1","v":9},{"$f":"AN6","v":30},null,null,"Leaf Year Condt",null,null,null,null,null,null,null,null,null,null,null,null,null,null,null,null,null,null,null,null,null,null,null,null,null,null,null,null,null,null,null,null,null,null,null,null,null,null,null,null,null,null,null,null,null,null,null,null,null,4,{"$f":"INDEX($BK$12:$BK$56,MATCH(ROWS($CO$4:CO7),$CO$4:$CO$48,0))","v":""},{"$f":"INDEX($BN$12:$BN$56,MATCH(ROWS($CO$4:CP7),$CO$4:$CO$48,0))","v":0},{"$f":"INDEX($BJ$12:$BJ$56,MATCH(ROWS($CO$4:CQ7),$CO$4:$CO$48,0))","v":""},"",0,""]
[null,null,{"$f":"EOMONTH(C7,-6)","v":"1996-06-30"},{"$f":"C8-$C$9","v":131},null,null,null,null,null,null,null,null,null,null,null,null,null,null,null,"2019-07-02",-30,null,null,null,null,null,null,null,7,null,null,null,2,"02","February",{"$f":"IF(AG4=\"Leap Year\",29,28)","v":28},{"$f":"AJ7","v":31},"Month Diff",{"$f":"IFERROR(DAY(AM3),\"\")","v":20},{"$f":"IFERROR(DATEDIF(AM3,AN3,\"M\"),\"\")","v":4},{"$f":"IF(AM9=\"NO\",AN8,IF(AP3=\"YES\",AN8+1,TRUNC(AO3/30,0)))","v":4},{"$f":"MAX($AN$8,$AO$8,$AQ$3)","v":4},{"$f":"IF(AG4=\"Leap Year\",AP8,IF(AM8<=AM5,AP8+1,AP8))","v":5},null,null,null,null,null,null,null,null,null,null,null,null,null,null,null,null,null,null,null,null,null,null,null,null,null,null,null,null,null,null,null,null,null,null,null,null,null,null,null,null,null,null,null,null,null,null,null,null,null,5,{"$f":"INDEX($BK$12:$BK$56,MATCH(ROWS($CO$4:CO8),$CO$4:$CO$48,0))","v":""},{"$f":"INDEX($BN$12:$BN$56,MATCH(ROWS($CO$4:CP8),$CO$4:$CO$48,0))","v":0},{"$f":"INDEX($BJ$12:$BJ$56,MATCH(ROWS($CO$4:CQ8),$CO$4:$CO$48,0))","v":""},"",0,""]
[null,null,{"$f":"D11","v":"1996-02-20"},{"$f":"C9-$C$9","v":0},null,null,null,null,null,{"$f":"MONTH(H86)","v":{"$error":"#VALUE!"}},null,null,null,null,null,null,null,null,null,null,{"$f":"SUM(U6:U8)","v":290},null,null,null,null,null,null,null,8,null,null,null,3,"03","March",31,28,null,{"$f":"IF(AM7-AM5=0,\"YES\",\"NO\")","v":"NO"},{"$f":"IF(AN7>=0,\"YES\",\"NO\")","v":"YES"},null,null,null,null,null,null,null,null,null,null,null,null,null,null,null,null,null,null,null,null,null,null,null,null,null,null,null,null,null,null,null,null,null,null,null,null,null,null,null,null,null,null,null,null,null,null,null,null,null,null,null,null,6,{"$f":"INDEX($BK$12:$BK$56,MATCH(ROWS($CO$4:CO9),$CO$4:$CO$48,0))","v":""},{"$f":"INDEX($BN$12:$BN$56,MATCH(ROWS($CO$4:CP9),$CO$4:$CO$48,0))","v":0},{"$f":"INDEX($BJ$12:$BJ$56,MATCH(ROWS($CO$4:CQ9),$CO$4:$CO$48,0))","v":""},"",0,""]
[null,{"$f":"PL!C14","v":"2023-08-31"},"Base End Period",null,"End Period Condition",null,"Final Period",null,null,null,null,null,null,null,"Opening Balance",null,null,{"$f":"IF(PL!H13>0,PL!$H$13,0)","v":0},"Max. Limit",300,{"$f":"VLOOKUP(D11,$B$3:$D$6,3)","v":240},null,null,null,null,null,null,null,9,null,null,null,4,"04","April",30,31,null,null,null,null,null,null,{"$f":"EOMONTH(AM5,0)-AM5+1","v":4},{"$f":"EOMONTH(AN5,0)-AN5+1","v":2},null,null,null,null,null,null,null,null,null,null,null,{"$f":"INDEX($BH$12:$BH$56,MATCH(ROWS($BH10:BH$12),COUNTIF($BH$12:$BH$56,\"<=\"&$BH$12:$BH$56),0))","v":{"$error":"#N/A"}},null,null,null,null,null,null,null,null,null,null,null,null,null,null,null,null,null,null,null,null,null,null,null,null,null,null,null,null,null,null,null,null,null,null,null,7,{"$f":"INDEX($BK$12:$BK$56,MATCH(ROWS($CO$4:CO10),$CO$4:$CO$48,0))","v":""},{"$f":"INDEX($BN$12:$BN$56,MATCH(ROWS($CO$4:CP10),$CO$4:$CO$48,0))","v":0},{"$f":"INDEX($BJ$12:$BJ$56,MATCH(ROWS($CO$4:CQ10),$CO$4:$CO$48,0))","v":""},"",0,""]
[null,"Base Start Period",{"$f":"U2","v":"2023-12-31"},{"$f":"B12","v":"1996-02-20"},{"$f":"YEAR(C11)","v":2023},null,"Start_Period","End_Period",null,null,null,"Days Gap","Opening Bal.","Earned Leave","Leave_Base_Year_PL","Leave Taken in Year","Surrender Leave","Joining Time","Leave Adjustment","Closing Balance (A)","Maxi Leave Limit","Closing Balance (B)","Days in Start Month","Days in End month","Days Gaps","No of Months between dates","Condtion (A)","Condtion (B)","Earn limit for Vactional","Max Limit Tracker",null,null,5,"05","May",31,30,null,null,null,null,null,null,null,null,null,null,null,null,null,"FIND OUT LEAVE (TYPE) TAKEN IN PARTICULAR PERIOD",null,null,null,"Code","Object",null,"Update date","First base date for regular incre.","Code","Code","Object","Period  (Year)","No. of Days","Condition","Process",null,null,null,null,null,null,null,null,null,null,null,null,null,null,null,null,null,null,null,null,null,null,null,null,null,null,8,{"$f":"INDEX($BK$12:$BK$56,MATCH(ROWS($CO$4:CO11),$CO$4:$CO$48,0))","v":""},{"$f":"INDEX($BN$12:$BN$56,MATCH(ROWS($CO$4:CP11),$CO$4:$CO$48,0))","v":0},{"$f":"INDEX($BJ$12:$BJ$56,MATCH(ROWS($CO$4:CQ11),$CO$4:$CO$48,0))","v":""},"",0,""]
[null,{"$f":"PL!C13","v":"1996-02-20"},{"$f":"E7","v":"1996-06-30"},{"$f":"SMALL(IF(($C$11:$C$94<=$C$11)*($C$11:$C$94>=$D$11),$C$11:$C$94,\"A\"),ROW(A1))","v":"1996-06-30"},{"$f":"IF($C$11>=D12,\"YES\",\"NO\")","v":"YES"},{"$f":"IFERROR(E12,\"NO\")","v":"YES"},{"$f":"B12","v":"1996-02-20"},{"$f":"IF(F12=\"YES\",D12,$C$11)","v":"1996-06-30"},{"$f":"YEAR(G12)","v":1996},{"$f":"IF(I12=\"\",\"\",IF(MONTH(H12)>6,\"B\",\"A\"))","v":"A"},{"$f":"CONCATENATE(I12,\"-\",J12)","v":"1996-A"},{"$f":"IF(E12=\"YES\",1+H12-G12,H12-G12)","v":132},null,{"$f":"IF(F12=\"NO\",\"\",IF(L12>0,IF(W12>0,Z12*$N$5,AA12*$N$5)))","v":10},{"$f":"IF(F12=\"NO\",\"\",K12)","v":"1996-A"},{"$f":"INDEX($L$452:$BD$452,MATCH(O12,$L$453:$BD$453,0))","v":0},{"$f":"IF(O12=\"\",\"\",IF(ISERROR(MATCH(O12,$AL$19:$AL$56,0)),0,VLOOKUP(O12,$AL$19:$AV$56,2,0)))","v":0},{"$f":"IF(ISERROR(MATCH(O12,$AP$19:$AP$56,0)),0,VLOOKUP(O12,$AP$19:$AV$56,2,0))","v":0},{"$f":"IF(H12=\"\",\"\",IF(ISERROR(MATCH(O12,$AT$19:$AT$56,0)),0,VLOOKUP(O12,$AT$19:$AV$56,2,0)))","v":0},{"$f":"IF(H12=\"\",0,N12-P12-Q12+R12+S12+R10)","v":10},{"$f":"IF($N$3=\"A\",VLOOKUP(B12,$B$3:$E$6,4),VLOOKUP(B12,$B$3:$D$6,3))","v":240},{"$f":"MIN(T12,U10)","v":10},{"$f":"IF(B12=\"\",\"\",INDEX($AJ$7:$AJ$18,MATCH(MONTH(B12),$AG$7:$AG$18,0))-(EOMONTH(B12,0)-B12))","v":19},{"$f":"EOMONTH(C12,0)-C12","v":0},{"$f":"IF(X12>0,TRUNC((L12-DAY(C12))/30,0),Z12+1)","v":5},{"$f":"AP8","v":4},{"$f":"IF(AO5=\"YES\",AQ8,AP8)","v":5},null,{"$f":"IF($N$2=\"Vacation Deptt\",IF($J$5>B12,$K$5,$H$5))","v":false},{"$f":"IF(B12=\"\",\"\",IF(M12>=U12,\"YES\",\"NO\"))","v":"NO"},null,null,6,"06","June",30,31,"PL_TYPE","Surrender Leave",null,null,"PL_TYPE","Joining Time",null,null,"PL_TYPE","Leave Adjustment",null,null,null,"Start Year",{"$f":"PL!F18","v":"1990-A"},null,{"$f":"PL!E18","v":"Leave Taken "},1,"Surrender Leave",{"$f":"COUNTIF($BH$12:$BH$57,\"<=\"&BH12)","v":45},{"$f":"SMALL($BH$12:$BH$22,ROW(A7))","v":{"$error":"#N/A"}},{"$f":"--ISERROR(BH12)","v":1},{"$f":"INDEX($BC$12:$BC$14,MATCH(BJ12,$BD$12:$BD$14,0))","v":{"$error":"#N/A"}},{"$f":"IF(BJ12=\"\",\"\",INDEX($BC$12:$BC$14,MATCH(BJ12,$BD$12:$BD$14,0)))","v":""},{"$f":"IF(PL!E22=\"\",\"\",PL!E22)","v":""},{"$f":"IF(PL!F22=\"\",\"\",PL!F22)","v":""},{"$f":"IF(PL!G22=\"\",\"\",PL!G22)","v":""},{"$f":"IF(PL!H22=\"\",\"\",PL!H22)","v":""},{"$f":"IF(BM12=\"Yes\",BL12,0)","v":0},null,null,null,null,null,null,null,null,null,null,null,null,null,null,null,null,null,null,null,null,null,null,null,null,null,null,9,{"$f":"INDEX($BK$12:$BK$56,MATCH(ROWS($CO$4:CO12),$CO$4:$CO$48,0))","v":""},{"$f":"INDEX($BN$12:$BN$56,MATCH(ROWS($CO$4:CP12),$CO$4:$CO$48,0))","v":0},{"$f":"INDEX($BJ$12:$BJ$56,MATCH(ROWS($CO$4:CQ12),$CO$4:$CO$48,0))","v":""},"",0,""]
[null,{"$f":"IF(C12=\"\",\"\",IF($B$10=C12,\"\",C12+1))","v":"1996-07-01"},{"$f":"IF(B13=\"\",\"\",IF(EOMONTH(B13,5)>$B$10,$B$10,IF($N$3=\"B\",(EOMONTH(B13,5)),(EOMONTH(B13,5)))))","v":"1996-12-31"},{"$f":"IF(B13=\"\",\"\",SMALL(IF(($C$11:$C$94<=$C$11)*($C$11:$C$94>=$D$11),$C$11:$C$94,\"A\"),ROW(A2)))","v":"1996-12-31"},"YES","YES",{"$f":"B13","v":"1996-07-01"},{"$f":"IF(G13=\"\",\"\",IF(F13=\"YES\",D13,$C$11))","v":"1996-12-31"},{"$f":"IF(H13=\"\",\"\",YEAR(G13))","v":1996},{"$f":"IF(I13=\"\",\"\",IF(MONTH(H13)>6,\"B\",\"A\"))","v":"B"},"1996-B",{"$f":"IF(F13=\"NO\",\"\",IF(E13=\"YES\",1+H13-G13,H13-G13))","v":184},{"$f":"IF(L13=\"\",\"\",IF(V12>300,V12,MIN($T$10,V12)))","v":10},{"$f":"IF(F13=\"NO\",\"\",IF(L13>0,MIN(AC13,MAX(Y13:Z13)*$N$5)))","v":15},"1996-B",{"$f":"IF(F13=\"NO\",\"\",IF(L12>0,INDEX($M$452:$CO$452,MATCH(O13,$M$453:$CO$453,0))))","v":0},0,0,0,{"$f":"IF(F13=\"NO\",0,IF(AD13=\"YES\",M13-P13-Q13+R13+S13,M13+N13-P13-Q13+R13+S13))","v":25},{"$f":"IF($N$3=\"A\",VLOOKUP(B13,$B$3:$E$6,4),VLOOKUP(B13,$B$3:$D$6,3))","v":240},{"$f":"IF(F13=\"NO\",\"\",MIN(T13:U13))","v":25},{"$f":"IF(B13=\"\",\"\",INDEX($AJ$7:$AJ$18,MATCH(MONTH(B13),$AG$7:$AG$18,0))-(EOMONTH(B13,0)-B13+1))","v":0},{"$f":"EOMONTH(C13,0)-C13","v":0},{"$f":"IF(X13>0,TRUNC((L13-DAY(C13))/30,0),Z13+1)","v":6},{"$f":"IFERROR(DATEDIF(B13,C13,\"M\"),\"\")","v":5},{"$f":"IF(Y13>=X13,\"YES\",\"NO\")","v":"YES"},{"$f":"IF(AA13=\"YES\",Z13+1,Z13)","v":6},{"$f":"IF($N$2=\"Vacation Deptt\",IF($J$5>B13,$K$5,$H$5))","v":false},"NO",null,null,7,"07","July",31,30,"PL_DAYS",null,null,null,"PL_DAYS",null,null,null,"PL_DAYS",null,null,null,null,"End Year",{"$f":"PL!G18","v":"2023-A"},null,{"$f":"INDEX(BB14:BB17,MATCH(BB12,AY14:AY17,0))","v":0},2,"Joining Time",45,{"$f":"SMALL($BH$12:$BH$22,ROW(A10))","v":{"$error":"#N/A"}},1,{"$error":"#N/A"},"",{"$f":"IF(PL!E23=\"\",\"\",PL!E23)","v":""},{"$f":"IF(PL!F23=\"\",\"\",PL!F23)","v":""},{"$f":"IF(PL!G23=\"\",\"\",PL!G23)","v":""},{"$f":"IF(PL!H23=\"\",\"\",PL!H23)","v":""},0,null,null,null,null,null,null,null,null,null,null,null,null,null,null,null,null,null,null,null,null,null,null,null,null,null,null,10,{"$f":"INDEX($BK$12:$BK$56,MATCH(ROWS($CO$4:CO13),$CO$4:$CO$48,0))","v":""},{"$f":"INDEX($BN$12:$BN$56,MATCH(ROWS($CO$4:CP13),$CO$4:$CO$48,0))","v":0},{"$f":"INDEX($BJ$12:$BJ$56,MATCH(ROWS($CO$4:CQ13),$CO$4:$CO$48,0))","v":""},"",0,""]
[null,{"$f":"IF(C13=\"\",\"\",IF($B$10=C13,\"\",C13+1))","v":"1997-01-01"},{"$f":"IF(B14=\"\",\"\",IF(EOMONTH(B14,5)>=$B$10,$B$10,IF($N$3=\"B\",(EOMONTH(B14,5)),IF(EOMONTH(B14,11)>$B$10,$B$10,(EOMONTH(B14,11))))))","v":"1997-06-30"},"1997-06-30","YES","YES",{"$f":"B14","v":"1997-01-01"},{"$f":"IF(G14=\"\",\"\",IF(F14=\"YES\",D14,$C$11))","v":"1997-06-30"},{"$f":"IF(H14=\"\",\"\",YEAR(G14))","v":1997},{"$f":"IF(I14=\"\",\"\",IF(MONTH(H14)>6,\"B\",\"A\"))","v":"A"},"1997-A",181,25,15,"1997-A",0,0,0,0,40,{"$f":"IF($N$3=\"A\",VLOOKUP(B14,$B$3:$E$6,4),VLOOKUP(B14,$B$3:$D$6,3))","v":240},{"$f":"IF(F14=\"NO\",\"\",MIN(T14:U14))","v":40},0,{"$f":"IF(B14=\"\",\"\",EOMONTH(C14,0)-C14)","v":0},{"$f":"IF(X14>0,TRUNC((L14-DAY(C14))/30,0),Z14+1)","v":6},{"$f":"IFERROR(DATEDIF(B14,C14,\"M\"),\"\")","v":5},{"$f":"IF(B14=\"\",\"\",IF(Y14>=X14,\"YES\",\"NO\"))","v":"YES"},{"$f":"IF(B14=\"\",\"\",IF(AA14=\"YES\",Z14+1,Z14))","v":6},false,"NO",null,null,8,"08","August",31,31,"PL_YEAR",null,null,null,"PL_YEAR",null,null,null,"PL_YEAR",null,null,null,null,"Surrender Leave",null,null,{"$f":" SUMPRODUCT(--(Leave_Base_Year_PL>=$AZ$12), --($AZ$13>=Leave_Base_Year_PL),$Q$12:$Q$94)","v":0},3,"Leave Adjustment",45,{"$f":"SMALL($BH$12:$BH$22,ROW(#REF!))","v":{"$error":"#REF!"}},1,{"$error":"#N/A"},"",{"$f":"IF(PL!E24=\"\",\"\",PL!E24)","v":""},{"$f":"IF(PL!F24=\"\",\"\",PL!F24)","v":""},{"$f":"IF(PL!G24=\"\",\"\",PL!G24)","v":""},{"$f":"IF(PL!H24=\"\",\"\",PL!H24)","v":""},0,null,null,null,null,null,null,null,null,null,null,null,null,null,null,null,null,null,null,null,null,null,null,null,null,null,null,11,{"$f":"INDEX($BK$12:$BK$56,MATCH(ROWS($CO$4:CO14),$CO$4:$CO$48,0))","v":""},{"$f":"INDEX($BN$12:$BN$56,MATCH(ROWS($CO$4:CP14),$CO$4:$CO$48,0))","v":0},{"$f":"INDEX($BJ$12:$BJ$56,MATCH(ROWS($CO$4:CQ14),$CO$4:$CO$48,0))","v":""},"",0,""]
[null,"1997-07-01","1997-12-31","1997-12-31","YES","YES","1997-07-01","1997-12-31",1997,"B","1997-B",184,40,15,"1997-B",0,0,0,0,55,240,55,0,0,{"$f":"IF(B15=\"\",\"\",IF(X15>0,TRUNC((L15-DAY(C15))/30,0),Z15+1))","v":6},{"$f":"IFERROR(DATEDIF(B15,C15,\"M\"),\"\")","v":5},{"$f":"IF(B15=\"\",\"\",IF(Y15>=X15,\"YES\",\"NO\"))","v":"YES"},{"$f":"IF(B15=\"\",\"\",IF(AA15=\"YES\",Z15+1,Z15))","v":6},false,"NO",null,null,9,"09","September",30,31,null,null,null,null,null,null,null,null,null,null,null,null,null,"Joining Time",null,null,{"$f":" SUMPRODUCT(--(Leave_Base_Year_PL>=$AZ$12), --($AZ$13>=Leave_Base_Year_PL),$R$12:$R$94)","v":0},null,null,45,{"$f":"SMALL($BH$12:$BH$22,ROW(A12))","v":{"$error":"#N/A"}},1,{"$error":"#N/A"},"",{"$f":"IF(PL!E25=\"\",\"\",PL!E25)","v":""},{"$f":"IF(PL!F25=\"\",\"\",PL!F25)","v":""},{"$f":"IF(PL!G25=\"\",\"\",PL!G25)","v":""},{"$f":"IF(PL!H25=\"\",\"\",PL!H25)","v":""},0,null,null,null,null,null,null,null,null,null,null,null,null,null,null,null,null,null,null,null,null,null,null,null,null,null,null,12,{"$f":"INDEX($BK$12:$BK$56,MATCH(ROWS($CO$4:CO15),$CO$4:$CO$48,0))","v":""},{"$f":"INDEX($BN$12:$BN$56,MATCH(ROWS($CO$4:CP15),$CO$4:$CO$48,0))","v":0},{"$f":"INDEX($BJ$12:$BJ$56,MATCH(ROWS($CO$4:CQ15),$CO$4:$CO$48,0))","v":""},"",0,""]
[null,"1998-01-01","1998-06-30","1998-06-30","YES","YES","1998-01-01","1998-06-30",1998,"A","1998-A",181,55,15,"1998-A",0,0,0,0,70,300,70,0,0,6,{"$f":"IFERROR(DATEDIF(B16,C16,\"M\"),\"\")","v":5},"YES",6,false,"NO",null,null,10,10,"October",31,30,null,null,null,null,null,null,null,null,null,null,null,null,null,"Leave Adjustment",null,null,{"$f":" SUMPRODUCT(--(Leave_Base_Year_PL>=$AZ$12), --($AZ$13>=Leave_Base_Year_PL),$S$12:$S$94)","v":0},null,null,45,{"$error":"#N/A"},1,{"$error":"#N/A"},"",{"$f":"IF(PL!E26=\"\",\"\",PL!E26)","v":""},{"$f":"IF(PL!F26=\"\",\"\",PL!F26)","v":""},{"$f":"IF(PL!G26=\"\",\"\",PL!G26)","v":""},{"$f":"IF(PL!H26=\"\",\"\",PL!H26)","v":""},0,null,null,null,null,null,null,null,null,null,null,null,null,null,null,null,null,null,null,null,null,null,null,null,null,null,null,13,{"$f":"INDEX($BK$12:$BK$56,MATCH(ROWS($CO$4:CO16),$CO$4:$CO$48,0))","v":""},{"$f":"INDEX($BN$12:$BN$56,MATCH(ROWS($CO$4:CP16),$CO$4:$CO$48,0))","v":0},{"$f":"INDEX($BJ$12:$BJ$56,MATCH(ROWS($CO$4:CQ16),$CO$4:$CO$48,0))","v":""},"",0,""]
[null,"1998-07-01","1998-12-31","1998-12-31","YES","YES","1998-07-01","1998-12-31",1998,"B","1998-B",184,70,15,"1998-B",0,0,0,0,85,300,85,0,0,6,5,"YES",6,false,"NO",null,null,11,11,"November",30,31,"Search results",null,null,null,"Search results",null,null,null,"Search results",null,null,null,null,"Leave Taken ",null,null,{"$f":" SUMPRODUCT(--(Leave_Base_Year_PL>=$AZ$12), --($AZ$13>=Leave_Base_Year_PL),$P$12:$P$94)","v":0},null,null,45,{"$error":"#N/A"},1,{"$error":"#N/A"},"",{"$f":"IF(PL!E27=\"\",\"\",PL!E27)","v":""},{"$f":"IF(PL!F27=\"\",\"\",PL!F27)","v":""},{"$f":"IF(PL!G27=\"\",\"\",PL!G27)","v":""},{"$f":"IF(PL!H27=\"\",\"\",PL!H27)","v":""},0,null,null,null,null,null,null,null,null,null,null,null,null,null,null,null,null,null,null,null,null,null,null,null,null,null,null,14,{"$f":"INDEX($BK$12:$BK$56,MATCH(ROWS($CO$4:CO17),$CO$4:$CO$48,0))","v":""},{"$f":"INDEX($BN$12:$BN$56,MATCH(ROWS($CO$4:CP17),$CO$4:$CO$48,0))","v":0},{"$f":"INDEX($BJ$12:$BJ$56,MATCH(ROWS($CO$4:CQ17),$CO$4:$CO$48,0))","v":""},"",0,""]
[null,"1999-01-01","1999-06-30","1999-06-30","YES","YES","1999-01-01","1999-06-30",1999,"A","1999-A",181,85,15,"1999-A",0,0,0,0,100,300,100,0,0,6,5,"YES",6,false,"NO",null,null,12,12,"December",31,30,"PL_YEAR","PL_DAYS","PL_TYPE","Row","PL_YEAR","PL_DAYS","PL_TYPE","Row","PL_YEAR","PL_DAYS","PL_TYPE","Row",null,null,null,null,null,null,null,45,{"$error":"#N/A"},1,{"$error":"#N/A"},"",{"$f":"IF(PL!E28=\"\",\"\",PL!E28)","v":""},{"$f":"IF(PL!F28=\"\",\"\",PL!F28)","v":""},{"$f":"IF(PL!G28=\"\",\"\",PL!G28)","v":""},{"$f":"IF(PL!H28=\"\",\"\",PL!H28)","v":""},0,null,null,null,null,null,null,null,null,null,null,null,null,null,null,null,null,null,null,null,null,null,null,null,null,null,null,15,{"$f":"INDEX($BK$12:$BK$56,MATCH(ROWS($CO$4:CO18),$CO$4:$CO$48,0))","v":""},{"$f":"INDEX($BN$12:$BN$56,MATCH(ROWS($CO$4:CP18),$CO$4:$CO$48,0))","v":0},{"$f":"INDEX($BJ$12:$BJ$56,MATCH(ROWS($CO$4:CQ18),$CO$4:$CO$48,0))","v":""},"",0,""]
[null,"1999-07-01","1999-12-31","1999-12-31","YES","YES","1999-07-01","1999-12-31",1999,"B","1999-B",184,100,15,"1999-B",0,0,0,0,115,300,115,0,0,6,5,"YES",6,false,"NO",null,null,null,null,null,null,null,{"$f":"IFERROR(INDEX($CP$4:$CR$48,SMALL(IF((ISERROR(SEARCH($AM$14,PL_YEAR)*SEARCH($AM$14,PL_YEAR)*SEARCH($AM$12,PL_TYPE)))+(COUNTIFS(AL$18:$AL18,PL_YEAR,$AM$18:AM18,PL_DAYS,$AN$18:AN18,PL_TYPE)>0),\"\",ROW(PL_YEAR)-MIN(ROW(PL_YEAR))+1),1),COLUMN(A7)),\"\")","v":""},{"$f":"IFERROR(INDEX($CP$4:$CR$48,SMALL(IF((ISERROR(SEARCH($AM$14,PL_YEAR)*SEARCH($AM$14,PL_YEAR)*SEARCH($AM$12,PL_TYPE)))+(COUNTIFS($AL$18:AM18,PL_YEAR,$AM$18:AN18,PL_DAYS,$AN$18:AO18,PL_TYPE)>0),\"\",ROW(PL_YEAR)-MIN(ROW(PL_YEAR))+1),1),COLUMN(B7)),\"\")","v":""},{"$f":"IFERROR(INDEX($CP$4:$CR$48,SMALL(IF((ISERROR(SEARCH($AM$14,PL_YEAR)*SEARCH($AM$14,PL_YEAR)*SEARCH($AM$12,PL_TYPE)))+(COUNTIFS($AL$18:AN18,PL_YEAR,$AM$18:AO18,PL_DAYS,$AN$18:AP18,PL_TYPE)>0),\"\",ROW(PL_YEAR)-MIN(ROW(PL_YEAR))+1),1),COLUMN(C7)),\"\")","v":""},{"$f":"IFERROR(INDEX($CP$4:$CR$48,SMALL(IF((ISERROR(SEARCH($AM$14,PL_YEAR)*SEARCH($AM$14,PL_YEAR)*SEARCH($AM$12,PL_TYPE)))+(COUNTIFS($AL$18:AO18,PL_YEAR,$AM$18:AP18,PL_DAYS,$AN$18:AQ18,PL_TYPE)>0),\"\",ROW(PL_YEAR)-MIN(ROW(PL_YEAR))+1),1),COLUMN(E7)),\"\")","v":""},{"$f":"IFERROR(INDEX($CP$4:$CR$48,SMALL(IF((ISERROR(SEARCH($AQ$14,PL_YEAR)*SEARCH($AQ$14,PL_YEAR)*SEARCH($AQ$12,PL_TYPE)))+(COUNTIFS($AP$18:AP18,PL_YEAR,$AQ$18:AQ18,PL_DAYS,$AR$18:AR18,PL_TYPE)>0),\"\",ROW(PL_YEAR)-MIN(ROW(PL_YEAR))+1),1),COLUMN(A7)),\"\")","v":""},{"$f":"IFERROR(INDEX($CP$4:$CR$48,SMALL(IF((ISERROR(SEARCH($AQ$14,PL_YEAR)*SEARCH($AQ$14,PL_YEAR)*SEARCH($AQ$12,PL_TYPE)))+(COUNTIFS($AP$18:AQ18,PL_YEAR,$AQ$18:AR18,PL_DAYS,$AR$18:AS18,PL_TYPE)>0),\"\",ROW(PL_YEAR)-MIN(ROW(PL_YEAR))+1),1),COLUMN(B7)),\"\")","v":""},{"$f":"IFERROR(INDEX($CP$4:$CR$48,SMALL(IF((ISERROR(SEARCH($AQ$14,PL_YEAR)*SEARCH($AQ$14,PL_YEAR)*SEARCH($AQ$12,PL_TYPE)))+(COUNTIFS($AP$18:AR18,PL_YEAR,$AQ$18:AS18,PL_DAYS,$AR$18:AT18,PL_TYPE)>0),\"\",ROW(PL_YEAR)-MIN(ROW(PL_YEAR))+1),1),COLUMN(C7)),\"\")","v":""},{"$f":"IFERROR(INDEX($CP$4:$CR$48,SMALL(IF((ISERROR(SEARCH($AM$14,PL_YEAR)*SEARCH($AM$14,PL_YEAR)*SEARCH($AM$12,PL_TYPE)))+(COUNTIFS($AL$18:AS18,PL_YEAR,$AM$18:AT18,PL_DAYS,$AN$18:AU18,PL_TYPE)>0),\"\",ROW(PL_YEAR)-MIN(ROW(PL_YEAR))+1),1),COLUMN(E7)),\"\")","v":""},{"$f":"IFERROR(INDEX($CP$4:$CR$48,SMALL(IF((ISERROR(SEARCH($AU$14,PL_YEAR)*SEARCH($AU$14,PL_YEAR)*SEARCH($AU$12,PL_TYPE)))+(COUNTIFS($AT$18:AT18,PL_YEAR,$AU$18:AU18,PL_DAYS,$AV$18:AV18,PL_TYPE)>0),\"\",ROW(PL_YEAR)-MIN(ROW(PL_YEAR))+1),1),COLUMN(A7)),\"\")","v":""},{"$f":"IFERROR(INDEX($CP$4:$CR$48,SMALL(IF((ISERROR(SEARCH($AU$14,PL_YEAR)*SEARCH($AU$14,PL_YEAR)*SEARCH($AU$12,PL_TYPE)))+(COUNTIFS($AT$18:AU18,PL_YEAR,$AU$18:AV18,PL_DAYS,$AV$18:AW18,PL_TYPE)>0),\"\",ROW(PL_YEAR)-MIN(ROW(PL_YEAR))+1),1),COLUMN(B7)),\"\")","v":""},{"$f":"IFERROR(INDEX($CP$4:$CR$48,SMALL(IF((ISERROR(SEARCH($AU$14,PL_YEAR)*SEARCH($AU$14,PL_YEAR)*SEARCH($AU$12,PL_TYPE)))+(COUNTIFS($AT$18:AV18,PL_YEAR,$AU$18:AW18,PL_DAYS,$AU$18:AW18,PL_TYPE)>0),\"\",ROW(PL_YEAR)-MIN(ROW(PL_YEAR))+1),1),COLUMN(C7)),\"\")","v":""},{"$f":"IFERROR(INDEX($CP$4:$CR$48,SMALL(IF((ISERROR(SEARCH($AU$14,PL_YEAR)*SEARCH($AU$14,PL_YEAR)*SEARCH($AU$12,PL_TYPE)))+(COUNTIFS($AT$18:AW18,PL_YEAR,$AU$18:AW18,PL_DAYS,$AU$18:AW18,PL_TYPE)>0),\"\",ROW(PL_YEAR)-MIN(ROW(PL_YEAR))+1),1),COLUMN(E7)),\"\")","v":""},null,null,null,null,null,null,null,45,{"$error":"#N/A"},1,{"$error":"#N/A"},"",{"$f":"IF(PL!E29=\"\",\"\",PL!E29)","v":""},{"$f":"IF(PL!F29=\"\",\"\",PL!F29)","v":""},{"$f":"IF(PL!G29=\"\",\"\",PL!G29)","v":""},{"$f":"IF(PL!H29=\"\",\"\",PL!H29)","v":""},0,null,null,null,null,null,null,null,null,null,null,null,null,null,null,null,null,null,null,null,null,null,null,null,null,null,null,16,{"$f":"INDEX($BK$12:$BK$56,MATCH(ROWS($CO$4:CO19),$CO$4:$CO$48,0))","v":""},{"$f":"INDEX($BN$12:$BN$56,MATCH(ROWS($CO$4:CP19),$CO$4:$CO$48,0))","v":0},{"$f":"INDEX($BJ$12:$BJ$56,MATCH(ROWS($CO$4:CQ19),$CO$4:$CO$48,0))","v":""},"",0,""]
[null,"2000-01-01",{"$f":"IF(B20=\"\",\"\",IF(EOMONTH(B20,5)>=$B$10,$B$10,IF($N$3=\"B\",(EOMONTH(B20,5)),IF(EOMONTH(B20,11)>$B$10,$B$10,(EOMONTH(B20,11))))))","v":"2000-06-30"},"2000-06-30","YES","YES","2000-01-01","2000-06-30",2000,"A","2000-A",182,115,{"$f":"IF(F20=\"NO\",\"\",IF(L20>0,MIN(AC20,MAX(Y20:Z20)*$N$5)))","v":15},"2000-A",0,0,0,0,130,300,130,0,0,6,5,"YES",6,false,"NO",null,null,null,null,null,null,null,{"$f":"IFERROR(INDEX($CP$4:$CR$48,SMALL(IF((ISERROR(SEARCH($AM$14,PL_YEAR)*SEARCH($AM$14,PL_YEAR)*SEARCH($AM$12,PL_TYPE)))+(COUNTIFS(AL$18:$AL19,PL_YEAR,$AM$18:AM19,PL_DAYS,$AN$18:AN19,PL_TYPE)>0),\"\",ROW(PL_YEAR)-MIN(ROW(PL_YEAR))+1),1),COLUMN(A10)),\"\")","v":""},{"$f":"IFERROR(INDEX($CP$4:$CR$48,SMALL(IF((ISERROR(SEARCH($AM$14,PL_YEAR)*SEARCH($AM$14,PL_YEAR)*SEARCH($AM$12,PL_TYPE)))+(COUNTIFS($AL$18:AM19,PL_YEAR,$AM$18:AN19,PL_DAYS,$AN$18:AO19,PL_TYPE)>0),\"\",ROW(PL_YEAR)-MIN(ROW(PL_YEAR))+1),1),COLUMN(B10)),\"\")","v":""},{"$f":"IFERROR(INDEX($CP$4:$CR$48,SMALL(IF((ISERROR(SEARCH($AM$14,PL_YEAR)*SEARCH($AM$14,PL_YEAR)*SEARCH($AM$12,PL_TYPE)))+(COUNTIFS($AL$18:AN19,PL_YEAR,$AM$18:AO19,PL_DAYS,$AN$18:AP19,PL_TYPE)>0),\"\",ROW(PL_YEAR)-MIN(ROW(PL_YEAR))+1),1),COLUMN(C11)),\"\")","v":""},{"$f":"IFERROR(INDEX($CP$4:$CR$48,SMALL(IF((ISERROR(SEARCH($AM$14,PL_YEAR)*SEARCH($AM$14,PL_YEAR)*SEARCH($AM$12,PL_TYPE)))+(COUNTIFS($AL$18:AO19,PL_YEAR,$AM$18:AP19,PL_DAYS,$AN$18:AQ19,PL_TYPE)>0),\"\",ROW(PL_YEAR)-MIN(ROW(PL_YEAR))+1),1),COLUMN(E11)),\"\")","v":""},{"$f":"IFERROR(INDEX($CP$4:$CR$48,SMALL(IF((ISERROR(SEARCH($AQ$14,PL_YEAR)*SEARCH($AQ$14,PL_YEAR)*SEARCH($AQ$12,PL_TYPE)))+(COUNTIFS($AP$18:AP19,PL_YEAR,$AQ$18:AQ19,PL_DAYS,$AR$18:AR19,PL_TYPE)>0),\"\",ROW(PL_YEAR)-MIN(ROW(PL_YEAR))+1),1),COLUMN(A10)),\"\")","v":""},{"$f":"IFERROR(INDEX($CP$4:$CR$48,SMALL(IF((ISERROR(SEARCH($AQ$14,PL_YEAR)*SEARCH($AQ$14,PL_YEAR)*SEARCH($AQ$12,PL_TYPE)))+(COUNTIFS($AP$18:AQ19,PL_YEAR,$AQ$18:AR19,PL_DAYS,$AR$18:AS19,PL_TYPE)>0),\"\",ROW(PL_YEAR)-MIN(ROW(PL_YEAR))+1),1),COLUMN(B10)),\"\")","v":""},{"$f":"IFERROR(INDEX($CP$4:$CR$48,SMALL(IF((ISERROR(SEARCH($AQ$14,PL_YEAR)*SEARCH($AQ$14,PL_YEAR)*SEARCH($AQ$12,PL_TYPE)))+(COUNTIFS($AP$18:AR19,PL_YEAR,$AQ$18:AS19,PL_DAYS,$AR$18:AT19,PL_TYPE)>0),\"\",ROW(PL_YEAR)-MIN(ROW(PL_YEAR))+1),1),COLUMN(C11)),\"\")","v":""},{"$f":"IFERROR(INDEX($CP$4:$CR$48,SMALL(IF((ISERROR(SEARCH($AM$14,PL_YEAR)*SEARCH($AM$14,PL_YEAR)*SEARCH($AM$12,PL_TYPE)))+(COUNTIFS($AL$18:AS19,PL_YEAR,$AM$18:AT19,PL_DAYS,$AN$18:AU19,PL_TYPE)>0),\"\",ROW(PL_YEAR)-MIN(ROW(PL_YEAR))+1),1),COLUMN(E11)),\"\")","v":""},{"$f":"IFERROR(INDEX($CP$4:$CR$48,SMALL(IF((ISERROR(SEARCH($AU$14,PL_YEAR)*SEARCH($AU$14,PL_YEAR)*SEARCH($AU$12,PL_TYPE)))+(COUNTIFS($AT$18:AT19,PL_YEAR,$AU$18:AU19,PL_DAYS,$AV$18:AV19,PL_TYPE)>0),\"\",ROW(PL_YEAR)-MIN(ROW(PL_YEAR))+1),1),COLUMN(A10)),\"\")","v":""},{"$f":"IFERROR(INDEX($CP$4:$CR$48,SMALL(IF((ISERROR(SEARCH($AU$14,PL_YEAR)*SEARCH($AU$14,PL_YEAR)*SEARCH($AU$12,PL_TYPE)))+(COUNTIFS($AT$18:AU19,PL_YEAR,$AU$18:AV19,PL_DAYS,$AV$18:AW19,PL_TYPE)>0),\"\",ROW(PL_YEAR)-MIN(ROW(PL_YEAR))+1),1),COLUMN(B10)),\"\")","v":""},{"$f":"IFERROR(INDEX($CP$4:$CR$48,SMALL(IF((ISERROR(SEARCH($AU$14,PL_YEAR)*SEARCH($AU$14,PL_YEAR)*SEARCH($AU$12,PL_TYPE)))+(COUNTIFS($AT$18:AV19,PL_YEAR,$AU$18:AW19,PL_DAYS,$AU$18:AW19,PL_TYPE)>0),\"\",ROW(PL_YEAR)-MIN(ROW(PL_YEAR))+1),1),COLUMN(C11)),\"\")","v":""},{"$f":"IFERROR(INDEX($CP$4:$CR$48,SMALL(IF((ISERROR(SEARCH($AU$14,PL_YEAR)*SEARCH($AU$14,PL_YEAR)*SEARCH($AU$12,PL_TYPE)))+(COUNTIFS($AT$18:AW19,PL_YEAR,$AU$18:AW19,PL_DAYS,$AU$18:AW19,PL_TYPE)>0),\"\",ROW(PL_YEAR)-MIN(ROW(PL_YEAR))+1),1),COLUMN(E11)),\"\")","v":""},null,null,null,null,null,null,null,45,{"$error":"#N/A"},1,{"$error":"#N/A"},"",{"$f":"IF(PL!E30=\"\",\"\",PL!E30)","v":""},{"$f":"IF(PL!F30=\"\",\"\",PL!F30)","v":""},{"$f":"IF(PL!G30=\"\",\"\",PL!G30)","v":""},{"$f":"IF(PL!H30=\"\",\"\",PL!H30)","v":""},0,null,null,null,null,null,null,null,null,null,null,null,null,null,null,null,null,null,null,null,null,null,null,null,null,null,null,17,{"$f":"INDEX($BK$12:$BK$56,MATCH(ROWS($CO$4:CO20),$CO$4:$CO$48,0))","v":""},{"$f":"INDEX($BN$12:$BN$56,MATCH(ROWS($CO$4:CP20),$CO$4:$CO$48,0))","v":0},{"$f":"INDEX($BJ$12:$BJ$56,MATCH(ROWS($CO$4:CQ20),$CO$4:$CO$48,0))","v":""},"",0,""]
[null,"2000-07-01",{"$f":"IF(B21=\"\",\"\",IF(EOMONTH(B21,5)>=$B$10,$B$10,IF($N$3=\"B\",(EOMONTH(B21,5)),IF(EOMONTH(B21,11)>$B$10,$B$10,(EOMONTH(B21,11))))))","v":"2000-12-31"},{"$f":"IF(B21=\"\",\"\",SMALL(IF(($C$11:$C$94<=$C$11)*($C$11:$C$94>=$D$11),$C$11:$C$94,\"A\"),ROW(A10)))","v":"2000-12-31"},"YES","YES","2000-07-01","2000-12-31",2000,"B","2000-B",184,130,15,"2000-B",0,0,0,0,145,300,145,0,0,{"$f":"IF(B21=\"\",\"\",IF(X21>0,TRUNC((L21-DAY(C21))/30,0),Z21+1))","v":6},5,"YES",6,false,"NO",null,null,null,null,null,null,null,{"$f":"IFERROR(INDEX($CP$4:$CR$48,SMALL(IF((ISERROR(SEARCH($AM$14,PL_YEAR)*SEARCH($AM$14,PL_YEAR)*SEARCH($AM$12,PL_TYPE)))+(COUNTIFS(AL$18:$AL20,PL_YEAR,$AM$18:AM20,PL_DAYS,$AN$18:AN20,PL_TYPE)>0),\"\",ROW(PL_YEAR)-MIN(ROW(PL_YEAR))+1),1),COLUMN(#REF!)),\"\")","v":""},{"$f":"IFERROR(INDEX($CP$4:$CR$48,SMALL(IF((ISERROR(SEARCH($AM$14,PL_YEAR)*SEARCH($AM$14,PL_YEAR)*SEARCH($AM$12,PL_TYPE)))+(COUNTIFS($AL$18:AM20,PL_YEAR,$AM$18:AN20,PL_DAYS,$AN$18:AO20,PL_TYPE)>0),\"\",ROW(PL_YEAR)-MIN(ROW(PL_YEAR))+1),1),COLUMN(B11)),\"\")","v":""},{"$f":"IFERROR(INDEX($CP$4:$CR$48,SMALL(IF((ISERROR(SEARCH($AM$14,PL_YEAR)*SEARCH($AM$14,PL_YEAR)*SEARCH($AM$12,PL_TYPE)))+(COUNTIFS($AL$18:AN20,PL_YEAR,$AM$18:AO20,PL_DAYS,$AN$18:AP20,PL_TYPE)>0),\"\",ROW(PL_YEAR)-MIN(ROW(PL_YEAR))+1),1),COLUMN(C10)),\"\")","v":""},{"$f":"IFERROR(INDEX($CP$4:$CR$48,SMALL(IF((ISERROR(SEARCH($AM$14,PL_YEAR)*SEARCH($AM$14,PL_YEAR)*SEARCH($AM$12,PL_TYPE)))+(COUNTIFS($AL$18:AO20,PL_YEAR,$AM$18:AP20,PL_DAYS,$AN$18:AQ20,PL_TYPE)>0),\"\",ROW(PL_YEAR)-MIN(ROW(PL_YEAR))+1),1),COLUMN(E10)),\"\")","v":""},{"$f":"IFERROR(INDEX($CP$4:$CR$48,SMALL(IF((ISERROR(SEARCH($AQ$14,PL_YEAR)*SEARCH($AQ$14,PL_YEAR)*SEARCH($AQ$12,PL_TYPE)))+(COUNTIFS($AP$18:AP20,PL_YEAR,$AQ$18:AQ20,PL_DAYS,$AR$18:AR20,PL_TYPE)>0),\"\",ROW(PL_YEAR)-MIN(ROW(PL_YEAR))+1),1),COLUMN(#REF!)),\"\")","v":""},{"$f":"IFERROR(INDEX($CP$4:$CR$48,SMALL(IF((ISERROR(SEARCH($AQ$14,PL_YEAR)*SEARCH($AQ$14,PL_YEAR)*SEARCH($AQ$12,PL_TYPE)))+(COUNTIFS($AP$18:AQ20,PL_YEAR,$AQ$18:AR20,PL_DAYS,$AR$18:AS20,PL_TYPE)>0),\"\",ROW(PL_YEAR)-MIN(ROW(PL_YEAR))+1),1),COLUMN(B11)),\"\")","v":""},{"$f":"IFERROR(INDEX($CP$4:$CR$48,SMALL(IF((ISERROR(SEARCH($AQ$14,PL_YEAR)*SEARCH($AQ$14,PL_YEAR)*SEARCH($AQ$12,PL_TYPE)))+(COUNTIFS($AP$18:AR20,PL_YEAR,$AQ$18:AS20,PL_DAYS,$AR$18:AT20,PL_TYPE)>0),\"\",ROW(PL_YEAR)-MIN(ROW(PL_YEAR))+1),1),COLUMN(C10)),\"\")","v":""},{"$f":"IFERROR(INDEX($CP$4:$CR$48,SMALL(IF((ISERROR(SEARCH($AM$14,PL_YEAR)*SEARCH($AM$14,PL_YEAR)*SEARCH($AM$12,PL_TYPE)))+(COUNTIFS($AL$18:AS20,PL_YEAR,$AM$18:AT20,PL_DAYS,$AN$18:AU20,PL_TYPE)>0),\"\",ROW(PL_YEAR)-MIN(ROW(PL_YEAR))+1),1),COLUMN(E10)),\"\")","v":""},{"$f":"IFERROR(INDEX($CP$4:$CR$48,SMALL(IF((ISERROR(SEARCH($AU$14,PL_YEAR)*SEARCH($AU$14,PL_YEAR)*SEARCH($AU$12,PL_TYPE)))+(COUNTIFS($AT$18:AT20,PL_YEAR,$AU$18:AU20,PL_DAYS,$AV$18:AV20,PL_TYPE)>0),\"\",ROW(PL_YEAR)-MIN(ROW(PL_YEAR))+1),1),COLUMN(#REF!)),\"\")","v":""},{"$f":"IFERROR(INDEX($CP$4:$CR$48,SMALL(IF((ISERROR(SEARCH($AU$14,PL_YEAR)*SEARCH($AU$14,PL_YEAR)*SEARCH($AU$12,PL_TYPE)))+(COUNTIFS($AT$18:AU20,PL_YEAR,$AU$18:AV20,PL_DAYS,$AV$18:AW20,PL_TYPE)>0),\"\",ROW(PL_YEAR)-MIN(ROW(PL_YEAR))+1),1),COLUMN(B11)),\"\")","v":""},{"$f":"IFERROR(INDEX($CP$4:$CR$48,SMALL(IF((ISERROR(SEARCH($AU$14,PL_YEAR)*SEARCH($AU$14,PL_YEAR)*SEARCH($AU$12,PL_TYPE)))+(COUNTIFS($AT$18:AV20,PL_YEAR,$AU$18:AW20,PL_DAYS,$AU$18:AW20,PL_TYPE)>0),\"\",ROW(PL_YEAR)-MIN(ROW(PL_YEAR))+1),1),COLUMN(C10)),\"\")","v":""},{"$f":"IFERROR(INDEX($CP$4:$CR$48,SMALL(IF((ISERROR(SEARCH($AU$14,PL_YEAR)*SEARCH($AU$14,PL_YEAR)*SEARCH($AU$12,PL_TYPE)))+(COUNTIFS($AT$18:AW20,PL_YEAR,$AU$18:AW20,PL_DAYS,$AU$18:AW20,PL_TYPE)>0),\"\",ROW(PL_YEAR)-MIN(ROW(PL_YEAR))+1),1),COLUMN(E10)),\"\")","v":""},null,null,null,null,null,null,null,45,{"$error":"#N/A"},1,{"$error":"#N/A"},"",{"$f":"IF(PL!E31=\"\",\"\",PL!E31)","v":""},{"$f":"IF(PL!F31=\"\",\"\",PL!F31)","v":""},{"$f":"IF(PL!G31=\"\",\"\",PL!G31)","v":""},{"$f":"IF(PL!H31=\"\",\"\",PL!H31)","v":""},0,null,null,null,null,null,null,null,null,null,null,null,null,null,null,null,null,null,null,null,null,null,null,null,null,null,null,18,{"$f":"INDEX($BK$12:$BK$56,MATCH(ROWS($CO$4:CO21),$CO$4:$CO$48,0))","v":""},{"$f":"INDEX($BN$12:$BN$56,MATCH(ROWS($CO$4:CP21),$CO$4:$CO$48,0))","v":0},{"$f":"INDEX($BJ$12:$BJ$56,MATCH(ROWS($CO$4:CQ21),$CO$4:$CO$48,0))","v":""},"",0,""]
[null,"2001-01-01","2001-06-30","2001-06-30","YES","YES","2001-01-01","2001-06-30",2001,"A","2001-A",181,145,15,"2001-A",0,0,0,0,160,300,160,0,{"$f":"IF(B22=\"\",\"\",EOMONTH(C22,0)-C22)","v":0},6,5,"YES",6,false,"NO",null,null,null,null,null,null,null,{"$f":"IFERROR(INDEX($CP$4:$CR$48,SMALL(IF((ISERROR(SEARCH($AM$14,PL_YEAR)*SEARCH($AM$14,PL_YEAR)*SEARCH($AM$12,PL_TYPE)))+(COUNTIFS(AL$18:$AL21,PL_YEAR,$AM$18:AM21,PL_DAYS,$AN$18:AN21,PL_TYPE)>0),\"\",ROW(PL_YEAR)-MIN(ROW(PL_YEAR))+1),1),COLUMN(A12)),\"\")","v":""},{"$f":"IFERROR(INDEX($CP$4:$CR$48,SMALL(IF((ISERROR(SEARCH($AM$14,PL_YEAR)*SEARCH($AM$14,PL_YEAR)*SEARCH($AM$12,PL_TYPE)))+(COUNTIFS($AL$18:AM21,PL_YEAR,$AM$18:AN21,PL_DAYS,$AN$18:AO21,PL_TYPE)>0),\"\",ROW(PL_YEAR)-MIN(ROW(PL_YEAR))+1),1),COLUMN(B12)),\"\")","v":""},{"$f":"IFERROR(INDEX($CP$4:$CR$48,SMALL(IF((ISERROR(SEARCH($AM$14,PL_YEAR)*SEARCH($AM$14,PL_YEAR)*SEARCH($AM$12,PL_TYPE)))+(COUNTIFS($AL$18:AN21,PL_YEAR,$AM$18:AO21,PL_DAYS,$AN$18:AP21,PL_TYPE)>0),\"\",ROW(PL_YEAR)-MIN(ROW(PL_YEAR))+1),1),COLUMN(C12)),\"\")","v":""},{"$f":"IFERROR(INDEX($CP$4:$CR$48,SMALL(IF((ISERROR(SEARCH($AM$14,PL_YEAR)*SEARCH($AM$14,PL_YEAR)*SEARCH($AM$12,PL_TYPE)))+(COUNTIFS($AL$18:AO21,PL_YEAR,$AM$18:AP21,PL_DAYS,$AN$18:AQ21,PL_TYPE)>0),\"\",ROW(PL_YEAR)-MIN(ROW(PL_YEAR))+1),1),COLUMN(E12)),\"\")","v":""},{"$f":"IFERROR(INDEX($CP$4:$CR$48,SMALL(IF((ISERROR(SEARCH($AQ$14,PL_YEAR)*SEARCH($AQ$14,PL_YEAR)*SEARCH($AQ$12,PL_TYPE)))+(COUNTIFS($AP$18:AP21,PL_YEAR,$AQ$18:AQ21,PL_DAYS,$AR$18:AR21,PL_TYPE)>0),\"\",ROW(PL_YEAR)-MIN(ROW(PL_YEAR))+1),1),COLUMN(A12)),\"\")","v":""},{"$f":"IFERROR(INDEX($CP$4:$CR$48,SMALL(IF((ISERROR(SEARCH($AQ$14,PL_YEAR)*SEARCH($AQ$14,PL_YEAR)*SEARCH($AQ$12,PL_TYPE)))+(COUNTIFS($AP$18:AQ21,PL_YEAR,$AQ$18:AR21,PL_DAYS,$AR$18:AS21,PL_TYPE)>0),\"\",ROW(PL_YEAR)-MIN(ROW(PL_YEAR))+1),1),COLUMN(B12)),\"\")","v":""},{"$f":"IFERROR(INDEX($CP$4:$CR$48,SMALL(IF((ISERROR(SEARCH($AQ$14,PL_YEAR)*SEARCH($AQ$14,PL_YEAR)*SEARCH($AQ$12,PL_TYPE)))+(COUNTIFS($AP$18:AR21,PL_YEAR,$AQ$18:AS21,PL_DAYS,$AR$18:AT21,PL_TYPE)>0),\"\",ROW(PL_YEAR)-MIN(ROW(PL_YEAR))+1),1),COLUMN(C12)),\"\")","v":""},{"$f":"IFERROR(INDEX($CP$4:$CR$48,SMALL(IF((ISERROR(SEARCH($AM$14,PL_YEAR)*SEARCH($AM$14,PL_YEAR)*SEARCH($AM$12,PL_TYPE)))+(COUNTIFS($AL$18:AS21,PL_YEAR,$AM$18:AT21,PL_DAYS,$AN$18:AU21,PL_TYPE)>0),\"\",ROW(PL_YEAR)-MIN(ROW(PL_YEAR))+1),1),COLUMN(E12)),\"\")","v":""},{"$f":"IFERROR(INDEX($CP$4:$CR$48,SMALL(IF((ISERROR(SEARCH($AU$14,PL_YEAR)*SEARCH($AU$14,PL_YEAR)*SEARCH($AU$12,PL_TYPE)))+(COUNTIFS($AT$18:AT21,PL_YEAR,$AU$18:AU21,PL_DAYS,$AV$18:AV21,PL_TYPE)>0),\"\",ROW(PL_YEAR)-MIN(ROW(PL_YEAR))+1),1),COLUMN(A12)),\"\")","v":""},{"$f":"IFERROR(INDEX($CP$4:$CR$48,SMALL(IF((ISERROR(SEARCH($AU$14,PL_YEAR)*SEARCH($AU$14,PL_YEAR)*SEARCH($AU$12,PL_TYPE)))+(COUNTIFS($AT$18:AU21,PL_YEAR,$AU$18:AV21,PL_DAYS,$AV$18:AW21,PL_TYPE)>0),\"\",ROW(PL_YEAR)-MIN(ROW(PL_YEAR))+1),1),COLUMN(B12)),\"\")","v":""},{"$f":"IFERROR(INDEX($CP$4:$CR$48,SMALL(IF((ISERROR(SEARCH($AU$14,PL_YEAR)*SEARCH($AU$14,PL_YEAR)*SEARCH($AU$12,PL_TYPE)))+(COUNTIFS($AT$18:AV21,PL_YEAR,$AU$18:AW21,PL_DAYS,$AU$18:AW21,PL_TYPE)>0),\"\",ROW(PL_YEAR)-MIN(ROW(PL_YEAR))+1),1),COLUMN(C12)),\"\")","v":""},{"$f":"IFERROR(INDEX($CP$4:$CR$48,SMALL(IF((ISERROR(SEARCH($AU$14,PL_YEAR)*SEARCH($AU$14,PL_YEAR)*SEARCH($AU$12,PL_TYPE)))+(COUNTIFS($AT$18:AW21,PL_YEAR,$AU$18:AW21,PL_DAYS,$AU$18:AW21,PL_TYPE)>0),\"\",ROW(PL_YEAR)-MIN(ROW(PL_YEAR))+1),1),COLUMN(E12)),\"\")","v":""},null,null,null,null,null,null,null,45,{"$error":"#N/A"},1,{"$error":"#N/A"},"",{"$f":"IF(PL!E32=\"\",\"\",PL!E32)","v":""},{"$f":"IF(PL!F32=\"\",\"\",PL!F32)","v":""},{"$f":"IF(PL!G32=\"\",\"\",PL!G32)","v":""},{"$f":"IF(PL!H32=\"\",\"\",PL!H32)","v":""},0,null,null,null,null,null,null,null,null,null,null,null,null,null,null,null,null,null,null,null,null,null,null,null,null,null,null,19,{"$f":"INDEX($BK$12:$BK$56,MATCH(ROWS($CO$4:CO22),$CO$4:$CO$48,0))","v":""},{"$f":"INDEX($BN$12:$BN$56,MATCH(ROWS($CO$4:CP22),$CO$4:$CO$48,0))","v":0},{"$f":"INDEX($BJ$12:$BJ$56,MATCH(ROWS($CO$4:CQ22),$CO$4:$CO$48,0))","v":""},"",0,""]
[null,"2001-07-01","2001-12-31","2001-12-31","YES","YES","2001-07-01","2001-12-31",2001,"B","2001-B",184,160,15,"2001-B",0,0,0,0,175,300,175,0,0,6,5,"YES",6,false,"NO",null,null,null,null,null,null,null,{"$f":"IFERROR(INDEX($CP$4:$CR$48,SMALL(IF((ISERROR(SEARCH($AM$14,PL_YEAR)*SEARCH($AM$14,PL_YEAR)*SEARCH($AM$12,PL_TYPE)))+(COUNTIFS(AL$18:$AL22,PL_YEAR,$AM$18:AM22,PL_DAYS,$AN$18:AN22,PL_TYPE)>0),\"\",ROW(PL_YEAR)-MIN(ROW(PL_YEAR))+1),1),COLUMN(A13)),\"\")","v":""},{"$f":"IFERROR(INDEX($CP$4:$CR$48,SMALL(IF((ISERROR(SEARCH($AM$14,PL_YEAR)*SEARCH($AM$14,PL_YEAR)*SEARCH($AM$12,PL_TYPE)))+(COUNTIFS($AL$18:AM22,PL_YEAR,$AM$18:AN22,PL_DAYS,$AN$18:AO22,PL_TYPE)>0),\"\",ROW(PL_YEAR)-MIN(ROW(PL_YEAR))+1),1),COLUMN(B13)),\"\")","v":""},{"$f":"IFERROR(INDEX($CP$4:$CR$48,SMALL(IF((ISERROR(SEARCH($AM$14,PL_YEAR)*SEARCH($AM$14,PL_YEAR)*SEARCH($AM$12,PL_TYPE)))+(COUNTIFS($AL$18:AN22,PL_YEAR,$AM$18:AO22,PL_DAYS,$AN$18:AP22,PL_TYPE)>0),\"\",ROW(PL_YEAR)-MIN(ROW(PL_YEAR))+1),1),COLUMN(C13)),\"\")","v":""},{"$f":"IFERROR(INDEX($CP$4:$CR$48,SMALL(IF((ISERROR(SEARCH($AM$14,PL_YEAR)*SEARCH($AM$14,PL_YEAR)*SEARCH($AM$12,PL_TYPE)))+(COUNTIFS($AL$18:AO22,PL_YEAR,$AM$18:AP22,PL_DAYS,$AN$18:AQ22,PL_TYPE)>0),\"\",ROW(PL_YEAR)-MIN(ROW(PL_YEAR))+1),1),COLUMN(E13)),\"\")","v":""},{"$f":"IFERROR(INDEX($CP$4:$CR$48,SMALL(IF((ISERROR(SEARCH($AQ$14,PL_YEAR)*SEARCH($AQ$14,PL_YEAR)*SEARCH($AQ$12,PL_TYPE)))+(COUNTIFS($AP$18:AP22,PL_YEAR,$AQ$18:AQ22,PL_DAYS,$AR$18:AR22,PL_TYPE)>0),\"\",ROW(PL_YEAR)-MIN(ROW(PL_YEAR))+1),1),COLUMN(A13)),\"\")","v":""},{"$f":"IFERROR(INDEX($CP$4:$CR$48,SMALL(IF((ISERROR(SEARCH($AQ$14,PL_YEAR)*SEARCH($AQ$14,PL_YEAR)*SEARCH($AQ$12,PL_TYPE)))+(COUNTIFS($AP$18:AQ22,PL_YEAR,$AQ$18:AR22,PL_DAYS,$AR$18:AS22,PL_TYPE)>0),\"\",ROW(PL_YEAR)-MIN(ROW(PL_YEAR))+1),1),COLUMN(B13)),\"\")","v":""},{"$f":"IFERROR(INDEX($CP$4:$CR$48,SMALL(IF((ISERROR(SEARCH($AQ$14,PL_YEAR)*SEARCH($AQ$14,PL_YEAR)*SEARCH($AQ$12,PL_TYPE)))+(COUNTIFS($AP$18:AR22,PL_YEAR,$AQ$18:AS22,PL_DAYS,$AR$18:AT22,PL_TYPE)>0),\"\",ROW(PL_YEAR)-MIN(ROW(PL_YEAR))+1),1),COLUMN(C13)),\"\")","v":""},{"$f":"IFERROR(INDEX($CP$4:$CR$48,SMALL(IF((ISERROR(SEARCH($AM$14,PL_YEAR)*SEARCH($AM$14,PL_YEAR)*SEARCH($AM$12,PL_TYPE)))+(COUNTIFS($AL$18:AS22,PL_YEAR,$AM$18:AT22,PL_DAYS,$AN$18:AU22,PL_TYPE)>0),\"\",ROW(PL_YEAR)-MIN(ROW(PL_YEAR))+1),1),COLUMN(E13)),\"\")","v":""},{"$f":"IFERROR(INDEX($CP$4:$CR$48,SMALL(IF((ISERROR(SEARCH($AU$14,PL_YEAR)*SEARCH($AU$14,PL_YEAR)*SEARCH($AU$12,PL_TYPE)))+(COUNTIFS($AT$18:AT22,PL_YEAR,$AU$18:AU22,PL_DAYS,$AV$18:AV22,PL_TYPE)>0),\"\",ROW(PL_YEAR)-MIN(ROW(PL_YEAR))+1),1),COLUMN(A13)),\"\")","v":""},{"$f":"IFERROR(INDEX($CP$4:$CR$48,SMALL(IF((ISERROR(SEARCH($AU$14,PL_YEAR)*SEARCH($AU$14,PL_YEAR)*SEARCH($AU$12,PL_TYPE)))+(COUNTIFS($AT$18:AU22,PL_YEAR,$AU$18:AV22,PL_DAYS,$AV$18:AW22,PL_TYPE)>0),\"\",ROW(PL_YEAR)-MIN(ROW(PL_YEAR))+1),1),COLUMN(B13)),\"\")","v":""},{"$f":"IFERROR(INDEX($CP$4:$CR$48,SMALL(IF((ISERROR(SEARCH($AU$14,PL_YEAR)*SEARCH($AU$14,PL_YEAR)*SEARCH($AU$12,PL_TYPE)))+(COUNTIFS($AT$18:AV22,PL_YEAR,$AU$18:AW22,PL_DAYS,$AU$18:AW22,PL_TYPE)>0),\"\",ROW(PL_YEAR)-MIN(ROW(PL_YEAR))+1),1),COLUMN(C13)),\"\")","v":""},{"$f":"IFERROR(INDEX($CP$4:$CR$48,SMALL(IF((ISERROR(SEARCH($AU$14,PL_YEAR)*SEARCH($AU$14,PL_YEAR)*SEARCH($AU$12,PL_TYPE)))+(COUNTIFS($AT$18:AW22,PL_YEAR,$AU$18:AW22,PL_DAYS,$AU$18:AW22,PL_TYPE)>0),\"\",ROW(PL_YEAR)-MIN(ROW(PL_YEAR))+1),1),COLUMN(E13)),\"\")","v":""},null,null,null,null,null,null,null,45,null,1,{"$error":"#N/A"},"",{"$f":"IF(PL!E33=\"\",\"\",PL!E33)","v":""},{"$f":"IF(PL!F33=\"\",\"\",PL!F33)","v":""},{"$f":"IF(PL!G33=\"\",\"\",PL!G33)","v":""},{"$f":"IF(PL!H33=\"\",\"\",PL!H33)","v":""},0,null,null,null,null,null,null,null,null,null,null,null,null,null,null,null,null,null,null,null,null,null,null,null,null,null,null,20,{"$f":"INDEX($BK$12:$BK$56,MATCH(ROWS($CO$4:CO23),$CO$4:$CO$48,0))","v":""},{"$f":"INDEX($BN$12:$BN$56,MATCH(ROWS($CO$4:CP23),$CO$4:$CO$48,0))","v":0},{"$f":"INDEX($BJ$12:$BJ$56,MATCH(ROWS($CO$4:CQ23),$CO$4:$CO$48,0))","v":""},"",0,""]
[null,"2002-01-01","2002-06-30","2002-06-30","YES","YES","2002-01-01","2002-06-30",2002,"A","2002-A",181,175,15,"2002-A",0,0,0,0,190,300,190,0,0,6,5,"YES",6,false,"NO",null,null,null,null,null,null,null,{"$f":"IFERROR(INDEX($CP$4:$CR$48,SMALL(IF((ISERROR(SEARCH($AM$14,PL_YEAR)*SEARCH($AM$14,PL_YEAR)*SEARCH($AM$12,PL_TYPE)))+(COUNTIFS(AL$18:$AL23,PL_YEAR,$AM$18:AM23,PL_DAYS,$AN$18:AN23,PL_TYPE)>0),\"\",ROW(PL_YEAR)-MIN(ROW(PL_YEAR))+1),1),COLUMN(A14)),\"\")","v":""},{"$f":"IFERROR(INDEX($CP$4:$CR$48,SMALL(IF((ISERROR(SEARCH($AM$14,PL_YEAR)*SEARCH($AM$14,PL_YEAR)*SEARCH($AM$12,PL_TYPE)))+(COUNTIFS($AL$18:AM23,PL_YEAR,$AM$18:AN23,PL_DAYS,$AN$18:AO23,PL_TYPE)>0),\"\",ROW(PL_YEAR)-MIN(ROW(PL_YEAR))+1),1),COLUMN(B14)),\"\")","v":""},{"$f":"IFERROR(INDEX($CP$4:$CR$48,SMALL(IF((ISERROR(SEARCH($AM$14,PL_YEAR)*SEARCH($AM$14,PL_YEAR)*SEARCH($AM$12,PL_TYPE)))+(COUNTIFS($AL$18:AN23,PL_YEAR,$AM$18:AO23,PL_DAYS,$AN$18:AP23,PL_TYPE)>0),\"\",ROW(PL_YEAR)-MIN(ROW(PL_YEAR))+1),1),COLUMN(C14)),\"\")","v":""},{"$f":"IFERROR(INDEX($CP$4:$CR$48,SMALL(IF((ISERROR(SEARCH($AM$14,PL_YEAR)*SEARCH($AM$14,PL_YEAR)*SEARCH($AM$12,PL_TYPE)))+(COUNTIFS($AL$18:AO23,PL_YEAR,$AM$18:AP23,PL_DAYS,$AN$18:AQ23,PL_TYPE)>0),\"\",ROW(PL_YEAR)-MIN(ROW(PL_YEAR))+1),1),COLUMN(E14)),\"\")","v":""},{"$f":"IFERROR(INDEX($CP$4:$CR$48,SMALL(IF((ISERROR(SEARCH($AQ$14,PL_YEAR)*SEARCH($AQ$14,PL_YEAR)*SEARCH($AQ$12,PL_TYPE)))+(COUNTIFS($AP$18:AP23,PL_YEAR,$AQ$18:AQ23,PL_DAYS,$AR$18:AR23,PL_TYPE)>0),\"\",ROW(PL_YEAR)-MIN(ROW(PL_YEAR))+1),1),COLUMN(A14)),\"\")","v":""},{"$f":"IFERROR(INDEX($CP$4:$CR$48,SMALL(IF((ISERROR(SEARCH($AQ$14,PL_YEAR)*SEARCH($AQ$14,PL_YEAR)*SEARCH($AQ$12,PL_TYPE)))+(COUNTIFS($AP$18:AQ23,PL_YEAR,$AQ$18:AR23,PL_DAYS,$AR$18:AS23,PL_TYPE)>0),\"\",ROW(PL_YEAR)-MIN(ROW(PL_YEAR))+1),1),COLUMN(B14)),\"\")","v":""},{"$f":"IFERROR(INDEX($CP$4:$CR$48,SMALL(IF((ISERROR(SEARCH($AQ$14,PL_YEAR)*SEARCH($AQ$14,PL_YEAR)*SEARCH($AQ$12,PL_TYPE)))+(COUNTIFS($AP$18:AR23,PL_YEAR,$AQ$18:AS23,PL_DAYS,$AR$18:AT23,PL_TYPE)>0),\"\",ROW(PL_YEAR)-MIN(ROW(PL_YEAR))+1),1),COLUMN(C14)),\"\")","v":""},{"$f":"IFERROR(INDEX($CP$4:$CR$48,SMALL(IF((ISERROR(SEARCH($AM$14,PL_YEAR)*SEARCH($AM$14,PL_YEAR)*SEARCH($AM$12,PL_TYPE)))+(COUNTIFS($AL$18:AS23,PL_YEAR,$AM$18:AT23,PL_DAYS,$AN$18:AU23,PL_TYPE)>0),\"\",ROW(PL_YEAR)-MIN(ROW(PL_YEAR))+1),1),COLUMN(E14)),\"\")","v":""},{"$f":"IFERROR(INDEX($CP$4:$CR$48,SMALL(IF((ISERROR(SEARCH($AU$14,PL_YEAR)*SEARCH($AU$14,PL_YEAR)*SEARCH($AU$12,PL_TYPE)))+(COUNTIFS($AT$18:AT23,PL_YEAR,$AU$18:AU23,PL_DAYS,$AV$18:AV23,PL_TYPE)>0),\"\",ROW(PL_YEAR)-MIN(ROW(PL_YEAR))+1),1),COLUMN(A14)),\"\")","v":""},{"$f":"IFERROR(INDEX($CP$4:$CR$48,SMALL(IF((ISERROR(SEARCH($AU$14,PL_YEAR)*SEARCH($AU$14,PL_YEAR)*SEARCH($AU$12,PL_TYPE)))+(COUNTIFS($AT$18:AU23,PL_YEAR,$AU$18:AV23,PL_DAYS,$AV$18:AW23,PL_TYPE)>0),\"\",ROW(PL_YEAR)-MIN(ROW(PL_YEAR))+1),1),COLUMN(B14)),\"\")","v":""},{"$f":"IFERROR(INDEX($CP$4:$CR$48,SMALL(IF((ISERROR(SEARCH($AU$14,PL_YEAR)*SEARCH($AU$14,PL_YEAR)*SEARCH($AU$12,PL_TYPE)))+(COUNTIFS($AT$18:AV23,PL_YEAR,$AU$18:AW23,PL_DAYS,$AU$18:AW23,PL_TYPE)>0),\"\",ROW(PL_YEAR)-MIN(ROW(PL_YEAR))+1),1),COLUMN(C14)),\"\")","v":""},{"$f":"IFERROR(INDEX($CP$4:$CR$48,SMALL(IF((ISERROR(SEARCH($AU$14,PL_YEAR)*SEARCH($AU$14,PL_YEAR)*SEARCH($AU$12,PL_TYPE)))+(COUNTIFS($AT$18:AW23,PL_YEAR,$AU$18:AW23,PL_DAYS,$AU$18:AW23,PL_TYPE)>0),\"\",ROW(PL_YEAR)-MIN(ROW(PL_YEAR))+1),1),COLUMN(E14)),\"\")","v":""},null,null,null,null,null,null,null,45,null,1,{"$error":"#N/A"},"",{"$f":"IF(PL!E34=\"\",\"\",PL!E34)","v":""},{"$f":"IF(PL!F34=\"\",\"\",PL!F34)","v":""},{"$f":"IF(PL!G34=\"\",\"\",PL!G34)","v":""},{"$f":"IF(PL!H34=\"\",\"\",PL!H34)","v":""},0,null,null,null,null,null,null,null,null,null,null,null,null,null,null,null,null,null,null,null,null,null,null,null,null,null,null,21,{"$f":"INDEX($BK$12:$BK$56,MATCH(ROWS($CO$4:CO24),$CO$4:$CO$48,0))","v":""},{"$f":"INDEX($BN$12:$BN$56,MATCH(ROWS($CO$4:CP24),$CO$4:$CO$48,0))","v":0},{"$f":"INDEX($BJ$12:$BJ$56,MATCH(ROWS($CO$4:CQ24),$CO$4:$CO$48,0))","v":""},"",0,""]
[null,"2002-07-01","2002-12-31","2002-12-31","YES","YES","2002-07-01","2002-12-31",2002,"B","2002-B",184,190,15,"2002-B",0,0,0,0,205,300,205,0,0,6,5,"YES",6,false,"NO",null,null,null,null,null,null,null,{"$f":"IFERROR(INDEX($CP$4:$CR$48,SMALL(IF((ISERROR(SEARCH($AM$14,PL_YEAR)*SEARCH($AM$14,PL_YEAR)*SEARCH($AM$12,PL_TYPE)))+(COUNTIFS(AL$18:$AL24,PL_YEAR,$AM$18:AM24,PL_DAYS,$AN$18:AN24,PL_TYPE)>0),\"\",ROW(PL_YEAR)-MIN(ROW(PL_YEAR))+1),1),COLUMN(A15)),\"\")","v":""},{"$f":"IFERROR(INDEX($CP$4:$CR$48,SMALL(IF((ISERROR(SEARCH($AM$14,PL_YEAR)*SEARCH($AM$14,PL_YEAR)*SEARCH($AM$12,PL_TYPE)))+(COUNTIFS($AL$18:AM24,PL_YEAR,$AM$18:AN24,PL_DAYS,$AN$18:AO24,PL_TYPE)>0),\"\",ROW(PL_YEAR)-MIN(ROW(PL_YEAR))+1),1),COLUMN(B15)),\"\")","v":""},{"$f":"IFERROR(INDEX($CP$4:$CR$48,SMALL(IF((ISERROR(SEARCH($AM$14,PL_YEAR)*SEARCH($AM$14,PL_YEAR)*SEARCH($AM$12,PL_TYPE)))+(COUNTIFS($AL$18:AN24,PL_YEAR,$AM$18:AO24,PL_DAYS,$AN$18:AP24,PL_TYPE)>0),\"\",ROW(PL_YEAR)-MIN(ROW(PL_YEAR))+1),1),COLUMN(C15)),\"\")","v":""},{"$f":"IFERROR(INDEX($CP$4:$CR$48,SMALL(IF((ISERROR(SEARCH($AM$14,PL_YEAR)*SEARCH($AM$14,PL_YEAR)*SEARCH($AM$12,PL_TYPE)))+(COUNTIFS($AL$18:AO24,PL_YEAR,$AM$18:AP24,PL_DAYS,$AN$18:AQ24,PL_TYPE)>0),\"\",ROW(PL_YEAR)-MIN(ROW(PL_YEAR))+1),1),COLUMN(E15)),\"\")","v":""},{"$f":"IFERROR(INDEX($CP$4:$CR$48,SMALL(IF((ISERROR(SEARCH($AQ$14,PL_YEAR)*SEARCH($AQ$14,PL_YEAR)*SEARCH($AQ$12,PL_TYPE)))+(COUNTIFS($AP$18:AP24,PL_YEAR,$AQ$18:AQ24,PL_DAYS,$AR$18:AR24,PL_TYPE)>0),\"\",ROW(PL_YEAR)-MIN(ROW(PL_YEAR))+1),1),COLUMN(A15)),\"\")","v":""},{"$f":"IFERROR(INDEX($CP$4:$CR$48,SMALL(IF((ISERROR(SEARCH($AQ$14,PL_YEAR)*SEARCH($AQ$14,PL_YEAR)*SEARCH($AQ$12,PL_TYPE)))+(COUNTIFS($AP$18:AQ24,PL_YEAR,$AQ$18:AR24,PL_DAYS,$AR$18:AS24,PL_TYPE)>0),\"\",ROW(PL_YEAR)-MIN(ROW(PL_YEAR))+1),1),COLUMN(B15)),\"\")","v":""},{"$f":"IFERROR(INDEX($CP$4:$CR$48,SMALL(IF((ISERROR(SEARCH($AQ$14,PL_YEAR)*SEARCH($AQ$14,PL_YEAR)*SEARCH($AQ$12,PL_TYPE)))+(COUNTIFS($AP$18:AR24,PL_YEAR,$AQ$18:AS24,PL_DAYS,$AR$18:AT24,PL_TYPE)>0),\"\",ROW(PL_YEAR)-MIN(ROW(PL_YEAR))+1),1),COLUMN(C15)),\"\")","v":""},{"$f":"IFERROR(INDEX($CP$4:$CR$48,SMALL(IF((ISERROR(SEARCH($AM$14,PL_YEAR)*SEARCH($AM$14,PL_YEAR)*SEARCH($AM$12,PL_TYPE)))+(COUNTIFS($AL$18:AS24,PL_YEAR,$AM$18:AT24,PL_DAYS,$AN$18:AU24,PL_TYPE)>0),\"\",ROW(PL_YEAR)-MIN(ROW(PL_YEAR))+1),1),COLUMN(E15)),\"\")","v":""},{"$f":"IFERROR(INDEX($CP$4:$CR$48,SMALL(IF((ISERROR(SEARCH($AU$14,PL_YEAR)*SEARCH($AU$14,PL_YEAR)*SEARCH($AU$12,PL_TYPE)))+(COUNTIFS($AT$18:AT24,PL_YEAR,$AU$18:AU24,PL_DAYS,$AV$18:AV24,PL_TYPE)>0),\"\",ROW(PL_YEAR)-MIN(ROW(PL_YEAR))+1),1),COLUMN(A15)),\"\")","v":""},{"$f":"IFERROR(INDEX($CP$4:$CR$48,SMALL(IF((ISERROR(SEARCH($AU$14,PL_YEAR)*SEARCH($AU$14,PL_YEAR)*SEARCH($AU$12,PL_TYPE)))+(COUNTIFS($AT$18:AU24,PL_YEAR,$AU$18:AV24,PL_DAYS,$AV$18:AW24,PL_TYPE)>0),\"\",ROW(PL_YEAR)-MIN(ROW(PL_YEAR))+1),1),COLUMN(B15)),\"\")","v":""},{"$f":"IFERROR(INDEX($CP$4:$CR$48,SMALL(IF((ISERROR(SEARCH($AU$14,PL_YEAR)*SEARCH($AU$14,PL_YEAR)*SEARCH($AU$12,PL_TYPE)))+(COUNTIFS($AT$18:AV24,PL_YEAR,$AU$18:AW24,PL_DAYS,$AU$18:AW24,PL_TYPE)>0),\"\",ROW(PL_YEAR)-MIN(ROW(PL_YEAR))+1),1),COLUMN(C15)),\"\")","v":""},{"$f":"IFERROR(INDEX($CP$4:$CR$48,SMALL(IF((ISERROR(SEARCH($AU$14,PL_YEAR)*SEARCH($AU$14,PL_YEAR)*SEARCH($AU$12,PL_TYPE)))+(COUNTIFS($AT$18:AW24,PL_YEAR,$AU$18:AW24,PL_DAYS,$AU$18:AW24,PL_TYPE)>0),\"\",ROW(PL_YEAR)-MIN(ROW(PL_YEAR))+1),1),COLUMN(E15)),\"\")","v":""},null,null,null,null,null,null,null,45,null,1,{"$error":"#N/A"},"",{"$f":"IF(PL!E35=\"\",\"\",PL!E35)","v":""},{"$f":"IF(PL!F35=\"\",\"\",PL!F35)","v":""},{"$f":"IF(PL!G35=\"\",\"\",PL!G35)","v":""},{"$f":"IF(PL!H35=\"\",\"\",PL!H35)","v":""},0,null,null,null,null,null,null,null,null,null,null,null,null,null,null,null,null,null,null,null,null,null,null,null,null,null,null,22,{"$f":"INDEX($BK$12:$BK$56,MATCH(ROWS($CO$4:CO25),$CO$4:$CO$48,0))","v":""},{"$f":"INDEX($BN$12:$BN$56,MATCH(ROWS($CO$4:CP25),$CO$4:$CO$48,0))","v":0},{"$f":"INDEX($BJ$12:$BJ$56,MATCH(ROWS($CO$4:CQ25),$CO$4:$CO$48,0))","v":""},"",0,""]
[null,"2003-01-01","2003-06-30","2003-06-30","YES","YES","2003-01-01","2003-06-30",2003,"A","2003-A",181,205,15,"2003-A",0,0,0,0,220,300,220,0,0,6,5,"YES",6,false,"NO",null,null,null,null,null,null,null,{"$f":"IFERROR(INDEX($CP$4:$CR$48,SMALL(IF((ISERROR(SEARCH($AM$14,PL_YEAR)*SEARCH($AM$14,PL_YEAR)*SEARCH($AM$12,PL_TYPE)))+(COUNTIFS(AL$18:$AL25,PL_YEAR,$AM$18:AM25,PL_DAYS,$AN$18:AN25,PL_TYPE)>0),\"\",ROW(PL_YEAR)-MIN(ROW(PL_YEAR))+1),1),COLUMN(A16)),\"\")","v":""},{"$f":"IFERROR(INDEX($CP$4:$CR$48,SMALL(IF((ISERROR(SEARCH($AM$14,PL_YEAR)*SEARCH($AM$14,PL_YEAR)*SEARCH($AM$12,PL_TYPE)))+(COUNTIFS($AL$18:AM25,PL_YEAR,$AM$18:AN25,PL_DAYS,$AN$18:AO25,PL_TYPE)>0),\"\",ROW(PL_YEAR)-MIN(ROW(PL_YEAR))+1),1),COLUMN(B16)),\"\")","v":""},{"$f":"IFERROR(INDEX($CP$4:$CR$48,SMALL(IF((ISERROR(SEARCH($AM$14,PL_YEAR)*SEARCH($AM$14,PL_YEAR)*SEARCH($AM$12,PL_TYPE)))+(COUNTIFS($AL$18:AN25,PL_YEAR,$AM$18:AO25,PL_DAYS,$AN$18:AP25,PL_TYPE)>0),\"\",ROW(PL_YEAR)-MIN(ROW(PL_YEAR))+1),1),COLUMN(C16)),\"\")","v":""},{"$f":"IFERROR(INDEX($CP$4:$CR$48,SMALL(IF((ISERROR(SEARCH($AM$14,PL_YEAR)*SEARCH($AM$14,PL_YEAR)*SEARCH($AM$12,PL_TYPE)))+(COUNTIFS($AL$18:AO25,PL_YEAR,$AM$18:AP25,PL_DAYS,$AN$18:AQ25,PL_TYPE)>0),\"\",ROW(PL_YEAR)-MIN(ROW(PL_YEAR))+1),1),COLUMN(E16)),\"\")","v":""},{"$f":"IFERROR(INDEX($CP$4:$CR$48,SMALL(IF((ISERROR(SEARCH($AQ$14,PL_YEAR)*SEARCH($AQ$14,PL_YEAR)*SEARCH($AQ$12,PL_TYPE)))+(COUNTIFS($AP$18:AP25,PL_YEAR,$AQ$18:AQ25,PL_DAYS,$AR$18:AR25,PL_TYPE)>0),\"\",ROW(PL_YEAR)-MIN(ROW(PL_YEAR))+1),1),COLUMN(A16)),\"\")","v":""},{"$f":"IFERROR(INDEX($CP$4:$CR$48,SMALL(IF((ISERROR(SEARCH($AQ$14,PL_YEAR)*SEARCH($AQ$14,PL_YEAR)*SEARCH($AQ$12,PL_TYPE)))+(COUNTIFS($AP$18:AQ25,PL_YEAR,$AQ$18:AR25,PL_DAYS,$AR$18:AS25,PL_TYPE)>0),\"\",ROW(PL_YEAR)-MIN(ROW(PL_YEAR))+1),1),COLUMN(B16)),\"\")","v":""},{"$f":"IFERROR(INDEX($CP$4:$CR$48,SMALL(IF((ISERROR(SEARCH($AQ$14,PL_YEAR)*SEARCH($AQ$14,PL_YEAR)*SEARCH($AQ$12,PL_TYPE)))+(COUNTIFS($AP$18:AR25,PL_YEAR,$AQ$18:AS25,PL_DAYS,$AR$18:AT25,PL_TYPE)>0),\"\",ROW(PL_YEAR)-MIN(ROW(PL_YEAR))+1),1),COLUMN(C16)),\"\")","v":""},{"$f":"IFERROR(INDEX($CP$4:$CR$48,SMALL(IF((ISERROR(SEARCH($AM$14,PL_YEAR)*SEARCH($AM$14,PL_YEAR)*SEARCH($AM$12,PL_TYPE)))+(COUNTIFS($AL$18:AS25,PL_YEAR,$AM$18:AT25,PL_DAYS,$AN$18:AU25,PL_TYPE)>0),\"\",ROW(PL_YEAR)-MIN(ROW(PL_YEAR))+1),1),COLUMN(E16)),\"\")","v":""},{"$f":"IFERROR(INDEX($CP$4:$CR$48,SMALL(IF((ISERROR(SEARCH($AU$14,PL_YEAR)*SEARCH($AU$14,PL_YEAR)*SEARCH($AU$12,PL_TYPE)))+(COUNTIFS($AT$18:AT25,PL_YEAR,$AU$18:AU25,PL_DAYS,$AV$18:AV25,PL_TYPE)>0),\"\",ROW(PL_YEAR)-MIN(ROW(PL_YEAR))+1),1),COLUMN(A16)),\"\")","v":""},{"$f":"IFERROR(INDEX($CP$4:$CR$48,SMALL(IF((ISERROR(SEARCH($AU$14,PL_YEAR)*SEARCH($AU$14,PL_YEAR)*SEARCH($AU$12,PL_TYPE)))+(COUNTIFS($AT$18:AU25,PL_YEAR,$AU$18:AV25,PL_DAYS,$AV$18:AW25,PL_TYPE)>0),\"\",ROW(PL_YEAR)-MIN(ROW(PL_YEAR))+1),1),COLUMN(B16)),\"\")","v":""},{"$f":"IFERROR(INDEX($CP$4:$CR$48,SMALL(IF((ISERROR(SEARCH($AU$14,PL_YEAR)*SEARCH($AU$14,PL_YEAR)*SEARCH($AU$12,PL_TYPE)))+(COUNTIFS($AT$18:AV25,PL_YEAR,$AU$18:AW25,PL_DAYS,$AU$18:AW25,PL_TYPE)>0),\"\",ROW(PL_YEAR)-MIN(ROW(PL_YEAR))+1),1),COLUMN(C16)),\"\")","v":""},{"$f":"IFERROR(INDEX($CP$4:$CR$48,SMALL(IF((ISERROR(SEARCH($AU$14,PL_YEAR)*SEARCH($AU$14,PL_YEAR)*SEARCH($AU$12,PL_TYPE)))+(COUNTIFS($AT$18:AW25,PL_YEAR,$AU$18:AW25,PL_DAYS,$AU$18:AW25,PL_TYPE)>0),\"\",ROW(PL_YEAR)-MIN(ROW(PL_YEAR))+1),1),COLUMN(E16)),\"\")","v":""},null,null,null,null,null,null,null,45,null,1,{"$error":"#N/A"},"",{"$f":"IF(PL!E36=\"\",\"\",PL!E36)","v":""},{"$f":"IF(PL!F36=\"\",\"\",PL!F36)","v":""},{"$f":"IF(PL!G36=\"\",\"\",PL!G36)","v":""},{"$f":"IF(PL!H36=\"\",\"\",PL!H36)","v":""},0,null,null,null,null,null,null,null,null,null,null,null,null,null,null,null,null,null,null,null,null,null,null,null,null,null,null,23,{"$f":"INDEX($BK$12:$BK$56,MATCH(ROWS($CO$4:CO26),$CO$4:$CO$48,0))","v":""},{"$f":"INDEX($BN$12:$BN$56,MATCH(ROWS($CO$4:CP26),$CO$4:$CO$48,0))","v":0},{"$f":"INDEX($BJ$12:$BJ$56,MATCH(ROWS($CO$4:CQ26),$CO$4:$CO$48,0))","v":""},"",0,""]
[null,"2003-07-01","2003-12-31","2003-12-31","YES","YES","2003-07-01","2003-12-31",2003,"B","2003-B",184,220,15,"2003-B",0,0,0,0,235,300,235,0,0,6,5,"YES",6,false,"NO",null,null,null,null,null,null,null,{"$f":"IFERROR(INDEX($CP$4:$CR$48,SMALL(IF((ISERROR(SEARCH($AM$14,PL_YEAR)*SEARCH($AM$14,PL_YEAR)*SEARCH($AM$12,PL_TYPE)))+(COUNTIFS(AL$18:$AL26,PL_YEAR,$AM$18:AM26,PL_DAYS,$AN$18:AN26,PL_TYPE)>0),\"\",ROW(PL_YEAR)-MIN(ROW(PL_YEAR))+1),1),COLUMN(A17)),\"\")","v":""},{"$f":"IFERROR(INDEX($CP$4:$CR$48,SMALL(IF((ISERROR(SEARCH($AM$14,PL_YEAR)*SEARCH($AM$14,PL_YEAR)*SEARCH($AM$12,PL_TYPE)))+(COUNTIFS($AL$18:AM26,PL_YEAR,$AM$18:AN26,PL_DAYS,$AN$18:AO26,PL_TYPE)>0),\"\",ROW(PL_YEAR)-MIN(ROW(PL_YEAR))+1),1),COLUMN(B17)),\"\")","v":""},{"$f":"IFERROR(INDEX($CP$4:$CR$48,SMALL(IF((ISERROR(SEARCH($AM$14,PL_YEAR)*SEARCH($AM$14,PL_YEAR)*SEARCH($AM$12,PL_TYPE)))+(COUNTIFS($AL$18:AN26,PL_YEAR,$AM$18:AO26,PL_DAYS,$AN$18:AP26,PL_TYPE)>0),\"\",ROW(PL_YEAR)-MIN(ROW(PL_YEAR))+1),1),COLUMN(C17)),\"\")","v":""},{"$f":"IFERROR(INDEX($CP$4:$CR$48,SMALL(IF((ISERROR(SEARCH($AM$14,PL_YEAR)*SEARCH($AM$14,PL_YEAR)*SEARCH($AM$12,PL_TYPE)))+(COUNTIFS($AL$18:AO26,PL_YEAR,$AM$18:AP26,PL_DAYS,$AN$18:AQ26,PL_TYPE)>0),\"\",ROW(PL_YEAR)-MIN(ROW(PL_YEAR))+1),1),COLUMN(E17)),\"\")","v":""},{"$f":"IFERROR(INDEX($CP$4:$CR$48,SMALL(IF((ISERROR(SEARCH($AQ$14,PL_YEAR)*SEARCH($AQ$14,PL_YEAR)*SEARCH($AQ$12,PL_TYPE)))+(COUNTIFS($AP$18:AP26,PL_YEAR,$AQ$18:AQ26,PL_DAYS,$AR$18:AR26,PL_TYPE)>0),\"\",ROW(PL_YEAR)-MIN(ROW(PL_YEAR))+1),1),COLUMN(A17)),\"\")","v":""},{"$f":"IFERROR(INDEX($CP$4:$CR$48,SMALL(IF((ISERROR(SEARCH($AQ$14,PL_YEAR)*SEARCH($AQ$14,PL_YEAR)*SEARCH($AQ$12,PL_TYPE)))+(COUNTIFS($AP$18:AQ26,PL_YEAR,$AQ$18:AR26,PL_DAYS,$AR$18:AS26,PL_TYPE)>0),\"\",ROW(PL_YEAR)-MIN(ROW(PL_YEAR))+1),1),COLUMN(B17)),\"\")","v":""},{"$f":"IFERROR(INDEX($CP$4:$CR$48,SMALL(IF((ISERROR(SEARCH($AQ$14,PL_YEAR)*SEARCH($AQ$14,PL_YEAR)*SEARCH($AQ$12,PL_TYPE)))+(COUNTIFS($AP$18:AR26,PL_YEAR,$AQ$18:AS26,PL_DAYS,$AR$18:AT26,PL_TYPE)>0),\"\",ROW(PL_YEAR)-MIN(ROW(PL_YEAR))+1),1),COLUMN(C17)),\"\")","v":""},{"$f":"IFERROR(INDEX($CP$4:$CR$48,SMALL(IF((ISERROR(SEARCH($AM$14,PL_YEAR)*SEARCH($AM$14,PL_YEAR)*SEARCH($AM$12,PL_TYPE)))+(COUNTIFS($AL$18:AS26,PL_YEAR,$AM$18:AT26,PL_DAYS,$AN$18:AU26,PL_TYPE)>0),\"\",ROW(PL_YEAR)-MIN(ROW(PL_YEAR))+1),1),COLUMN(E17)),\"\")","v":""},{"$f":"IFERROR(INDEX($CP$4:$CR$48,SMALL(IF((ISERROR(SEARCH($AU$14,PL_YEAR)*SEARCH($AU$14,PL_YEAR)*SEARCH($AU$12,PL_TYPE)))+(COUNTIFS($AT$18:AT26,PL_YEAR,$AU$18:AU26,PL_DAYS,$AV$18:AV26,PL_TYPE)>0),\"\",ROW(PL_YEAR)-MIN(ROW(PL_YEAR))+1),1),COLUMN(A17)),\"\")","v":""},{"$f":"IFERROR(INDEX($CP$4:$CR$48,SMALL(IF((ISERROR(SEARCH($AU$14,PL_YEAR)*SEARCH($AU$14,PL_YEAR)*SEARCH($AU$12,PL_TYPE)))+(COUNTIFS($AT$18:AU26,PL_YEAR,$AU$18:AV26,PL_DAYS,$AV$18:AW26,PL_TYPE)>0),\"\",ROW(PL_YEAR)-MIN(ROW(PL_YEAR))+1),1),COLUMN(B17)),\"\")","v":""},{"$f":"IFERROR(INDEX($CP$4:$CR$48,SMALL(IF((ISERROR(SEARCH($AU$14,PL_YEAR)*SEARCH($AU$14,PL_YEAR)*SEARCH($AU$12,PL_TYPE)))+(COUNTIFS($AT$18:AV26,PL_YEAR,$AU$18:AW26,PL_DAYS,$AU$18:AW26,PL_TYPE)>0),\"\",ROW(PL_YEAR)-MIN(ROW(PL_YEAR))+1),1),COLUMN(C17)),\"\")","v":""},{"$f":"IFERROR(INDEX($CP$4:$CR$48,SMALL(IF((ISERROR(SEARCH($AU$14,PL_YEAR)*SEARCH($AU$14,PL_YEAR)*SEARCH($AU$12,PL_TYPE)))+(COUNTIFS($AT$18:AW26,PL_YEAR,$AU$18:AW26,PL_DAYS,$AU$18:AW26,PL_TYPE)>0),\"\",ROW(PL_YEAR)-MIN(ROW(PL_YEAR))+1),1),COLUMN(E17)),\"\")","v":""},null,null,null,null,null,null,null,45,null,1,{"$error":"#N/A"},"",{"$f":"IF(PL!E37=\"\",\"\",PL!E37)","v":""},{"$f":"IF(PL!F37=\"\",\"\",PL!F37)","v":""},{"$f":"IF(PL!G37=\"\",\"\",PL!G37)","v":""},{"$f":"IF(PL!H37=\"\",\"\",PL!H37)","v":""},0,null,null,null,null,null,null,null,null,null,null,null,null,null,null,null,null,null,null,null,null,null,null,null,null,null,null,24,{"$f":"INDEX($BK$12:$BK$56,MATCH(ROWS($CO$4:CO27),$CO$4:$CO$48,0))","v":""},{"$f":"INDEX($BN$12:$BN$56,MATCH(ROWS($CO$4:CP27),$CO$4:$CO$48,0))","v":0},{"$f":"INDEX($BJ$12:$BJ$56,MATCH(ROWS($CO$4:CQ27),$CO$4:$CO$48,0))","v":""},"",0,""]
[null,"2004-01-01","2004-06-30","2004-06-30","YES","YES","2004-01-01","2004-06-30",2004,"A","2004-A",182,235,15,"2004-A",0,0,0,0,250,300,250,0,0,6,5,"YES",6,false,"NO",null,null,null,null,null,null,null,{"$f":"IFERROR(INDEX($CP$4:$CR$48,SMALL(IF((ISERROR(SEARCH($AM$14,PL_YEAR)*SEARCH($AM$14,PL_YEAR)*SEARCH($AM$12,PL_TYPE)))+(COUNTIFS(AL$18:$AL27,PL_YEAR,$AM$18:AM27,PL_DAYS,$AN$18:AN27,PL_TYPE)>0),\"\",ROW(PL_YEAR)-MIN(ROW(PL_YEAR))+1),1),COLUMN(A18)),\"\")","v":""},{"$f":"IFERROR(INDEX($CP$4:$CR$48,SMALL(IF((ISERROR(SEARCH($AM$14,PL_YEAR)*SEARCH($AM$14,PL_YEAR)*SEARCH($AM$12,PL_TYPE)))+(COUNTIFS($AL$18:AM27,PL_YEAR,$AM$18:AN27,PL_DAYS,$AN$18:AO27,PL_TYPE)>0),\"\",ROW(PL_YEAR)-MIN(ROW(PL_YEAR))+1),1),COLUMN(B18)),\"\")","v":""},{"$f":"IFERROR(INDEX($CP$4:$CR$48,SMALL(IF((ISERROR(SEARCH($AM$14,PL_YEAR)*SEARCH($AM$14,PL_YEAR)*SEARCH($AM$12,PL_TYPE)))+(COUNTIFS($AL$18:AN27,PL_YEAR,$AM$18:AO27,PL_DAYS,$AN$18:AP27,PL_TYPE)>0),\"\",ROW(PL_YEAR)-MIN(ROW(PL_YEAR))+1),1),COLUMN(C18)),\"\")","v":""},{"$f":"IFERROR(INDEX($CP$4:$CR$48,SMALL(IF((ISERROR(SEARCH($AM$14,PL_YEAR)*SEARCH($AM$14,PL_YEAR)*SEARCH($AM$12,PL_TYPE)))+(COUNTIFS($AL$18:AO27,PL_YEAR,$AM$18:AP27,PL_DAYS,$AN$18:AQ27,PL_TYPE)>0),\"\",ROW(PL_YEAR)-MIN(ROW(PL_YEAR))+1),1),COLUMN(E18)),\"\")","v":""},{"$f":"IFERROR(INDEX($CP$4:$CR$48,SMALL(IF((ISERROR(SEARCH($AQ$14,PL_YEAR)*SEARCH($AQ$14,PL_YEAR)*SEARCH($AQ$12,PL_TYPE)))+(COUNTIFS($AP$18:AP27,PL_YEAR,$AQ$18:AQ27,PL_DAYS,$AR$18:AR27,PL_TYPE)>0),\"\",ROW(PL_YEAR)-MIN(ROW(PL_YEAR))+1),1),COLUMN(A18)),\"\")","v":""},{"$f":"IFERROR(INDEX($CP$4:$CR$48,SMALL(IF((ISERROR(SEARCH($AQ$14,PL_YEAR)*SEARCH($AQ$14,PL_YEAR)*SEARCH($AQ$12,PL_TYPE)))+(COUNTIFS($AP$18:AQ27,PL_YEAR,$AQ$18:AR27,PL_DAYS,$AR$18:AS27,PL_TYPE)>0),\"\",ROW(PL_YEAR)-MIN(ROW(PL_YEAR))+1),1),COLUMN(B18)),\"\")","v":""},{"$f":"IFERROR(INDEX($CP$4:$CR$48,SMALL(IF((ISERROR(SEARCH($AQ$14,PL_YEAR)*SEARCH($AQ$14,PL_YEAR)*SEARCH($AQ$12,PL_TYPE)))+(COUNTIFS($AP$18:AR27,PL_YEAR,$AQ$18:AS27,PL_DAYS,$AR$18:AT27,PL_TYPE)>0),\"\",ROW(PL_YEAR)-MIN(ROW(PL_YEAR))+1),1),COLUMN(C18)),\"\")","v":""},{"$f":"IFERROR(INDEX($CP$4:$CR$48,SMALL(IF((ISERROR(SEARCH($AM$14,PL_YEAR)*SEARCH($AM$14,PL_YEAR)*SEARCH($AM$12,PL_TYPE)))+(COUNTIFS($AL$18:AS27,PL_YEAR,$AM$18:AT27,PL_DAYS,$AN$18:AU27,PL_TYPE)>0),\"\",ROW(PL_YEAR)-MIN(ROW(PL_YEAR))+1),1),COLUMN(E18)),\"\")","v":""},{"$f":"IFERROR(INDEX($CP$4:$CR$48,SMALL(IF((ISERROR(SEARCH($AU$14,PL_YEAR)*SEARCH($AU$14,PL_YEAR)*SEARCH($AU$12,PL_TYPE)))+(COUNTIFS($AT$18:AT27,PL_YEAR,$AU$18:AU27,PL_DAYS,$AV$18:AV27,PL_TYPE)>0),\"\",ROW(PL_YEAR)-MIN(ROW(PL_YEAR))+1),1),COLUMN(A18)),\"\")","v":""},{"$f":"IFERROR(INDEX($CP$4:$CR$48,SMALL(IF((ISERROR(SEARCH($AU$14,PL_YEAR)*SEARCH($AU$14,PL_YEAR)*SEARCH($AU$12,PL_TYPE)))+(COUNTIFS($AT$18:AU27,PL_YEAR,$AU$18:AV27,PL_DAYS,$AV$18:AW27,PL_TYPE)>0),\"\",ROW(PL_YEAR)-MIN(ROW(PL_YEAR))+1),1),COLUMN(B18)),\"\")","v":""},{"$f":"IFERROR(INDEX($CP$4:$CR$48,SMALL(IF((ISERROR(SEARCH($AU$14,PL_YEAR)*SEARCH($AU$14,PL_YEAR)*SEARCH($AU$12,PL_TYPE)))+(COUNTIFS($AT$18:AV27,PL_YEAR,$AU$18:AW27,PL_DAYS,$AU$18:AW27,PL_TYPE)>0),\"\",ROW(PL_YEAR)-MIN(ROW(PL_YEAR))+1),1),COLUMN(C18)),\"\")","v":""},{"$f":"IFERROR(INDEX($CP$4:$CR$48,SMALL(IF((ISERROR(SEARCH($AU$14,PL_YEAR)*SEARCH($AU$14,PL_YEAR)*SEARCH($AU$12,PL_TYPE)))+(COUNTIFS($AT$18:AW27,PL_YEAR,$AU$18:AW27,PL_DAYS,$AU$18:AW27,PL_TYPE)>0),\"\",ROW(PL_YEAR)-MIN(ROW(PL_YEAR))+1),1),COLUMN(E18)),\"\")","v":""},null,null,null,null,null,null,null,45,null,1,{"$error":"#N/A"},"",{"$f":"IF(PL!E38=\"\",\"\",PL!E38)","v":""},{"$f":"IF(PL!F38=\"\",\"\",PL!F38)","v":""},{"$f":"IF(PL!G38=\"\",\"\",PL!G38)","v":""},{"$f":"IF(PL!H38=\"\",\"\",PL!H38)","v":""},0,null,null,null,null,null,null,null,null,null,null,null,null,null,null,null,null,null,null,null,null,null,null,null,null,null,null,25,{"$f":"INDEX($BK$12:$BK$56,MATCH(ROWS($CO$4:CO28),$CO$4:$CO$48,0))","v":""},{"$f":"INDEX($BN$12:$BN$56,MATCH(ROWS($CO$4:CP28),$CO$4:$CO$48,0))","v":0},{"$f":"INDEX($BJ$12:$BJ$56,MATCH(ROWS($CO$4:CQ28),$CO$4:$CO$48,0))","v":""},"",0,""]
[null,"2004-07-01","2004-12-31","2004-12-31","YES","YES","2004-07-01","2004-12-31",2004,"B","2004-B",184,250,15,"2004-B",0,0,0,0,265,300,265,0,0,6,5,"YES",6,false,"NO",null,null,null,null,null,null,null,{"$f":"IFERROR(INDEX($CP$4:$CR$48,SMALL(IF((ISERROR(SEARCH($AM$14,PL_YEAR)*SEARCH($AM$14,PL_YEAR)*SEARCH($AM$12,PL_TYPE)))+(COUNTIFS(AL$18:$AL28,PL_YEAR,$AM$18:AM28,PL_DAYS,$AN$18:AN28,PL_TYPE)>0),\"\",ROW(PL_YEAR)-MIN(ROW(PL_YEAR))+1),1),COLUMN(A19)),\"\")","v":""},{"$f":"IFERROR(INDEX($CP$4:$CR$48,SMALL(IF((ISERROR(SEARCH($AM$14,PL_YEAR)*SEARCH($AM$14,PL_YEAR)*SEARCH($AM$12,PL_TYPE)))+(COUNTIFS($AL$18:AM28,PL_YEAR,$AM$18:AN28,PL_DAYS,$AN$18:AO28,PL_TYPE)>0),\"\",ROW(PL_YEAR)-MIN(ROW(PL_YEAR))+1),1),COLUMN(B19)),\"\")","v":""},{"$f":"IFERROR(INDEX($CP$4:$CR$48,SMALL(IF((ISERROR(SEARCH($AM$14,PL_YEAR)*SEARCH($AM$14,PL_YEAR)*SEARCH($AM$12,PL_TYPE)))+(COUNTIFS($AL$18:AN28,PL_YEAR,$AM$18:AO28,PL_DAYS,$AN$18:AP28,PL_TYPE)>0),\"\",ROW(PL_YEAR)-MIN(ROW(PL_YEAR))+1),1),COLUMN(C19)),\"\")","v":""},{"$f":"IFERROR(INDEX($CP$4:$CR$48,SMALL(IF((ISERROR(SEARCH($AM$14,PL_YEAR)*SEARCH($AM$14,PL_YEAR)*SEARCH($AM$12,PL_TYPE)))+(COUNTIFS($AL$18:AO28,PL_YEAR,$AM$18:AP28,PL_DAYS,$AN$18:AQ28,PL_TYPE)>0),\"\",ROW(PL_YEAR)-MIN(ROW(PL_YEAR))+1),1),COLUMN(E19)),\"\")","v":""},{"$f":"IFERROR(INDEX($CP$4:$CR$48,SMALL(IF((ISERROR(SEARCH($AQ$14,PL_YEAR)*SEARCH($AQ$14,PL_YEAR)*SEARCH($AQ$12,PL_TYPE)))+(COUNTIFS($AP$18:AP28,PL_YEAR,$AQ$18:AQ28,PL_DAYS,$AR$18:AR28,PL_TYPE)>0),\"\",ROW(PL_YEAR)-MIN(ROW(PL_YEAR))+1),1),COLUMN(A19)),\"\")","v":""},{"$f":"IFERROR(INDEX($CP$4:$CR$48,SMALL(IF((ISERROR(SEARCH($AQ$14,PL_YEAR)*SEARCH($AQ$14,PL_YEAR)*SEARCH($AQ$12,PL_TYPE)))+(COUNTIFS($AP$18:AQ28,PL_YEAR,$AQ$18:AR28,PL_DAYS,$AR$18:AS28,PL_TYPE)>0),\"\",ROW(PL_YEAR)-MIN(ROW(PL_YEAR))+1),1),COLUMN(B19)),\"\")","v":""},{"$f":"IFERROR(INDEX($CP$4:$CR$48,SMALL(IF((ISERROR(SEARCH($AQ$14,PL_YEAR)*SEARCH($AQ$14,PL_YEAR)*SEARCH($AQ$12,PL_TYPE)))+(COUNTIFS($AP$18:AR28,PL_YEAR,$AQ$18:AS28,PL_DAYS,$AR$18:AT28,PL_TYPE)>0),\"\",ROW(PL_YEAR)-MIN(ROW(PL_YEAR))+1),1),COLUMN(C19)),\"\")","v":""},{"$f":"IFERROR(INDEX($CP$4:$CR$48,SMALL(IF((ISERROR(SEARCH($AM$14,PL_YEAR)*SEARCH($AM$14,PL_YEAR)*SEARCH($AM$12,PL_TYPE)))+(COUNTIFS($AL$18:AS28,PL_YEAR,$AM$18:AT28,PL_DAYS,$AN$18:AU28,PL_TYPE)>0),\"\",ROW(PL_YEAR)-MIN(ROW(PL_YEAR))+1),1),COLUMN(E19)),\"\")","v":""},{"$f":"IFERROR(INDEX($CP$4:$CR$48,SMALL(IF((ISERROR(SEARCH($AU$14,PL_YEAR)*SEARCH($AU$14,PL_YEAR)*SEARCH($AU$12,PL_TYPE)))+(COUNTIFS($AT$18:AT28,PL_YEAR,$AU$18:AU28,PL_DAYS,$AV$18:AV28,PL_TYPE)>0),\"\",ROW(PL_YEAR)-MIN(ROW(PL_YEAR))+1),1),COLUMN(A19)),\"\")","v":""},{"$f":"IFERROR(INDEX($CP$4:$CR$48,SMALL(IF((ISERROR(SEARCH($AU$14,PL_YEAR)*SEARCH($AU$14,PL_YEAR)*SEARCH($AU$12,PL_TYPE)))+(COUNTIFS($AT$18:AU28,PL_YEAR,$AU$18:AV28,PL_DAYS,$AV$18:AW28,PL_TYPE)>0),\"\",ROW(PL_YEAR)-MIN(ROW(PL_YEAR))+1),1),COLUMN(B19)),\"\")","v":""},{"$f":"IFERROR(INDEX($CP$4:$CR$48,SMALL(IF((ISERROR(SEARCH($AU$14,PL_YEAR)*SEARCH($AU$14,PL_YEAR)*SEARCH($AU$12,PL_TYPE)))+(COUNTIFS($AT$18:AV28,PL_YEAR,$AU$18:AW28,PL_DAYS,$AU$18:AW28,PL_TYPE)>0),\"\",ROW(PL_YEAR)-MIN(ROW(PL_YEAR))+1),1),COLUMN(C19)),\"\")","v":""},{"$f":"IFERROR(INDEX($CP$4:$CR$48,SMALL(IF((ISERROR(SEARCH($AU$14,PL_YEAR)*SEARCH($AU$14,PL_YEAR)*SEARCH($AU$12,PL_TYPE)))+(COUNTIFS($AT$18:AW28,PL_YEAR,$AU$18:AW28,PL_DAYS,$AU$18:AW28,PL_TYPE)>0),\"\",ROW(PL_YEAR)-MIN(ROW(PL_YEAR))+1),1),COLUMN(E19)),\"\")","v":""},null,null,null,null,null,null,null,45,null,1,{"$error":"#N/A"},"",{"$f":"IF(PL!E39=\"\",\"\",PL!E39)","v":""},{"$f":"IF(PL!F39=\"\",\"\",PL!F39)","v":""},{"$f":"IF(PL!G39=\"\",\"\",PL!G39)","v":""},{"$f":"IF(PL!H39=\"\",\"\",PL!H39)","v":""},0,null,null,null,null,null,null,null,null,null,null,null,null,null,null,null,null,null,null,null,null,null,null,null,null,null,null,26,{"$f":"INDEX($BK$12:$BK$56,MATCH(ROWS($CO$4:CO29),$CO$4:$CO$48,0))","v":""},{"$f":"INDEX($BN$12:$BN$56,MATCH(ROWS($CO$4:CP29),$CO$4:$CO$48,0))","v":0},{"$f":"INDEX($BJ$12:$BJ$56,MATCH(ROWS($CO$4:CQ29),$CO$4:$CO$48,0))","v":""},"",0,""]
[null,"2005-01-01","2005-06-30","2005-06-30","YES","YES","2005-01-01","2005-06-30",2005,"A","2005-A",181,265,15,"2005-A",0,0,0,0,280,300,280,0,0,6,5,"YES",6,false,"NO",null,null,null,null,null,null,null,{"$f":"IFERROR(INDEX($CP$4:$CR$48,SMALL(IF((ISERROR(SEARCH($AM$14,PL_YEAR)*SEARCH($AM$14,PL_YEAR)*SEARCH($AM$12,PL_TYPE)))+(COUNTIFS(AL$18:$AL29,PL_YEAR,$AM$18:AM29,PL_DAYS,$AN$18:AN29,PL_TYPE)>0),\"\",ROW(PL_YEAR)-MIN(ROW(PL_YEAR))+1),1),COLUMN(A20)),\"\")","v":""},{"$f":"IFERROR(INDEX($CP$4:$CR$48,SMALL(IF((ISERROR(SEARCH($AM$14,PL_YEAR)*SEARCH($AM$14,PL_YEAR)*SEARCH($AM$12,PL_TYPE)))+(COUNTIFS($AL$18:AM29,PL_YEAR,$AM$18:AN29,PL_DAYS,$AN$18:AO29,PL_TYPE)>0),\"\",ROW(PL_YEAR)-MIN(ROW(PL_YEAR))+1),1),COLUMN(B20)),\"\")","v":""},{"$f":"IFERROR(INDEX($CP$4:$CR$48,SMALL(IF((ISERROR(SEARCH($AM$14,PL_YEAR)*SEARCH($AM$14,PL_YEAR)*SEARCH($AM$12,PL_TYPE)))+(COUNTIFS($AL$18:AN29,PL_YEAR,$AM$18:AO29,PL_DAYS,$AN$18:AP29,PL_TYPE)>0),\"\",ROW(PL_YEAR)-MIN(ROW(PL_YEAR))+1),1),COLUMN(C20)),\"\")","v":""},{"$f":"IFERROR(INDEX($CP$4:$CR$48,SMALL(IF((ISERROR(SEARCH($AM$14,PL_YEAR)*SEARCH($AM$14,PL_YEAR)*SEARCH($AM$12,PL_TYPE)))+(COUNTIFS($AL$18:AO29,PL_YEAR,$AM$18:AP29,PL_DAYS,$AN$18:AQ29,PL_TYPE)>0),\"\",ROW(PL_YEAR)-MIN(ROW(PL_YEAR))+1),1),COLUMN(E20)),\"\")","v":""},{"$f":"IFERROR(INDEX($CP$4:$CR$48,SMALL(IF((ISERROR(SEARCH($AQ$14,PL_YEAR)*SEARCH($AQ$14,PL_YEAR)*SEARCH($AQ$12,PL_TYPE)))+(COUNTIFS($AP$18:AP29,PL_YEAR,$AQ$18:AQ29,PL_DAYS,$AR$18:AR29,PL_TYPE)>0),\"\",ROW(PL_YEAR)-MIN(ROW(PL_YEAR))+1),1),COLUMN(A20)),\"\")","v":""},{"$f":"IFERROR(INDEX($CP$4:$CR$48,SMALL(IF((ISERROR(SEARCH($AQ$14,PL_YEAR)*SEARCH($AQ$14,PL_YEAR)*SEARCH($AQ$12,PL_TYPE)))+(COUNTIFS($AP$18:AQ29,PL_YEAR,$AQ$18:AR29,PL_DAYS,$AR$18:AS29,PL_TYPE)>0),\"\",ROW(PL_YEAR)-MIN(ROW(PL_YEAR))+1),1),COLUMN(B20)),\"\")","v":""},{"$f":"IFERROR(INDEX($CP$4:$CR$48,SMALL(IF((ISERROR(SEARCH($AQ$14,PL_YEAR)*SEARCH($AQ$14,PL_YEAR)*SEARCH($AQ$12,PL_TYPE)))+(COUNTIFS($AP$18:AR29,PL_YEAR,$AQ$18:AS29,PL_DAYS,$AR$18:AT29,PL_TYPE)>0),\"\",ROW(PL_YEAR)-MIN(ROW(PL_YEAR))+1),1),COLUMN(C20)),\"\")","v":""},{"$f":"IFERROR(INDEX($CP$4:$CR$48,SMALL(IF((ISERROR(SEARCH($AM$14,PL_YEAR)*SEARCH($AM$14,PL_YEAR)*SEARCH($AM$12,PL_TYPE)))+(COUNTIFS($AL$18:AS29,PL_YEAR,$AM$18:AT29,PL_DAYS,$AN$18:AU29,PL_TYPE)>0),\"\",ROW(PL_YEAR)-MIN(ROW(PL_YEAR))+1),1),COLUMN(E20)),\"\")","v":""},{"$f":"IFERROR(INDEX($CP$4:$CR$48,SMALL(IF((ISERROR(SEARCH($AU$14,PL_YEAR)*SEARCH($AU$14,PL_YEAR)*SEARCH($AU$12,PL_TYPE)))+(COUNTIFS($AT$18:AT29,PL_YEAR,$AU$18:AU29,PL_DAYS,$AV$18:AV29,PL_TYPE)>0),\"\",ROW(PL_YEAR)-MIN(ROW(PL_YEAR))+1),1),COLUMN(A20)),\"\")","v":""},{"$f":"IFERROR(INDEX($CP$4:$CR$48,SMALL(IF((ISERROR(SEARCH($AU$14,PL_YEAR)*SEARCH($AU$14,PL_YEAR)*SEARCH($AU$12,PL_TYPE)))+(COUNTIFS($AT$18:AU29,PL_YEAR,$AU$18:AV29,PL_DAYS,$AV$18:AW29,PL_TYPE)>0),\"\",ROW(PL_YEAR)-MIN(ROW(PL_YEAR))+1),1),COLUMN(B20)),\"\")","v":""},{"$f":"IFERROR(INDEX($CP$4:$CR$48,SMALL(IF((ISERROR(SEARCH($AU$14,PL_YEAR)*SEARCH($AU$14,PL_YEAR)*SEARCH($AU$12,PL_TYPE)))+(COUNTIFS($AT$18:AV29,PL_YEAR,$AU$18:AW29,PL_DAYS,$AU$18:AW29,PL_TYPE)>0),\"\",ROW(PL_YEAR)-MIN(ROW(PL_YEAR))+1),1),COLUMN(C20)),\"\")","v":""},{"$f":"IFERROR(INDEX($CP$4:$CR$48,SMALL(IF((ISERROR(SEARCH($AU$14,PL_YEAR)*SEARCH($AU$14,PL_YEAR)*SEARCH($AU$12,PL_TYPE)))+(COUNTIFS($AT$18:AW29,PL_YEAR,$AU$18:AW29,PL_DAYS,$AU$18:AW29,PL_TYPE)>0),\"\",ROW(PL_YEAR)-MIN(ROW(PL_YEAR))+1),1),COLUMN(E20)),\"\")","v":""},null,null,null,null,null,null,null,45,null,1,{"$error":"#N/A"},"",{"$f":"IF(PL!E40=\"\",\"\",PL!E40)","v":""},{"$f":"IF(PL!F40=\"\",\"\",PL!F40)","v":""},{"$f":"IF(PL!G40=\"\",\"\",PL!G40)","v":""},{"$f":"IF(PL!H40=\"\",\"\",PL!H40)","v":""},0,null,null,null,null,null,null,null,null,null,null,null,null,null,null,null,null,null,null,null,null,null,null,null,null,null,null,27,{"$f":"INDEX($BK$12:$BK$56,MATCH(ROWS($CO$4:CO30),$CO$4:$CO$48,0))","v":""},{"$f":"INDEX($BN$12:$BN$56,MATCH(ROWS($CO$4:CP30),$CO$4:$CO$48,0))","v":0},{"$f":"INDEX($BJ$12:$BJ$56,MATCH(ROWS($CO$4:CQ30),$CO$4:$CO$48,0))","v":""},"",0,""]
[null,"2005-07-01","2005-12-31","2005-12-31","YES","YES","2005-07-01","2005-12-31",2005,"B","2005-B",184,280,15,"2005-B",0,0,0,0,295,300,295,0,0,6,5,"YES",6,false,"NO",null,null,null,null,null,null,null,{"$f":"IFERROR(INDEX($CP$4:$CR$48,SMALL(IF((ISERROR(SEARCH($AM$14,PL_YEAR)*SEARCH($AM$14,PL_YEAR)*SEARCH($AM$12,PL_TYPE)))+(COUNTIFS(AL$18:$AL30,PL_YEAR,$AM$18:AM30,PL_DAYS,$AN$18:AN30,PL_TYPE)>0),\"\",ROW(PL_YEAR)-MIN(ROW(PL_YEAR))+1),1),COLUMN(A21)),\"\")","v":""},{"$f":"IFERROR(INDEX($CP$4:$CR$48,SMALL(IF((ISERROR(SEARCH($AM$14,PL_YEAR)*SEARCH($AM$14,PL_YEAR)*SEARCH($AM$12,PL_TYPE)))+(COUNTIFS($AL$18:AM30,PL_YEAR,$AM$18:AN30,PL_DAYS,$AN$18:AO30,PL_TYPE)>0),\"\",ROW(PL_YEAR)-MIN(ROW(PL_YEAR))+1),1),COLUMN(B21)),\"\")","v":""},{"$f":"IFERROR(INDEX($CP$4:$CR$48,SMALL(IF((ISERROR(SEARCH($AM$14,PL_YEAR)*SEARCH($AM$14,PL_YEAR)*SEARCH($AM$12,PL_TYPE)))+(COUNTIFS($AL$18:AN30,PL_YEAR,$AM$18:AO30,PL_DAYS,$AN$18:AP30,PL_TYPE)>0),\"\",ROW(PL_YEAR)-MIN(ROW(PL_YEAR))+1),1),COLUMN(C21)),\"\")","v":""},{"$f":"IFERROR(INDEX($CP$4:$CR$48,SMALL(IF((ISERROR(SEARCH($AM$14,PL_YEAR)*SEARCH($AM$14,PL_YEAR)*SEARCH($AM$12,PL_TYPE)))+(COUNTIFS($AL$18:AO30,PL_YEAR,$AM$18:AP30,PL_DAYS,$AN$18:AQ30,PL_TYPE)>0),\"\",ROW(PL_YEAR)-MIN(ROW(PL_YEAR))+1),1),COLUMN(E21)),\"\")","v":""},{"$f":"IFERROR(INDEX($CP$4:$CR$48,SMALL(IF((ISERROR(SEARCH($AQ$14,PL_YEAR)*SEARCH($AQ$14,PL_YEAR)*SEARCH($AQ$12,PL_TYPE)))+(COUNTIFS($AP$18:AP30,PL_YEAR,$AQ$18:AQ30,PL_DAYS,$AR$18:AR30,PL_TYPE)>0),\"\",ROW(PL_YEAR)-MIN(ROW(PL_YEAR))+1),1),COLUMN(A21)),\"\")","v":""},{"$f":"IFERROR(INDEX($CP$4:$CR$48,SMALL(IF((ISERROR(SEARCH($AQ$14,PL_YEAR)*SEARCH($AQ$14,PL_YEAR)*SEARCH($AQ$12,PL_TYPE)))+(COUNTIFS($AP$18:AQ30,PL_YEAR,$AQ$18:AR30,PL_DAYS,$AR$18:AS30,PL_TYPE)>0),\"\",ROW(PL_YEAR)-MIN(ROW(PL_YEAR))+1),1),COLUMN(B21)),\"\")","v":""},{"$f":"IFERROR(INDEX($CP$4:$CR$48,SMALL(IF((ISERROR(SEARCH($AQ$14,PL_YEAR)*SEARCH($AQ$14,PL_YEAR)*SEARCH($AQ$12,PL_TYPE)))+(COUNTIFS($AP$18:AR30,PL_YEAR,$AQ$18:AS30,PL_DAYS,$AR$18:AT30,PL_TYPE)>0),\"\",ROW(PL_YEAR)-MIN(ROW(PL_YEAR))+1),1),COLUMN(C21)),\"\")","v":""},{"$f":"IFERROR(INDEX($CP$4:$CR$48,SMALL(IF((ISERROR(SEARCH($AM$14,PL_YEAR)*SEARCH($AM$14,PL_YEAR)*SEARCH($AM$12,PL_TYPE)))+(COUNTIFS($AL$18:AS30,PL_YEAR,$AM$18:AT30,PL_DAYS,$AN$18:AU30,PL_TYPE)>0),\"\",ROW(PL_YEAR)-MIN(ROW(PL_YEAR))+1),1),COLUMN(E21)),\"\")","v":""},{"$f":"IFERROR(INDEX($CP$4:$CR$48,SMALL(IF((ISERROR(SEARCH($AU$14,PL_YEAR)*SEARCH($AU$14,PL_YEAR)*SEARCH($AU$12,PL_TYPE)))+(COUNTIFS($AT$18:AT30,PL_YEAR,$AU$18:AU30,PL_DAYS,$AV$18:AV30,PL_TYPE)>0),\"\",ROW(PL_YEAR)-MIN(ROW(PL_YEAR))+1),1),COLUMN(A21)),\"\")","v":""},{"$f":"IFERROR(INDEX($CP$4:$CR$48,SMALL(IF((ISERROR(SEARCH($AU$14,PL_YEAR)*SEARCH($AU$14,PL_YEAR)*SEARCH($AU$12,PL_TYPE)))+(COUNTIFS($AT$18:AU30,PL_YEAR,$AU$18:AV30,PL_DAYS,$AV$18:AW30,PL_TYPE)>0),\"\",ROW(PL_YEAR)-MIN(ROW(PL_YEAR))+1),1),COLUMN(B21)),\"\")","v":""},{"$f":"IFERROR(INDEX($CP$4:$CR$48,SMALL(IF((ISERROR(SEARCH($AU$14,PL_YEAR)*SEARCH($AU$14,PL_YEAR)*SEARCH($AU$12,PL_TYPE)))+(COUNTIFS($AT$18:AV30,PL_YEAR,$AU$18:AW30,PL_DAYS,$AU$18:AW30,PL_TYPE)>0),\"\",ROW(PL_YEAR)-MIN(ROW(PL_YEAR))+1),1),COLUMN(C21)),\"\")","v":""},{"$f":"IFERROR(INDEX($CP$4:$CR$48,SMALL(IF((ISERROR(SEARCH($AU$14,PL_YEAR)*SEARCH($AU$14,PL_YEAR)*SEARCH($AU$12,PL_TYPE)))+(COUNTIFS($AT$18:AW30,PL_YEAR,$AU$18:AW30,PL_DAYS,$AU$18:AW30,PL_TYPE)>0),\"\",ROW(PL_YEAR)-MIN(ROW(PL_YEAR))+1),1),COLUMN(E21)),\"\")","v":""},null,null,null,null,null,null,null,45,null,1,{"$error":"#N/A"},"",{"$f":"IF(PL!E41=\"\",\"\",PL!E41)","v":""},{"$f":"IF(PL!F41=\"\",\"\",PL!F41)","v":""},{"$f":"IF(PL!G41=\"\",\"\",PL!G41)","v":""},{"$f":"IF(PL!H41=\"\",\"\",PL!H41)","v":""},0,null,null,null,null,null,null,null,null,null,null,null,null,null,null,null,null,null,null,null,null,null,null,null,null,null,null,28,{"$f":"INDEX($BK$12:$BK$56,MATCH(ROWS($CO$4:CO31),$CO$4:$CO$48,0))","v":""},{"$f":"INDEX($BN$12:$BN$56,MATCH(ROWS($CO$4:CP31),$CO$4:$CO$48,0))","v":0},{"$f":"INDEX($BJ$12:$BJ$56,MATCH(ROWS($CO$4:CQ31),$CO$4:$CO$48,0))","v":""},"",0,""]
[null,"2006-01-01","2006-06-30","2006-06-30","YES","YES","2006-01-01","2006-06-30",2006,"A","2006-A",181,295,15,"2006-A",0,0,0,0,310,300,300,0,0,6,5,"YES",6,false,"NO",null,null,null,null,null,null,null,{"$f":"IFERROR(INDEX($CP$4:$CR$48,SMALL(IF((ISERROR(SEARCH($AM$14,PL_YEAR)*SEARCH($AM$14,PL_YEAR)*SEARCH($AM$12,PL_TYPE)))+(COUNTIFS(AL$18:$AL31,PL_YEAR,$AM$18:AM31,PL_DAYS,$AN$18:AN31,PL_TYPE)>0),\"\",ROW(PL_YEAR)-MIN(ROW(PL_YEAR))+1),1),COLUMN(A22)),\"\")","v":""},{"$f":"IFERROR(INDEX($CP$4:$CR$48,SMALL(IF((ISERROR(SEARCH($AM$14,PL_YEAR)*SEARCH($AM$14,PL_YEAR)*SEARCH($AM$12,PL_TYPE)))+(COUNTIFS($AL$18:AM31,PL_YEAR,$AM$18:AN31,PL_DAYS,$AN$18:AO31,PL_TYPE)>0),\"\",ROW(PL_YEAR)-MIN(ROW(PL_YEAR))+1),1),COLUMN(B22)),\"\")","v":""},{"$f":"IFERROR(INDEX($CP$4:$CR$48,SMALL(IF((ISERROR(SEARCH($AM$14,PL_YEAR)*SEARCH($AM$14,PL_YEAR)*SEARCH($AM$12,PL_TYPE)))+(COUNTIFS($AL$18:AN31,PL_YEAR,$AM$18:AO31,PL_DAYS,$AN$18:AP31,PL_TYPE)>0),\"\",ROW(PL_YEAR)-MIN(ROW(PL_YEAR))+1),1),COLUMN(C22)),\"\")","v":""},{"$f":"IFERROR(INDEX($CP$4:$CR$48,SMALL(IF((ISERROR(SEARCH($AM$14,PL_YEAR)*SEARCH($AM$14,PL_YEAR)*SEARCH($AM$12,PL_TYPE)))+(COUNTIFS($AL$18:AO31,PL_YEAR,$AM$18:AP31,PL_DAYS,$AN$18:AQ31,PL_TYPE)>0),\"\",ROW(PL_YEAR)-MIN(ROW(PL_YEAR))+1),1),COLUMN(E22)),\"\")","v":""},{"$f":"IFERROR(INDEX($CP$4:$CR$48,SMALL(IF((ISERROR(SEARCH($AQ$14,PL_YEAR)*SEARCH($AQ$14,PL_YEAR)*SEARCH($AQ$12,PL_TYPE)))+(COUNTIFS($AP$18:AP31,PL_YEAR,$AQ$18:AQ31,PL_DAYS,$AR$18:AR31,PL_TYPE)>0),\"\",ROW(PL_YEAR)-MIN(ROW(PL_YEAR))+1),1),COLUMN(A22)),\"\")","v":""},{"$f":"IFERROR(INDEX($CP$4:$CR$48,SMALL(IF((ISERROR(SEARCH($AQ$14,PL_YEAR)*SEARCH($AQ$14,PL_YEAR)*SEARCH($AQ$12,PL_TYPE)))+(COUNTIFS($AP$18:AQ31,PL_YEAR,$AQ$18:AR31,PL_DAYS,$AR$18:AS31,PL_TYPE)>0),\"\",ROW(PL_YEAR)-MIN(ROW(PL_YEAR))+1),1),COLUMN(B22)),\"\")","v":""},{"$f":"IFERROR(INDEX($CP$4:$CR$48,SMALL(IF((ISERROR(SEARCH($AQ$14,PL_YEAR)*SEARCH($AQ$14,PL_YEAR)*SEARCH($AQ$12,PL_TYPE)))+(COUNTIFS($AP$18:AR31,PL_YEAR,$AQ$18:AS31,PL_DAYS,$AR$18:AT31,PL_TYPE)>0),\"\",ROW(PL_YEAR)-MIN(ROW(PL_YEAR))+1),1),COLUMN(C22)),\"\")","v":""},{"$f":"IFERROR(INDEX($CP$4:$CR$48,SMALL(IF((ISERROR(SEARCH($AM$14,PL_YEAR)*SEARCH($AM$14,PL_YEAR)*SEARCH($AM$12,PL_TYPE)))+(COUNTIFS($AL$18:AS31,PL_YEAR,$AM$18:AT31,PL_DAYS,$AN$18:AU31,PL_TYPE)>0),\"\",ROW(PL_YEAR)-MIN(ROW(PL_YEAR))+1),1),COLUMN(E22)),\"\")","v":""},{"$f":"IFERROR(INDEX($CP$4:$CR$48,SMALL(IF((ISERROR(SEARCH($AU$14,PL_YEAR)*SEARCH($AU$14,PL_YEAR)*SEARCH($AU$12,PL_TYPE)))+(COUNTIFS($AT$18:AT31,PL_YEAR,$AU$18:AU31,PL_DAYS,$AV$18:AV31,PL_TYPE)>0),\"\",ROW(PL_YEAR)-MIN(ROW(PL_YEAR))+1),1),COLUMN(A22)),\"\")","v":""},{"$f":"IFERROR(INDEX($CP$4:$CR$48,SMALL(IF((ISERROR(SEARCH($AU$14,PL_YEAR)*SEARCH($AU$14,PL_YEAR)*SEARCH($AU$12,PL_TYPE)))+(COUNTIFS($AT$18:AU31,PL_YEAR,$AU$18:AV31,PL_DAYS,$AV$18:AW31,PL_TYPE)>0),\"\",ROW(PL_YEAR)-MIN(ROW(PL_YEAR))+1),1),COLUMN(B22)),\"\")","v":""},{"$f":"IFERROR(INDEX($CP$4:$CR$48,SMALL(IF((ISERROR(SEARCH($AU$14,PL_YEAR)*SEARCH($AU$14,PL_YEAR)*SEARCH($AU$12,PL_TYPE)))+(COUNTIFS($AT$18:AV31,PL_YEAR,$AU$18:AW31,PL_DAYS,$AU$18:AW31,PL_TYPE)>0),\"\",ROW(PL_YEAR)-MIN(ROW(PL_YEAR))+1),1),COLUMN(C22)),\"\")","v":""},{"$f":"IFERROR(INDEX($CP$4:$CR$48,SMALL(IF((ISERROR(SEARCH($AU$14,PL_YEAR)*SEARCH($AU$14,PL_YEAR)*SEARCH($AU$12,PL_TYPE)))+(COUNTIFS($AT$18:AW31,PL_YEAR,$AU$18:AW31,PL_DAYS,$AU$18:AW31,PL_TYPE)>0),\"\",ROW(PL_YEAR)-MIN(ROW(PL_YEAR))+1),1),COLUMN(E22)),\"\")","v":""},null,null,null,null,null,null,null,45,null,1,{"$error":"#N/A"},"",{"$f":"IF(PL!E42=\"\",\"\",PL!E42)","v":""},{"$f":"IF(PL!F42=\"\",\"\",PL!F42)","v":""},{"$f":"IF(PL!G42=\"\",\"\",PL!G42)","v":""},{"$f":"IF(PL!H42=\"\",\"\",PL!H42)","v":""},0,null,null,null,null,null,null,null,null,null,null,null,null,null,null,null,null,null,null,null,null,null,null,null,null,null,null,29,{"$f":"INDEX($BK$12:$BK$56,MATCH(ROWS($CO$4:CO32),$CO$4:$CO$48,0))","v":""},{"$f":"INDEX($BN$12:$BN$56,MATCH(ROWS($CO$4:CP32),$CO$4:$CO$48,0))","v":0},{"$f":"INDEX($BJ$12:$BJ$56,MATCH(ROWS($CO$4:CQ32),$CO$4:$CO$48,0))","v":""},"",0,""]
[null,"2006-07-01","2006-12-31","2006-12-31","YES","YES","2006-07-01","2006-12-31",2006,"B","2006-B",184,300,15,"2006-B",0,0,0,0,300,300,300,0,0,6,5,"YES",6,false,"YES",null,null,null,null,null,null,null,{"$f":"IFERROR(INDEX($CP$4:$CR$48,SMALL(IF((ISERROR(SEARCH($AM$14,PL_YEAR)*SEARCH($AM$14,PL_YEAR)*SEARCH($AM$12,PL_TYPE)))+(COUNTIFS(AL$18:$AL32,PL_YEAR,$AM$18:AM32,PL_DAYS,$AN$18:AN32,PL_TYPE)>0),\"\",ROW(PL_YEAR)-MIN(ROW(PL_YEAR))+1),1),COLUMN(A23)),\"\")","v":""},{"$f":"IFERROR(INDEX($CP$4:$CR$48,SMALL(IF((ISERROR(SEARCH($AM$14,PL_YEAR)*SEARCH($AM$14,PL_YEAR)*SEARCH($AM$12,PL_TYPE)))+(COUNTIFS($AL$18:AM32,PL_YEAR,$AM$18:AN32,PL_DAYS,$AN$18:AO32,PL_TYPE)>0),\"\",ROW(PL_YEAR)-MIN(ROW(PL_YEAR))+1),1),COLUMN(B23)),\"\")","v":""},{"$f":"IFERROR(INDEX($CP$4:$CR$48,SMALL(IF((ISERROR(SEARCH($AM$14,PL_YEAR)*SEARCH($AM$14,PL_YEAR)*SEARCH($AM$12,PL_TYPE)))+(COUNTIFS($AL$18:AN32,PL_YEAR,$AM$18:AO32,PL_DAYS,$AN$18:AP32,PL_TYPE)>0),\"\",ROW(PL_YEAR)-MIN(ROW(PL_YEAR))+1),1),COLUMN(C23)),\"\")","v":""},{"$f":"IFERROR(INDEX($CP$4:$CR$48,SMALL(IF((ISERROR(SEARCH($AM$14,PL_YEAR)*SEARCH($AM$14,PL_YEAR)*SEARCH($AM$12,PL_TYPE)))+(COUNTIFS($AL$18:AO32,PL_YEAR,$AM$18:AP32,PL_DAYS,$AN$18:AQ32,PL_TYPE)>0),\"\",ROW(PL_YEAR)-MIN(ROW(PL_YEAR))+1),1),COLUMN(E23)),\"\")","v":""},{"$f":"IFERROR(INDEX($CP$4:$CR$48,SMALL(IF((ISERROR(SEARCH($AQ$14,PL_YEAR)*SEARCH($AQ$14,PL_YEAR)*SEARCH($AQ$12,PL_TYPE)))+(COUNTIFS($AP$18:AP32,PL_YEAR,$AQ$18:AQ32,PL_DAYS,$AR$18:AR32,PL_TYPE)>0),\"\",ROW(PL_YEAR)-MIN(ROW(PL_YEAR))+1),1),COLUMN(A23)),\"\")","v":""},{"$f":"IFERROR(INDEX($CP$4:$CR$48,SMALL(IF((ISERROR(SEARCH($AQ$14,PL_YEAR)*SEARCH($AQ$14,PL_YEAR)*SEARCH($AQ$12,PL_TYPE)))+(COUNTIFS($AP$18:AQ32,PL_YEAR,$AQ$18:AR32,PL_DAYS,$AR$18:AS32,PL_TYPE)>0),\"\",ROW(PL_YEAR)-MIN(ROW(PL_YEAR))+1),1),COLUMN(B23)),\"\")","v":""},{"$f":"IFERROR(INDEX($CP$4:$CR$48,SMALL(IF((ISERROR(SEARCH($AQ$14,PL_YEAR)*SEARCH($AQ$14,PL_YEAR)*SEARCH($AQ$12,PL_TYPE)))+(COUNTIFS($AP$18:AR32,PL_YEAR,$AQ$18:AS32,PL_DAYS,$AR$18:AT32,PL_TYPE)>0),\"\",ROW(PL_YEAR)-MIN(ROW(PL_YEAR))+1),1),COLUMN(C23)),\"\")","v":""},{"$f":"IFERROR(INDEX($CP$4:$CR$48,SMALL(IF((ISERROR(SEARCH($AM$14,PL_YEAR)*SEARCH($AM$14,PL_YEAR)*SEARCH($AM$12,PL_TYPE)))+(COUNTIFS($AL$18:AS32,PL_YEAR,$AM$18:AT32,PL_DAYS,$AN$18:AU32,PL_TYPE)>0),\"\",ROW(PL_YEAR)-MIN(ROW(PL_YEAR))+1),1),COLUMN(E23)),\"\")","v":""},{"$f":"IFERROR(INDEX($CP$4:$CR$48,SMALL(IF((ISERROR(SEARCH($AU$14,PL_YEAR)*SEARCH($AU$14,PL_YEAR)*SEARCH($AU$12,PL_TYPE)))+(COUNTIFS($AT$18:AT32,PL_YEAR,$AU$18:AU32,PL_DAYS,$AV$18:AV32,PL_TYPE)>0),\"\",ROW(PL_YEAR)-MIN(ROW(PL_YEAR))+1),1),COLUMN(A23)),\"\")","v":""},{"$f":"IFERROR(INDEX($CP$4:$CR$48,SMALL(IF((ISERROR(SEARCH($AU$14,PL_YEAR)*SEARCH($AU$14,PL_YEAR)*SEARCH($AU$12,PL_TYPE)))+(COUNTIFS($AT$18:AU32,PL_YEAR,$AU$18:AV32,PL_DAYS,$AV$18:AW32,PL_TYPE)>0),\"\",ROW(PL_YEAR)-MIN(ROW(PL_YEAR))+1),1),COLUMN(B23)),\"\")","v":""},{"$f":"IFERROR(INDEX($CP$4:$CR$48,SMALL(IF((ISERROR(SEARCH($AU$14,PL_YEAR)*SEARCH($AU$14,PL_YEAR)*SEARCH($AU$12,PL_TYPE)))+(COUNTIFS($AT$18:AV32,PL_YEAR,$AU$18:AW32,PL_DAYS,$AU$18:AW32,PL_TYPE)>0),\"\",ROW(PL_YEAR)-MIN(ROW(PL_YEAR))+1),1),COLUMN(C23)),\"\")","v":""},{"$f":"IFERROR(INDEX($CP$4:$CR$48,SMALL(IF((ISERROR(SEARCH($AU$14,PL_YEAR)*SEARCH($AU$14,PL_YEAR)*SEARCH($AU$12,PL_TYPE)))+(COUNTIFS($AT$18:AW32,PL_YEAR,$AU$18:AW32,PL_DAYS,$AU$18:AW32,PL_TYPE)>0),\"\",ROW(PL_YEAR)-MIN(ROW(PL_YEAR))+1),1),COLUMN(E23)),\"\")","v":""},null,null,null,null,null,null,null,45,null,1,{"$error":"#N/A"},"",{"$f":"IF(PL!E43=\"\",\"\",PL!E43)","v":""},{"$f":"IF(PL!F43=\"\",\"\",PL!F43)","v":""},{"$f":"IF(PL!G43=\"\",\"\",PL!G43)","v":""},{"$f":"IF(PL!H43=\"\",\"\",PL!H43)","v":""},0,null,null,null,null,null,null,null,null,null,null,null,null,null,null,null,null,null,null,null,null,null,null,null,null,null,null,30,{"$f":"INDEX($BK$12:$BK$56,MATCH(ROWS($CO$4:CO33),$CO$4:$CO$48,0))","v":""},{"$f":"INDEX($BN$12:$BN$56,MATCH(ROWS($CO$4:CP33),$CO$4:$CO$48,0))","v":0},{"$f":"INDEX($BJ$12:$BJ$56,MATCH(ROWS($CO$4:CQ33),$CO$4:$CO$48,0))","v":""},"",0,""]
[null,"2007-01-01","2007-06-30","2007-06-30","YES","YES","2007-01-01","2007-06-30",2007,"A","2007-A",181,300,15,"2007-A",0,0,0,0,300,300,300,0,0,6,5,"YES",6,false,"YES",null,null,null,null,null,null,null,{"$f":"IFERROR(INDEX($CP$4:$CR$48,SMALL(IF((ISERROR(SEARCH($AM$14,PL_YEAR)*SEARCH($AM$14,PL_YEAR)*SEARCH($AM$12,PL_TYPE)))+(COUNTIFS(AL$18:$AL33,PL_YEAR,$AM$18:AM33,PL_DAYS,$AN$18:AN33,PL_TYPE)>0),\"\",ROW(PL_YEAR)-MIN(ROW(PL_YEAR))+1),1),COLUMN(A24)),\"\")","v":""},{"$f":"IFERROR(INDEX($CP$4:$CR$48,SMALL(IF((ISERROR(SEARCH($AM$14,PL_YEAR)*SEARCH($AM$14,PL_YEAR)*SEARCH($AM$12,PL_TYPE)))+(COUNTIFS($AL$18:AM33,PL_YEAR,$AM$18:AN33,PL_DAYS,$AN$18:AO33,PL_TYPE)>0),\"\",ROW(PL_YEAR)-MIN(ROW(PL_YEAR))+1),1),COLUMN(B24)),\"\")","v":""},{"$f":"IFERROR(INDEX($CP$4:$CR$48,SMALL(IF((ISERROR(SEARCH($AM$14,PL_YEAR)*SEARCH($AM$14,PL_YEAR)*SEARCH($AM$12,PL_TYPE)))+(COUNTIFS($AL$18:AN33,PL_YEAR,$AM$18:AO33,PL_DAYS,$AN$18:AP33,PL_TYPE)>0),\"\",ROW(PL_YEAR)-MIN(ROW(PL_YEAR))+1),1),COLUMN(C24)),\"\")","v":""},{"$f":"IFERROR(INDEX($CP$4:$CR$48,SMALL(IF((ISERROR(SEARCH($AM$14,PL_YEAR)*SEARCH($AM$14,PL_YEAR)*SEARCH($AM$12,PL_TYPE)))+(COUNTIFS($AL$18:AO33,PL_YEAR,$AM$18:AP33,PL_DAYS,$AN$18:AQ33,PL_TYPE)>0),\"\",ROW(PL_YEAR)-MIN(ROW(PL_YEAR))+1),1),COLUMN(E24)),\"\")","v":""},{"$f":"IFERROR(INDEX($CP$4:$CR$48,SMALL(IF((ISERROR(SEARCH($AQ$14,PL_YEAR)*SEARCH($AQ$14,PL_YEAR)*SEARCH($AQ$12,PL_TYPE)))+(COUNTIFS($AP$18:AP33,PL_YEAR,$AQ$18:AQ33,PL_DAYS,$AR$18:AR33,PL_TYPE)>0),\"\",ROW(PL_YEAR)-MIN(ROW(PL_YEAR))+1),1),COLUMN(A24)),\"\")","v":""},{"$f":"IFERROR(INDEX($CP$4:$CR$48,SMALL(IF((ISERROR(SEARCH($AQ$14,PL_YEAR)*SEARCH($AQ$14,PL_YEAR)*SEARCH($AQ$12,PL_TYPE)))+(COUNTIFS($AP$18:AQ33,PL_YEAR,$AQ$18:AR33,PL_DAYS,$AR$18:AS33,PL_TYPE)>0),\"\",ROW(PL_YEAR)-MIN(ROW(PL_YEAR))+1),1),COLUMN(B24)),\"\")","v":""},{"$f":"IFERROR(INDEX($CP$4:$CR$48,SMALL(IF((ISERROR(SEARCH($AQ$14,PL_YEAR)*SEARCH($AQ$14,PL_YEAR)*SEARCH($AQ$12,PL_TYPE)))+(COUNTIFS($AP$18:AR33,PL_YEAR,$AQ$18:AS33,PL_DAYS,$AR$18:AT33,PL_TYPE)>0),\"\",ROW(PL_YEAR)-MIN(ROW(PL_YEAR))+1),1),COLUMN(C24)),\"\")","v":""},{"$f":"IFERROR(INDEX($CP$4:$CR$48,SMALL(IF((ISERROR(SEARCH($AM$14,PL_YEAR)*SEARCH($AM$14,PL_YEAR)*SEARCH($AM$12,PL_TYPE)))+(COUNTIFS($AL$18:AS33,PL_YEAR,$AM$18:AT33,PL_DAYS,$AN$18:AU33,PL_TYPE)>0),\"\",ROW(PL_YEAR)-MIN(ROW(PL_YEAR))+1),1),COLUMN(E24)),\"\")","v":""},{"$f":"IFERROR(INDEX($CP$4:$CR$48,SMALL(IF((ISERROR(SEARCH($AU$14,PL_YEAR)*SEARCH($AU$14,PL_YEAR)*SEARCH($AU$12,PL_TYPE)))+(COUNTIFS($AT$18:AT33,PL_YEAR,$AU$18:AU33,PL_DAYS,$AV$18:AV33,PL_TYPE)>0),\"\",ROW(PL_YEAR)-MIN(ROW(PL_YEAR))+1),1),COLUMN(A24)),\"\")","v":""},{"$f":"IFERROR(INDEX($CP$4:$CR$48,SMALL(IF((ISERROR(SEARCH($AU$14,PL_YEAR)*SEARCH($AU$14,PL_YEAR)*SEARCH($AU$12,PL_TYPE)))+(COUNTIFS($AT$18:AU33,PL_YEAR,$AU$18:AV33,PL_DAYS,$AV$18:AW33,PL_TYPE)>0),\"\",ROW(PL_YEAR)-MIN(ROW(PL_YEAR))+1),1),COLUMN(B24)),\"\")","v":""},{"$f":"IFERROR(INDEX($CP$4:$CR$48,SMALL(IF((ISERROR(SEARCH($AU$14,PL_YEAR)*SEARCH($AU$14,PL_YEAR)*SEARCH($AU$12,PL_TYPE)))+(COUNTIFS($AT$18:AV33,PL_YEAR,$AU$18:AW33,PL_DAYS,$AU$18:AW33,PL_TYPE)>0),\"\",ROW(PL_YEAR)-MIN(ROW(PL_YEAR))+1),1),COLUMN(C24)),\"\")","v":""},{"$f":"IFERROR(INDEX($CP$4:$CR$48,SMALL(IF((ISERROR(SEARCH($AU$14,PL_YEAR)*SEARCH($AU$14,PL_YEAR)*SEARCH($AU$12,PL_TYPE)))+(COUNTIFS($AT$18:AW33,PL_YEAR,$AU$18:AW33,PL_DAYS,$AU$18:AW33,PL_TYPE)>0),\"\",ROW(PL_YEAR)-MIN(ROW(PL_YEAR))+1),1),COLUMN(E24)),\"\")","v":""},null,null,null,null,null,null,null,45,null,1,{"$error":"#N/A"},"",{"$f":"IF(PL!E44=\"\",\"\",PL!E44)","v":""},{"$f":"IF(PL!F44=\"\",\"\",PL!F44)","v":""},{"$f":"IF(PL!G44=\"\",\"\",PL!G44)","v":""},{"$f":"IF(PL!H44=\"\",\"\",PL!H44)","v":""},0,null,null,null,null,null,null,null,null,null,null,null,null,null,null,null,null,null,null,null,null,null,null,null,null,null,null,31,{"$f":"INDEX($BK$12:$BK$56,MATCH(ROWS($CO$4:CO34),$CO$4:$CO$48,0))","v":""},{"$f":"INDEX($BN$12:$BN$56,MATCH(ROWS($CO$4:CP34),$CO$4:$CO$48,0))","v":0},{"$f":"INDEX($BJ$12:$BJ$56,MATCH(ROWS($CO$4:CQ34),$CO$4:$CO$48,0))","v":""},"",0,""]
[null,"2007-07-01","2007-12-31","2007-12-31","YES","YES","2007-07-01","2007-12-31",2007,"B","2007-B",184,300,15,"2007-B",0,0,0,0,300,300,300,0,0,6,5,"YES",6,false,"YES",null,null,null,null,null,null,null,{"$f":"IFERROR(INDEX($CP$4:$CR$48,SMALL(IF((ISERROR(SEARCH($AM$14,PL_YEAR)*SEARCH($AM$14,PL_YEAR)*SEARCH($AM$12,PL_TYPE)))+(COUNTIFS(AL$18:$AL34,PL_YEAR,$AM$18:AM34,PL_DAYS,$AN$18:AN34,PL_TYPE)>0),\"\",ROW(PL_YEAR)-MIN(ROW(PL_YEAR))+1),1),COLUMN(A25)),\"\")","v":""},{"$f":"IFERROR(INDEX($CP$4:$CR$48,SMALL(IF((ISERROR(SEARCH($AM$14,PL_YEAR)*SEARCH($AM$14,PL_YEAR)*SEARCH($AM$12,PL_TYPE)))+(COUNTIFS($AL$18:AM34,PL_YEAR,$AM$18:AN34,PL_DAYS,$AN$18:AO34,PL_TYPE)>0),\"\",ROW(PL_YEAR)-MIN(ROW(PL_YEAR))+1),1),COLUMN(B25)),\"\")","v":""},{"$f":"IFERROR(INDEX($CP$4:$CR$48,SMALL(IF((ISERROR(SEARCH($AM$14,PL_YEAR)*SEARCH($AM$14,PL_YEAR)*SEARCH($AM$12,PL_TYPE)))+(COUNTIFS($AL$18:AN34,PL_YEAR,$AM$18:AO34,PL_DAYS,$AN$18:AP34,PL_TYPE)>0),\"\",ROW(PL_YEAR)-MIN(ROW(PL_YEAR))+1),1),COLUMN(C25)),\"\")","v":""},{"$f":"IFERROR(INDEX($CP$4:$CR$48,SMALL(IF((ISERROR(SEARCH($AM$14,PL_YEAR)*SEARCH($AM$14,PL_YEAR)*SEARCH($AM$12,PL_TYPE)))+(COUNTIFS($AL$18:AO34,PL_YEAR,$AM$18:AP34,PL_DAYS,$AN$18:AQ34,PL_TYPE)>0),\"\",ROW(PL_YEAR)-MIN(ROW(PL_YEAR))+1),1),COLUMN(E25)),\"\")","v":""},{"$f":"IFERROR(INDEX($CP$4:$CR$48,SMALL(IF((ISERROR(SEARCH($AQ$14,PL_YEAR)*SEARCH($AQ$14,PL_YEAR)*SEARCH($AQ$12,PL_TYPE)))+(COUNTIFS($AP$18:AP34,PL_YEAR,$AQ$18:AQ34,PL_DAYS,$AR$18:AR34,PL_TYPE)>0),\"\",ROW(PL_YEAR)-MIN(ROW(PL_YEAR))+1),1),COLUMN(A25)),\"\")","v":""},{"$f":"IFERROR(INDEX($CP$4:$CR$48,SMALL(IF((ISERROR(SEARCH($AQ$14,PL_YEAR)*SEARCH($AQ$14,PL_YEAR)*SEARCH($AQ$12,PL_TYPE)))+(COUNTIFS($AP$18:AQ34,PL_YEAR,$AQ$18:AR34,PL_DAYS,$AR$18:AS34,PL_TYPE)>0),\"\",ROW(PL_YEAR)-MIN(ROW(PL_YEAR))+1),1),COLUMN(B25)),\"\")","v":""},{"$f":"IFERROR(INDEX($CP$4:$CR$48,SMALL(IF((ISERROR(SEARCH($AQ$14,PL_YEAR)*SEARCH($AQ$14,PL_YEAR)*SEARCH($AQ$12,PL_TYPE)))+(COUNTIFS($AP$18:AR34,PL_YEAR,$AQ$18:AS34,PL_DAYS,$AR$18:AT34,PL_TYPE)>0),\"\",ROW(PL_YEAR)-MIN(ROW(PL_YEAR))+1),1),COLUMN(C25)),\"\")","v":""},{"$f":"IFERROR(INDEX($CP$4:$CR$48,SMALL(IF((ISERROR(SEARCH($AM$14,PL_YEAR)*SEARCH($AM$14,PL_YEAR)*SEARCH($AM$12,PL_TYPE)))+(COUNTIFS($AL$18:AS34,PL_YEAR,$AM$18:AT34,PL_DAYS,$AN$18:AU34,PL_TYPE)>0),\"\",ROW(PL_YEAR)-MIN(ROW(PL_YEAR))+1),1),COLUMN(E25)),\"\")","v":""},{"$f":"IFERROR(INDEX($CP$4:$CR$48,SMALL(IF((ISERROR(SEARCH($AU$14,PL_YEAR)*SEARCH($AU$14,PL_YEAR)*SEARCH($AU$12,PL_TYPE)))+(COUNTIFS($AT$18:AT34,PL_YEAR,$AU$18:AU34,PL_DAYS,$AV$18:AV34,PL_TYPE)>0),\"\",ROW(PL_YEAR)-MIN(ROW(PL_YEAR))+1),1),COLUMN(A25)),\"\")","v":""},{"$f":"IFERROR(INDEX($CP$4:$CR$48,SMALL(IF((ISERROR(SEARCH($AU$14,PL_YEAR)*SEARCH($AU$14,PL_YEAR)*SEARCH($AU$12,PL_TYPE)))+(COUNTIFS($AT$18:AU34,PL_YEAR,$AU$18:AV34,PL_DAYS,$AV$18:AW34,PL_TYPE)>0),\"\",ROW(PL_YEAR)-MIN(ROW(PL_YEAR))+1),1),COLUMN(B25)),\"\")","v":""},{"$f":"IFERROR(INDEX($CP$4:$CR$48,SMALL(IF((ISERROR(SEARCH($AU$14,PL_YEAR)*SEARCH($AU$14,PL_YEAR)*SEARCH($AU$12,PL_TYPE)))+(COUNTIFS($AT$18:AV34,PL_YEAR,$AU$18:AW34,PL_DAYS,$AU$18:AW34,PL_TYPE)>0),\"\",ROW(PL_YEAR)-MIN(ROW(PL_YEAR))+1),1),COLUMN(C25)),\"\")","v":""},{"$f":"IFERROR(INDEX($CP$4:$CR$48,SMALL(IF((ISERROR(SEARCH($AU$14,PL_YEAR)*SEARCH($AU$14,PL_YEAR)*SEARCH($AU$12,PL_TYPE)))+(COUNTIFS($AT$18:AW34,PL_YEAR,$AU$18:AW34,PL_DAYS,$AU$18:AW34,PL_TYPE)>0),\"\",ROW(PL_YEAR)-MIN(ROW(PL_YEAR))+1),1),COLUMN(E25)),\"\")","v":""},null,null,null,null,null,null,null,45,null,1,{"$error":"#N/A"},"",{"$f":"IF(PL!E45=\"\",\"\",PL!E45)","v":""},{"$f":"IF(PL!F45=\"\",\"\",PL!F45)","v":""},{"$f":"IF(PL!G45=\"\",\"\",PL!G45)","v":""},{"$f":"IF(PL!H45=\"\",\"\",PL!H45)","v":""},0,null,null,null,null,null,null,null,null,null,null,null,null,null,null,null,null,null,null,null,null,null,null,null,null,null,null,32,{"$f":"INDEX($BK$12:$BK$56,MATCH(ROWS($CO$4:CO35),$CO$4:$CO$48,0))","v":""},{"$f":"INDEX($BN$12:$BN$56,MATCH(ROWS($CO$4:CP35),$CO$4:$CO$48,0))","v":0},{"$f":"INDEX($BJ$12:$BJ$56,MATCH(ROWS($CO$4:CQ35),$CO$4:$CO$48,0))","v":""},"",0,""]
[null,"2008-01-01","2008-06-30","2008-06-30","YES","YES","2008-01-01","2008-06-30",2008,"A","2008-A",182,300,15,"2008-A",0,0,0,0,300,300,300,0,0,6,5,"YES",6,false,"YES",null,null,null,null,null,null,null,{"$f":"IFERROR(INDEX($CP$4:$CR$48,SMALL(IF((ISERROR(SEARCH($AM$14,PL_YEAR)*SEARCH($AM$14,PL_YEAR)*SEARCH($AM$12,PL_TYPE)))+(COUNTIFS(AL$18:$AL35,PL_YEAR,$AM$18:AM35,PL_DAYS,$AN$18:AN35,PL_TYPE)>0),\"\",ROW(PL_YEAR)-MIN(ROW(PL_YEAR))+1),1),COLUMN(A26)),\"\")","v":""},{"$f":"IFERROR(INDEX($CP$4:$CR$48,SMALL(IF((ISERROR(SEARCH($AM$14,PL_YEAR)*SEARCH($AM$14,PL_YEAR)*SEARCH($AM$12,PL_TYPE)))+(COUNTIFS($AL$18:AM35,PL_YEAR,$AM$18:AN35,PL_DAYS,$AN$18:AO35,PL_TYPE)>0),\"\",ROW(PL_YEAR)-MIN(ROW(PL_YEAR))+1),1),COLUMN(B26)),\"\")","v":""},{"$f":"IFERROR(INDEX($CP$4:$CR$48,SMALL(IF((ISERROR(SEARCH($AM$14,PL_YEAR)*SEARCH($AM$14,PL_YEAR)*SEARCH($AM$12,PL_TYPE)))+(COUNTIFS($AL$18:AN35,PL_YEAR,$AM$18:AO35,PL_DAYS,$AN$18:AP35,PL_TYPE)>0),\"\",ROW(PL_YEAR)-MIN(ROW(PL_YEAR))+1),1),COLUMN(C26)),\"\")","v":""},{"$f":"IFERROR(INDEX($CP$4:$CR$48,SMALL(IF((ISERROR(SEARCH($AM$14,PL_YEAR)*SEARCH($AM$14,PL_YEAR)*SEARCH($AM$12,PL_TYPE)))+(COUNTIFS($AL$18:AO35,PL_YEAR,$AM$18:AP35,PL_DAYS,$AN$18:AQ35,PL_TYPE)>0),\"\",ROW(PL_YEAR)-MIN(ROW(PL_YEAR))+1),1),COLUMN(E26)),\"\")","v":""},{"$f":"IFERROR(INDEX($CP$4:$CR$48,SMALL(IF((ISERROR(SEARCH($AQ$14,PL_YEAR)*SEARCH($AQ$14,PL_YEAR)*SEARCH($AQ$12,PL_TYPE)))+(COUNTIFS($AP$18:AP35,PL_YEAR,$AQ$18:AQ35,PL_DAYS,$AR$18:AR35,PL_TYPE)>0),\"\",ROW(PL_YEAR)-MIN(ROW(PL_YEAR))+1),1),COLUMN(A26)),\"\")","v":""},{"$f":"IFERROR(INDEX($CP$4:$CR$48,SMALL(IF((ISERROR(SEARCH($AQ$14,PL_YEAR)*SEARCH($AQ$14,PL_YEAR)*SEARCH($AQ$12,PL_TYPE)))+(COUNTIFS($AP$18:AQ35,PL_YEAR,$AQ$18:AR35,PL_DAYS,$AR$18:AS35,PL_TYPE)>0),\"\",ROW(PL_YEAR)-MIN(ROW(PL_YEAR))+1),1),COLUMN(B26)),\"\")","v":""},{"$f":"IFERROR(INDEX($CP$4:$CR$48,SMALL(IF((ISERROR(SEARCH($AQ$14,PL_YEAR)*SEARCH($AQ$14,PL_YEAR)*SEARCH($AQ$12,PL_TYPE)))+(COUNTIFS($AP$18:AR35,PL_YEAR,$AQ$18:AS35,PL_DAYS,$AR$18:AT35,PL_TYPE)>0),\"\",ROW(PL_YEAR)-MIN(ROW(PL_YEAR))+1),1),COLUMN(C26)),\"\")","v":""},{"$f":"IFERROR(INDEX($CP$4:$CR$48,SMALL(IF((ISERROR(SEARCH($AM$14,PL_YEAR)*SEARCH($AM$14,PL_YEAR)*SEARCH($AM$12,PL_TYPE)))+(COUNTIFS($AL$18:AS35,PL_YEAR,$AM$18:AT35,PL_DAYS,$AN$18:AU35,PL_TYPE)>0),\"\",ROW(PL_YEAR)-MIN(ROW(PL_YEAR))+1),1),COLUMN(E26)),\"\")","v":""},{"$f":"IFERROR(INDEX($CP$4:$CR$48,SMALL(IF((ISERROR(SEARCH($AU$14,PL_YEAR)*SEARCH($AU$14,PL_YEAR)*SEARCH($AU$12,PL_TYPE)))+(COUNTIFS($AT$18:AT35,PL_YEAR,$AU$18:AU35,PL_DAYS,$AV$18:AV35,PL_TYPE)>0),\"\",ROW(PL_YEAR)-MIN(ROW(PL_YEAR))+1),1),COLUMN(A26)),\"\")","v":""},{"$f":"IFERROR(INDEX($CP$4:$CR$48,SMALL(IF((ISERROR(SEARCH($AU$14,PL_YEAR)*SEARCH($AU$14,PL_YEAR)*SEARCH($AU$12,PL_TYPE)))+(COUNTIFS($AT$18:AU35,PL_YEAR,$AU$18:AV35,PL_DAYS,$AV$18:AW35,PL_TYPE)>0),\"\",ROW(PL_YEAR)-MIN(ROW(PL_YEAR))+1),1),COLUMN(B26)),\"\")","v":""},{"$f":"IFERROR(INDEX($CP$4:$CR$48,SMALL(IF((ISERROR(SEARCH($AU$14,PL_YEAR)*SEARCH($AU$14,PL_YEAR)*SEARCH($AU$12,PL_TYPE)))+(COUNTIFS($AT$18:AV35,PL_YEAR,$AU$18:AW35,PL_DAYS,$AU$18:AW35,PL_TYPE)>0),\"\",ROW(PL_YEAR)-MIN(ROW(PL_YEAR))+1),1),COLUMN(C26)),\"\")","v":""},{"$f":"IFERROR(INDEX($CP$4:$CR$48,SMALL(IF((ISERROR(SEARCH($AU$14,PL_YEAR)*SEARCH($AU$14,PL_YEAR)*SEARCH($AU$12,PL_TYPE)))+(COUNTIFS($AT$18:AW35,PL_YEAR,$AU$18:AW35,PL_DAYS,$AU$18:AW35,PL_TYPE)>0),\"\",ROW(PL_YEAR)-MIN(ROW(PL_YEAR))+1),1),COLUMN(E26)),\"\")","v":""},null,null,null,null,null,null,null,45,null,1,{"$error":"#N/A"},"",{"$f":"IF(PL!E46=\"\",\"\",PL!E46)","v":""},{"$f":"IF(PL!F46=\"\",\"\",PL!F46)","v":""},{"$f":"IF(PL!G46=\"\",\"\",PL!G46)","v":""},{"$f":"IF(PL!H46=\"\",\"\",PL!H46)","v":""},0,null,null,null,null,null,null,null,null,null,null,null,null,null,null,null,null,null,null,null,null,null,null,null,null,null,null,33,{"$f":"INDEX($BK$12:$BK$56,MATCH(ROWS($CO$4:CO36),$CO$4:$CO$48,0))","v":""},{"$f":"INDEX($BN$12:$BN$56,MATCH(ROWS($CO$4:CP36),$CO$4:$CO$48,0))","v":0},{"$f":"INDEX($BJ$12:$BJ$56,MATCH(ROWS($CO$4:CQ36),$CO$4:$CO$48,0))","v":""},"",0,""]
[null,"2008-07-01","2008-12-31","2008-12-31","YES","YES","2008-07-01","2008-12-31",2008,"B","2008-B",184,300,15,"2008-B",0,0,0,0,300,300,300,0,0,6,5,"YES",6,false,"YES",null,null,null,null,null,null,null,{"$f":"IFERROR(INDEX($CP$4:$CR$48,SMALL(IF((ISERROR(SEARCH($AM$14,PL_YEAR)*SEARCH($AM$14,PL_YEAR)*SEARCH($AM$12,PL_TYPE)))+(COUNTIFS(AL$18:$AL36,PL_YEAR,$AM$18:AM36,PL_DAYS,$AN$18:AN36,PL_TYPE)>0),\"\",ROW(PL_YEAR)-MIN(ROW(PL_YEAR))+1),1),COLUMN(A27)),\"\")","v":""},{"$f":"IFERROR(INDEX($CP$4:$CR$48,SMALL(IF((ISERROR(SEARCH($AM$14,PL_YEAR)*SEARCH($AM$14,PL_YEAR)*SEARCH($AM$12,PL_TYPE)))+(COUNTIFS($AL$18:AM36,PL_YEAR,$AM$18:AN36,PL_DAYS,$AN$18:AO36,PL_TYPE)>0),\"\",ROW(PL_YEAR)-MIN(ROW(PL_YEAR))+1),1),COLUMN(B27)),\"\")","v":""},{"$f":"IFERROR(INDEX($CP$4:$CR$48,SMALL(IF((ISERROR(SEARCH($AM$14,PL_YEAR)*SEARCH($AM$14,PL_YEAR)*SEARCH($AM$12,PL_TYPE)))+(COUNTIFS($AL$18:AN36,PL_YEAR,$AM$18:AO36,PL_DAYS,$AN$18:AP36,PL_TYPE)>0),\"\",ROW(PL_YEAR)-MIN(ROW(PL_YEAR))+1),1),COLUMN(C27)),\"\")","v":""},{"$f":"IFERROR(INDEX($CP$4:$CR$48,SMALL(IF((ISERROR(SEARCH($AM$14,PL_YEAR)*SEARCH($AM$14,PL_YEAR)*SEARCH($AM$12,PL_TYPE)))+(COUNTIFS($AL$18:AO36,PL_YEAR,$AM$18:AP36,PL_DAYS,$AN$18:AQ36,PL_TYPE)>0),\"\",ROW(PL_YEAR)-MIN(ROW(PL_YEAR))+1),1),COLUMN(E27)),\"\")","v":""},{"$f":"IFERROR(INDEX($CP$4:$CR$48,SMALL(IF((ISERROR(SEARCH($AQ$14,PL_YEAR)*SEARCH($AQ$14,PL_YEAR)*SEARCH($AQ$12,PL_TYPE)))+(COUNTIFS($AP$18:AP36,PL_YEAR,$AQ$18:AQ36,PL_DAYS,$AR$18:AR36,PL_TYPE)>0),\"\",ROW(PL_YEAR)-MIN(ROW(PL_YEAR))+1),1),COLUMN(A27)),\"\")","v":""},{"$f":"IFERROR(INDEX($CP$4:$CR$48,SMALL(IF((ISERROR(SEARCH($AQ$14,PL_YEAR)*SEARCH($AQ$14,PL_YEAR)*SEARCH($AQ$12,PL_TYPE)))+(COUNTIFS($AP$18:AQ36,PL_YEAR,$AQ$18:AR36,PL_DAYS,$AR$18:AS36,PL_TYPE)>0),\"\",ROW(PL_YEAR)-MIN(ROW(PL_YEAR))+1),1),COLUMN(B27)),\"\")","v":""},{"$f":"IFERROR(INDEX($CP$4:$CR$48,SMALL(IF((ISERROR(SEARCH($AQ$14,PL_YEAR)*SEARCH($AQ$14,PL_YEAR)*SEARCH($AQ$12,PL_TYPE)))+(COUNTIFS($AP$18:AR36,PL_YEAR,$AQ$18:AS36,PL_DAYS,$AR$18:AT36,PL_TYPE)>0),\"\",ROW(PL_YEAR)-MIN(ROW(PL_YEAR))+1),1),COLUMN(C27)),\"\")","v":""},{"$f":"IFERROR(INDEX($CP$4:$CR$48,SMALL(IF((ISERROR(SEARCH($AM$14,PL_YEAR)*SEARCH($AM$14,PL_YEAR)*SEARCH($AM$12,PL_TYPE)))+(COUNTIFS($AL$18:AS36,PL_YEAR,$AM$18:AT36,PL_DAYS,$AN$18:AU36,PL_TYPE)>0),\"\",ROW(PL_YEAR)-MIN(ROW(PL_YEAR))+1),1),COLUMN(E27)),\"\")","v":""},{"$f":"IFERROR(INDEX($CP$4:$CR$48,SMALL(IF((ISERROR(SEARCH($AU$14,PL_YEAR)*SEARCH($AU$14,PL_YEAR)*SEARCH($AU$12,PL_TYPE)))+(COUNTIFS($AT$18:AT36,PL_YEAR,$AU$18:AU36,PL_DAYS,$AV$18:AV36,PL_TYPE)>0),\"\",ROW(PL_YEAR)-MIN(ROW(PL_YEAR))+1),1),COLUMN(A27)),\"\")","v":""},{"$f":"IFERROR(INDEX($CP$4:$CR$48,SMALL(IF((ISERROR(SEARCH($AU$14,PL_YEAR)*SEARCH($AU$14,PL_YEAR)*SEARCH($AU$12,PL_TYPE)))+(COUNTIFS($AT$18:AU36,PL_YEAR,$AU$18:AV36,PL_DAYS,$AV$18:AW36,PL_TYPE)>0),\"\",ROW(PL_YEAR)-MIN(ROW(PL_YEAR))+1),1),COLUMN(B27)),\"\")","v":""},{"$f":"IFERROR(INDEX($CP$4:$CR$48,SMALL(IF((ISERROR(SEARCH($AU$14,PL_YEAR)*SEARCH($AU$14,PL_YEAR)*SEARCH($AU$12,PL_TYPE)))+(COUNTIFS($AT$18:AV36,PL_YEAR,$AU$18:AW36,PL_DAYS,$AU$18:AW36,PL_TYPE)>0),\"\",ROW(PL_YEAR)-MIN(ROW(PL_YEAR))+1),1),COLUMN(C27)),\"\")","v":""},{"$f":"IFERROR(INDEX($CP$4:$CR$48,SMALL(IF((ISERROR(SEARCH($AU$14,PL_YEAR)*SEARCH($AU$14,PL_YEAR)*SEARCH($AU$12,PL_TYPE)))+(COUNTIFS($AT$18:AW36,PL_YEAR,$AU$18:AW36,PL_DAYS,$AU$18:AW36,PL_TYPE)>0),\"\",ROW(PL_YEAR)-MIN(ROW(PL_YEAR))+1),1),COLUMN(E27)),\"\")","v":""},null,null,null,null,null,null,null,45,null,1,{"$error":"#N/A"},"",{"$f":"IF(PL!E47=\"\",\"\",PL!E47)","v":""},{"$f":"IF(PL!F47=\"\",\"\",PL!F47)","v":""},{"$f":"IF(PL!G47=\"\",\"\",PL!G47)","v":""},{"$f":"IF(PL!H47=\"\",\"\",PL!H47)","v":""},0,null,null,null,null,null,null,null,null,null,null,null,null,null,null,null,null,null,null,null,null,null,null,null,null,null,null,34,{"$f":"INDEX($BK$12:$BK$56,MATCH(ROWS($CO$4:CO37),$CO$4:$CO$48,0))","v":""},{"$f":"INDEX($BN$12:$BN$56,MATCH(ROWS($CO$4:CP37),$CO$4:$CO$48,0))","v":0},{"$f":"INDEX($BJ$12:$BJ$56,MATCH(ROWS($CO$4:CQ37),$CO$4:$CO$48,0))","v":""},"",0,""]
[null,"2009-01-01","2009-06-30","2009-06-30","YES","YES","2009-01-01","2009-06-30",2009,"A","2009-A",181,300,15,"2009-A",0,0,0,0,300,300,300,0,0,6,5,"YES",6,false,"YES",null,null,null,null,null,null,null,{"$f":"IFERROR(INDEX($CP$4:$CR$48,SMALL(IF((ISERROR(SEARCH($AM$14,PL_YEAR)*SEARCH($AM$14,PL_YEAR)*SEARCH($AM$12,PL_TYPE)))+(COUNTIFS(AL$18:$AL37,PL_YEAR,$AM$18:AM37,PL_DAYS,$AN$18:AN37,PL_TYPE)>0),\"\",ROW(PL_YEAR)-MIN(ROW(PL_YEAR))+1),1),COLUMN(A28)),\"\")","v":""},{"$f":"IFERROR(INDEX($CP$4:$CR$48,SMALL(IF((ISERROR(SEARCH($AM$14,PL_YEAR)*SEARCH($AM$14,PL_YEAR)*SEARCH($AM$12,PL_TYPE)))+(COUNTIFS($AL$18:AM37,PL_YEAR,$AM$18:AN37,PL_DAYS,$AN$18:AO37,PL_TYPE)>0),\"\",ROW(PL_YEAR)-MIN(ROW(PL_YEAR))+1),1),COLUMN(B28)),\"\")","v":""},{"$f":"IFERROR(INDEX($CP$4:$CR$48,SMALL(IF((ISERROR(SEARCH($AM$14,PL_YEAR)*SEARCH($AM$14,PL_YEAR)*SEARCH($AM$12,PL_TYPE)))+(COUNTIFS($AL$18:AN37,PL_YEAR,$AM$18:AO37,PL_DAYS,$AN$18:AP37,PL_TYPE)>0),\"\",ROW(PL_YEAR)-MIN(ROW(PL_YEAR))+1),1),COLUMN(C28)),\"\")","v":""},{"$f":"IFERROR(INDEX($CP$4:$CR$48,SMALL(IF((ISERROR(SEARCH($AM$14,PL_YEAR)*SEARCH($AM$14,PL_YEAR)*SEARCH($AM$12,PL_TYPE)))+(COUNTIFS($AL$18:AO37,PL_YEAR,$AM$18:AP37,PL_DAYS,$AN$18:AQ37,PL_TYPE)>0),\"\",ROW(PL_YEAR)-MIN(ROW(PL_YEAR))+1),1),COLUMN(E28)),\"\")","v":""},{"$f":"IFERROR(INDEX($CP$4:$CR$48,SMALL(IF((ISERROR(SEARCH($AQ$14,PL_YEAR)*SEARCH($AQ$14,PL_YEAR)*SEARCH($AQ$12,PL_TYPE)))+(COUNTIFS($AP$18:AP37,PL_YEAR,$AQ$18:AQ37,PL_DAYS,$AR$18:AR37,PL_TYPE)>0),\"\",ROW(PL_YEAR)-MIN(ROW(PL_YEAR))+1),1),COLUMN(A28)),\"\")","v":""},{"$f":"IFERROR(INDEX($CP$4:$CR$48,SMALL(IF((ISERROR(SEARCH($AQ$14,PL_YEAR)*SEARCH($AQ$14,PL_YEAR)*SEARCH($AQ$12,PL_TYPE)))+(COUNTIFS($AP$18:AQ37,PL_YEAR,$AQ$18:AR37,PL_DAYS,$AR$18:AS37,PL_TYPE)>0),\"\",ROW(PL_YEAR)-MIN(ROW(PL_YEAR))+1),1),COLUMN(B28)),\"\")","v":""},{"$f":"IFERROR(INDEX($CP$4:$CR$48,SMALL(IF((ISERROR(SEARCH($AQ$14,PL_YEAR)*SEARCH($AQ$14,PL_YEAR)*SEARCH($AQ$12,PL_TYPE)))+(COUNTIFS($AP$18:AR37,PL_YEAR,$AQ$18:AS37,PL_DAYS,$AR$18:AT37,PL_TYPE)>0),\"\",ROW(PL_YEAR)-MIN(ROW(PL_YEAR))+1),1),COLUMN(C28)),\"\")","v":""},{"$f":"IFERROR(INDEX($CP$4:$CR$48,SMALL(IF((ISERROR(SEARCH($AM$14,PL_YEAR)*SEARCH($AM$14,PL_YEAR)*SEARCH($AM$12,PL_TYPE)))+(COUNTIFS($AL$18:AS37,PL_YEAR,$AM$18:AT37,PL_DAYS,$AN$18:AU37,PL_TYPE)>0),\"\",ROW(PL_YEAR)-MIN(ROW(PL_YEAR))+1),1),COLUMN(E28)),\"\")","v":""},{"$f":"IFERROR(INDEX($CP$4:$CR$48,SMALL(IF((ISERROR(SEARCH($AU$14,PL_YEAR)*SEARCH($AU$14,PL_YEAR)*SEARCH($AU$12,PL_TYPE)))+(COUNTIFS($AT$18:AT37,PL_YEAR,$AU$18:AU37,PL_DAYS,$AV$18:AV37,PL_TYPE)>0),\"\",ROW(PL_YEAR)-MIN(ROW(PL_YEAR))+1),1),COLUMN(A28)),\"\")","v":""},{"$f":"IFERROR(INDEX($CP$4:$CR$48,SMALL(IF((ISERROR(SEARCH($AU$14,PL_YEAR)*SEARCH($AU$14,PL_YEAR)*SEARCH($AU$12,PL_TYPE)))+(COUNTIFS($AT$18:AU37,PL_YEAR,$AU$18:AV37,PL_DAYS,$AV$18:AW37,PL_TYPE)>0),\"\",ROW(PL_YEAR)-MIN(ROW(PL_YEAR))+1),1),COLUMN(B28)),\"\")","v":""},{"$f":"IFERROR(INDEX($CP$4:$CR$48,SMALL(IF((ISERROR(SEARCH($AU$14,PL_YEAR)*SEARCH($AU$14,PL_YEAR)*SEARCH($AU$12,PL_TYPE)))+(COUNTIFS($AT$18:AV37,PL_YEAR,$AU$18:AW37,PL_DAYS,$AU$18:AW37,PL_TYPE)>0),\"\",ROW(PL_YEAR)-MIN(ROW(PL_YEAR))+1),1),COLUMN(C28)),\"\")","v":""},{"$f":"IFERROR(INDEX($CP$4:$CR$48,SMALL(IF((ISERROR(SEARCH($AU$14,PL_YEAR)*SEARCH($AU$14,PL_YEAR)*SEARCH($AU$12,PL_TYPE)))+(COUNTIFS($AT$18:AW37,PL_YEAR,$AU$18:AW37,PL_DAYS,$AU$18:AW37,PL_TYPE)>0),\"\",ROW(PL_YEAR)-MIN(ROW(PL_YEAR))+1),1),COLUMN(E28)),\"\")","v":""},null,null,null,null,null,null,null,45,null,1,{"$error":"#N/A"},"",{"$f":"IF(PL!E48=\"\",\"\",PL!E48)","v":""},{"$f":"IF(PL!F48=\"\",\"\",PL!F48)","v":""},{"$f":"IF(PL!G48=\"\",\"\",PL!G48)","v":""},{"$f":"IF(PL!H48=\"\",\"\",PL!H48)","v":""},0,null,null,null,null,null,null,null,null,null,null,null,null,null,null,null,null,null,null,null,null,null,null,null,null,null,null,35,{"$f":"INDEX($BK$12:$BK$56,MATCH(ROWS($CO$4:CO38),$CO$4:$CO$48,0))","v":""},{"$f":"INDEX($BN$12:$BN$56,MATCH(ROWS($CO$4:CP38),$CO$4:$CO$48,0))","v":0},{"$f":"INDEX($BJ$12:$BJ$56,MATCH(ROWS($CO$4:CQ38),$CO$4:$CO$48,0))","v":""},"",0,""]
[null,"2009-07-01","2009-12-31","2009-12-31","YES","YES","2009-07-01","2009-12-31",2009,"B","2009-B",184,300,15,"2009-B",0,0,0,0,300,300,300,0,0,6,5,"YES",6,false,"YES",null,null,null,null,null,null,null,{"$f":"IFERROR(INDEX($CP$4:$CR$48,SMALL(IF((ISERROR(SEARCH($AM$14,PL_YEAR)*SEARCH($AM$14,PL_YEAR)*SEARCH($AM$12,PL_TYPE)))+(COUNTIFS(AL$18:$AL38,PL_YEAR,$AM$18:AM38,PL_DAYS,$AN$18:AN38,PL_TYPE)>0),\"\",ROW(PL_YEAR)-MIN(ROW(PL_YEAR))+1),1),COLUMN(A29)),\"\")","v":""},{"$f":"IFERROR(INDEX($CP$4:$CR$48,SMALL(IF((ISERROR(SEARCH($AM$14,PL_YEAR)*SEARCH($AM$14,PL_YEAR)*SEARCH($AM$12,PL_TYPE)))+(COUNTIFS($AL$18:AM38,PL_YEAR,$AM$18:AN38,PL_DAYS,$AN$18:AO38,PL_TYPE)>0),\"\",ROW(PL_YEAR)-MIN(ROW(PL_YEAR))+1),1),COLUMN(B29)),\"\")","v":""},{"$f":"IFERROR(INDEX($CP$4:$CR$48,SMALL(IF((ISERROR(SEARCH($AM$14,PL_YEAR)*SEARCH($AM$14,PL_YEAR)*SEARCH($AM$12,PL_TYPE)))+(COUNTIFS($AL$18:AN38,PL_YEAR,$AM$18:AO38,PL_DAYS,$AN$18:AP38,PL_TYPE)>0),\"\",ROW(PL_YEAR)-MIN(ROW(PL_YEAR))+1),1),COLUMN(C29)),\"\")","v":""},{"$f":"IFERROR(INDEX($CP$4:$CR$48,SMALL(IF((ISERROR(SEARCH($AM$14,PL_YEAR)*SEARCH($AM$14,PL_YEAR)*SEARCH($AM$12,PL_TYPE)))+(COUNTIFS($AL$18:AO38,PL_YEAR,$AM$18:AP38,PL_DAYS,$AN$18:AQ38,PL_TYPE)>0),\"\",ROW(PL_YEAR)-MIN(ROW(PL_YEAR))+1),1),COLUMN(E29)),\"\")","v":""},{"$f":"IFERROR(INDEX($CP$4:$CR$48,SMALL(IF((ISERROR(SEARCH($AQ$14,PL_YEAR)*SEARCH($AQ$14,PL_YEAR)*SEARCH($AQ$12,PL_TYPE)))+(COUNTIFS($AP$18:AP38,PL_YEAR,$AQ$18:AQ38,PL_DAYS,$AR$18:AR38,PL_TYPE)>0),\"\",ROW(PL_YEAR)-MIN(ROW(PL_YEAR))+1),1),COLUMN(A29)),\"\")","v":""},{"$f":"IFERROR(INDEX($CP$4:$CR$48,SMALL(IF((ISERROR(SEARCH($AQ$14,PL_YEAR)*SEARCH($AQ$14,PL_YEAR)*SEARCH($AQ$12,PL_TYPE)))+(COUNTIFS($AP$18:AQ38,PL_YEAR,$AQ$18:AR38,PL_DAYS,$AR$18:AS38,PL_TYPE)>0),\"\",ROW(PL_YEAR)-MIN(ROW(PL_YEAR))+1),1),COLUMN(B29)),\"\")","v":""},{"$f":"IFERROR(INDEX($CP$4:$CR$48,SMALL(IF((ISERROR(SEARCH($AQ$14,PL_YEAR)*SEARCH($AQ$14,PL_YEAR)*SEARCH($AQ$12,PL_TYPE)))+(COUNTIFS($AP$18:AR38,PL_YEAR,$AQ$18:AS38,PL_DAYS,$AR$18:AT38,PL_TYPE)>0),\"\",ROW(PL_YEAR)-MIN(ROW(PL_YEAR))+1),1),COLUMN(C29)),\"\")","v":""},{"$f":"IFERROR(INDEX($CP$4:$CR$48,SMALL(IF((ISERROR(SEARCH($AM$14,PL_YEAR)*SEARCH($AM$14,PL_YEAR)*SEARCH($AM$12,PL_TYPE)))+(COUNTIFS($AL$18:AS38,PL_YEAR,$AM$18:AT38,PL_DAYS,$AN$18:AU38,PL_TYPE)>0),\"\",ROW(PL_YEAR)-MIN(ROW(PL_YEAR))+1),1),COLUMN(E29)),\"\")","v":""},{"$f":"IFERROR(INDEX($CP$4:$CR$48,SMALL(IF((ISERROR(SEARCH($AU$14,PL_YEAR)*SEARCH($AU$14,PL_YEAR)*SEARCH($AU$12,PL_TYPE)))+(COUNTIFS($AT$18:AT38,PL_YEAR,$AU$18:AU38,PL_DAYS,$AV$18:AV38,PL_TYPE)>0),\"\",ROW(PL_YEAR)-MIN(ROW(PL_YEAR))+1),1),COLUMN(A29)),\"\")","v":""},{"$f":"IFERROR(INDEX($CP$4:$CR$48,SMALL(IF((ISERROR(SEARCH($AU$14,PL_YEAR)*SEARCH($AU$14,PL_YEAR)*SEARCH($AU$12,PL_TYPE)))+(COUNTIFS($AT$18:AU38,PL_YEAR,$AU$18:AV38,PL_DAYS,$AV$18:AW38,PL_TYPE)>0),\"\",ROW(PL_YEAR)-MIN(ROW(PL_YEAR))+1),1),COLUMN(B29)),\"\")","v":""},{"$f":"IFERROR(INDEX($CP$4:$CR$48,SMALL(IF((ISERROR(SEARCH($AU$14,PL_YEAR)*SEARCH($AU$14,PL_YEAR)*SEARCH($AU$12,PL_TYPE)))+(COUNTIFS($AT$18:AV38,PL_YEAR,$AU$18:AW38,PL_DAYS,$AU$18:AW38,PL_TYPE)>0),\"\",ROW(PL_YEAR)-MIN(ROW(PL_YEAR))+1),1),COLUMN(C29)),\"\")","v":""},{"$f":"IFERROR(INDEX($CP$4:$CR$48,SMALL(IF((ISERROR(SEARCH($AU$14,PL_YEAR)*SEARCH($AU$14,PL_YEAR)*SEARCH($AU$12,PL_TYPE)))+(COUNTIFS($AT$18:AW38,PL_YEAR,$AU$18:AW38,PL_DAYS,$AU$18:AW38,PL_TYPE)>0),\"\",ROW(PL_YEAR)-MIN(ROW(PL_YEAR))+1),1),COLUMN(E29)),\"\")","v":""},null,null,null,null,null,null,null,45,null,1,{"$error":"#N/A"},"",{"$f":"IF(PL!E49=\"\",\"\",PL!E49)","v":""},{"$f":"IF(PL!F49=\"\",\"\",PL!F49)","v":""},{"$f":"IF(PL!G49=\"\",\"\",PL!G49)","v":""},{"$f":"IF(PL!H49=\"\",\"\",PL!H49)","v":""},0,null,null,null,null,null,null,null,null,null,null,null,null,null,null,null,null,null,null,null,null,null,null,null,null,null,null,36,{"$f":"INDEX($BK$12:$BK$56,MATCH(ROWS($CO$4:CO39),$CO$4:$CO$48,0))","v":""},{"$f":"INDEX($BN$12:$BN$56,MATCH(ROWS($CO$4:CP39),$CO$4:$CO$48,0))","v":0},{"$f":"INDEX($BJ$12:$BJ$56,MATCH(ROWS($CO$4:CQ39),$CO$4:$CO$48,0))","v":""},"",0,""]
[null,"2010-01-01","2010-06-30","2010-06-30","YES","YES","2010-01-01","2010-06-30",2010,"A","2010-A",181,300,15,"2010-A",0,0,0,0,300,300,300,0,0,6,5,"YES",6,false,"YES",null,null,null,null,null,null,null,{"$f":"IFERROR(INDEX($CP$4:$CR$48,SMALL(IF((ISERROR(SEARCH($AM$14,PL_YEAR)*SEARCH($AM$14,PL_YEAR)*SEARCH($AM$12,PL_TYPE)))+(COUNTIFS(AL$18:$AL39,PL_YEAR,$AM$18:AM39,PL_DAYS,$AN$18:AN39,PL_TYPE)>0),\"\",ROW(PL_YEAR)-MIN(ROW(PL_YEAR))+1),1),COLUMN(A30)),\"\")","v":""},{"$f":"IFERROR(INDEX($CP$4:$CR$48,SMALL(IF((ISERROR(SEARCH($AM$14,PL_YEAR)*SEARCH($AM$14,PL_YEAR)*SEARCH($AM$12,PL_TYPE)))+(COUNTIFS($AL$18:AM39,PL_YEAR,$AM$18:AN39,PL_DAYS,$AN$18:AO39,PL_TYPE)>0),\"\",ROW(PL_YEAR)-MIN(ROW(PL_YEAR))+1),1),COLUMN(B30)),\"\")","v":""},{"$f":"IFERROR(INDEX($CP$4:$CR$48,SMALL(IF((ISERROR(SEARCH($AM$14,PL_YEAR)*SEARCH($AM$14,PL_YEAR)*SEARCH($AM$12,PL_TYPE)))+(COUNTIFS($AL$18:AN39,PL_YEAR,$AM$18:AO39,PL_DAYS,$AN$18:AP39,PL_TYPE)>0),\"\",ROW(PL_YEAR)-MIN(ROW(PL_YEAR))+1),1),COLUMN(C30)),\"\")","v":""},{"$f":"IFERROR(INDEX($CP$4:$CR$48,SMALL(IF((ISERROR(SEARCH($AM$14,PL_YEAR)*SEARCH($AM$14,PL_YEAR)*SEARCH($AM$12,PL_TYPE)))+(COUNTIFS($AL$18:AO39,PL_YEAR,$AM$18:AP39,PL_DAYS,$AN$18:AQ39,PL_TYPE)>0),\"\",ROW(PL_YEAR)-MIN(ROW(PL_YEAR))+1),1),COLUMN(E30)),\"\")","v":""},{"$f":"IFERROR(INDEX($CP$4:$CR$48,SMALL(IF((ISERROR(SEARCH($AQ$14,PL_YEAR)*SEARCH($AQ$14,PL_YEAR)*SEARCH($AQ$12,PL_TYPE)))+(COUNTIFS($AP$18:AP39,PL_YEAR,$AQ$18:AQ39,PL_DAYS,$AR$18:AR39,PL_TYPE)>0),\"\",ROW(PL_YEAR)-MIN(ROW(PL_YEAR))+1),1),COLUMN(A30)),\"\")","v":""},{"$f":"IFERROR(INDEX($CP$4:$CR$48,SMALL(IF((ISERROR(SEARCH($AQ$14,PL_YEAR)*SEARCH($AQ$14,PL_YEAR)*SEARCH($AQ$12,PL_TYPE)))+(COUNTIFS($AP$18:AQ39,PL_YEAR,$AQ$18:AR39,PL_DAYS,$AR$18:AS39,PL_TYPE)>0),\"\",ROW(PL_YEAR)-MIN(ROW(PL_YEAR))+1),1),COLUMN(B30)),\"\")","v":""},{"$f":"IFERROR(INDEX($CP$4:$CR$48,SMALL(IF((ISERROR(SEARCH($AQ$14,PL_YEAR)*SEARCH($AQ$14,PL_YEAR)*SEARCH($AQ$12,PL_TYPE)))+(COUNTIFS($AP$18:AR39,PL_YEAR,$AQ$18:AS39,PL_DAYS,$AR$18:AT39,PL_TYPE)>0),\"\",ROW(PL_YEAR)-MIN(ROW(PL_YEAR))+1),1),COLUMN(C30)),\"\")","v":""},{"$f":"IFERROR(INDEX($CP$4:$CR$48,SMALL(IF((ISERROR(SEARCH($AM$14,PL_YEAR)*SEARCH($AM$14,PL_YEAR)*SEARCH($AM$12,PL_TYPE)))+(COUNTIFS($AL$18:AS39,PL_YEAR,$AM$18:AT39,PL_DAYS,$AN$18:AU39,PL_TYPE)>0),\"\",ROW(PL_YEAR)-MIN(ROW(PL_YEAR))+1),1),COLUMN(E30)),\"\")","v":""},{"$f":"IFERROR(INDEX($CP$4:$CR$48,SMALL(IF((ISERROR(SEARCH($AU$14,PL_YEAR)*SEARCH($AU$14,PL_YEAR)*SEARCH($AU$12,PL_TYPE)))+(COUNTIFS($AT$18:AT39,PL_YEAR,$AU$18:AU39,PL_DAYS,$AV$18:AV39,PL_TYPE)>0),\"\",ROW(PL_YEAR)-MIN(ROW(PL_YEAR))+1),1),COLUMN(A30)),\"\")","v":""},{"$f":"IFERROR(INDEX($CP$4:$CR$48,SMALL(IF((ISERROR(SEARCH($AU$14,PL_YEAR)*SEARCH($AU$14,PL_YEAR)*SEARCH($AU$12,PL_TYPE)))+(COUNTIFS($AT$18:AU39,PL_YEAR,$AU$18:AV39,PL_DAYS,$AV$18:AW39,PL_TYPE)>0),\"\",ROW(PL_YEAR)-MIN(ROW(PL_YEAR))+1),1),COLUMN(B30)),\"\")","v":""},{"$f":"IFERROR(INDEX($CP$4:$CR$48,SMALL(IF((ISERROR(SEARCH($AU$14,PL_YEAR)*SEARCH($AU$14,PL_YEAR)*SEARCH($AU$12,PL_TYPE)))+(COUNTIFS($AT$18:AV39,PL_YEAR,$AU$18:AW39,PL_DAYS,$AU$18:AW39,PL_TYPE)>0),\"\",ROW(PL_YEAR)-MIN(ROW(PL_YEAR))+1),1),COLUMN(C30)),\"\")","v":""},{"$f":"IFERROR(INDEX($CP$4:$CR$48,SMALL(IF((ISERROR(SEARCH($AU$14,PL_YEAR)*SEARCH($AU$14,PL_YEAR)*SEARCH($AU$12,PL_TYPE)))+(COUNTIFS($AT$18:AW39,PL_YEAR,$AU$18:AW39,PL_DAYS,$AU$18:AW39,PL_TYPE)>0),\"\",ROW(PL_YEAR)-MIN(ROW(PL_YEAR))+1),1),COLUMN(E30)),\"\")","v":""},null,null,null,null,null,null,null,45,null,1,{"$error":"#N/A"},"",{"$f":"IF(PL!E50=\"\",\"\",PL!E50)","v":""},{"$f":"IF(PL!F50=\"\",\"\",PL!F50)","v":""},{"$f":"IF(PL!G50=\"\",\"\",PL!G50)","v":""},{"$f":"IF(PL!H50=\"\",\"\",PL!H50)","v":""},0,null,null,null,null,null,null,null,null,null,null,null,null,null,null,null,null,null,null,null,null,null,null,null,null,null,null,37,{"$f":"INDEX($BK$12:$BK$56,MATCH(ROWS($CO$4:CO40),$CO$4:$CO$48,0))","v":""},{"$f":"INDEX($BN$12:$BN$56,MATCH(ROWS($CO$4:CP40),$CO$4:$CO$48,0))","v":0},{"$f":"INDEX($BJ$12:$BJ$56,MATCH(ROWS($CO$4:CQ40),$CO$4:$CO$48,0))","v":""},"",0,""]
[null,"2010-07-01","2010-12-31","2010-12-31","YES","YES","2010-07-01","2010-12-31",2010,"B","2010-B",184,300,15,"2010-B",0,0,0,0,300,300,300,0,0,6,5,"YES",6,false,"YES",null,null,null,null,null,null,null,{"$f":"IFERROR(INDEX($CP$4:$CR$48,SMALL(IF((ISERROR(SEARCH($AM$14,PL_YEAR)*SEARCH($AM$14,PL_YEAR)*SEARCH($AM$12,PL_TYPE)))+(COUNTIFS(AL$18:$AL40,PL_YEAR,$AM$18:AM40,PL_DAYS,$AN$18:AN40,PL_TYPE)>0),\"\",ROW(PL_YEAR)-MIN(ROW(PL_YEAR))+1),1),COLUMN(A31)),\"\")","v":""},{"$f":"IFERROR(INDEX($CP$4:$CR$48,SMALL(IF((ISERROR(SEARCH($AM$14,PL_YEAR)*SEARCH($AM$14,PL_YEAR)*SEARCH($AM$12,PL_TYPE)))+(COUNTIFS($AL$18:AM40,PL_YEAR,$AM$18:AN40,PL_DAYS,$AN$18:AO40,PL_TYPE)>0),\"\",ROW(PL_YEAR)-MIN(ROW(PL_YEAR))+1),1),COLUMN(B31)),\"\")","v":""},{"$f":"IFERROR(INDEX($CP$4:$CR$48,SMALL(IF((ISERROR(SEARCH($AM$14,PL_YEAR)*SEARCH($AM$14,PL_YEAR)*SEARCH($AM$12,PL_TYPE)))+(COUNTIFS($AL$18:AN40,PL_YEAR,$AM$18:AO40,PL_DAYS,$AN$18:AP40,PL_TYPE)>0),\"\",ROW(PL_YEAR)-MIN(ROW(PL_YEAR))+1),1),COLUMN(C31)),\"\")","v":""},{"$f":"IFERROR(INDEX($CP$4:$CR$48,SMALL(IF((ISERROR(SEARCH($AM$14,PL_YEAR)*SEARCH($AM$14,PL_YEAR)*SEARCH($AM$12,PL_TYPE)))+(COUNTIFS($AL$18:AO40,PL_YEAR,$AM$18:AP40,PL_DAYS,$AN$18:AQ40,PL_TYPE)>0),\"\",ROW(PL_YEAR)-MIN(ROW(PL_YEAR))+1),1),COLUMN(E31)),\"\")","v":""},{"$f":"IFERROR(INDEX($CP$4:$CR$48,SMALL(IF((ISERROR(SEARCH($AQ$14,PL_YEAR)*SEARCH($AQ$14,PL_YEAR)*SEARCH($AQ$12,PL_TYPE)))+(COUNTIFS($AP$18:AP40,PL_YEAR,$AQ$18:AQ40,PL_DAYS,$AR$18:AR40,PL_TYPE)>0),\"\",ROW(PL_YEAR)-MIN(ROW(PL_YEAR))+1),1),COLUMN(A31)),\"\")","v":""},{"$f":"IFERROR(INDEX($CP$4:$CR$48,SMALL(IF((ISERROR(SEARCH($AQ$14,PL_YEAR)*SEARCH($AQ$14,PL_YEAR)*SEARCH($AQ$12,PL_TYPE)))+(COUNTIFS($AP$18:AQ40,PL_YEAR,$AQ$18:AR40,PL_DAYS,$AR$18:AS40,PL_TYPE)>0),\"\",ROW(PL_YEAR)-MIN(ROW(PL_YEAR))+1),1),COLUMN(B31)),\"\")","v":""},{"$f":"IFERROR(INDEX($CP$4:$CR$48,SMALL(IF((ISERROR(SEARCH($AQ$14,PL_YEAR)*SEARCH($AQ$14,PL_YEAR)*SEARCH($AQ$12,PL_TYPE)))+(COUNTIFS($AP$18:AR40,PL_YEAR,$AQ$18:AS40,PL_DAYS,$AR$18:AT40,PL_TYPE)>0),\"\",ROW(PL_YEAR)-MIN(ROW(PL_YEAR))+1),1),COLUMN(C31)),\"\")","v":""},{"$f":"IFERROR(INDEX($CP$4:$CR$48,SMALL(IF((ISERROR(SEARCH($AM$14,PL_YEAR)*SEARCH($AM$14,PL_YEAR)*SEARCH($AM$12,PL_TYPE)))+(COUNTIFS($AL$18:AS40,PL_YEAR,$AM$18:AT40,PL_DAYS,$AN$18:AU40,PL_TYPE)>0),\"\",ROW(PL_YEAR)-MIN(ROW(PL_YEAR))+1),1),COLUMN(E31)),\"\")","v":""},{"$f":"IFERROR(INDEX($CP$4:$CR$48,SMALL(IF((ISERROR(SEARCH($AU$14,PL_YEAR)*SEARCH($AU$14,PL_YEAR)*SEARCH($AU$12,PL_TYPE)))+(COUNTIFS($AT$18:AT40,PL_YEAR,$AU$18:AU40,PL_DAYS,$AV$18:AV40,PL_TYPE)>0),\"\",ROW(PL_YEAR)-MIN(ROW(PL_YEAR))+1),1),COLUMN(A31)),\"\")","v":""},{"$f":"IFERROR(INDEX($CP$4:$CR$48,SMALL(IF((ISERROR(SEARCH($AU$14,PL_YEAR)*SEARCH($AU$14,PL_YEAR)*SEARCH($AU$12,PL_TYPE)))+(COUNTIFS($AT$18:AU40,PL_YEAR,$AU$18:AV40,PL_DAYS,$AV$18:AW40,PL_TYPE)>0),\"\",ROW(PL_YEAR)-MIN(ROW(PL_YEAR))+1),1),COLUMN(B31)),\"\")","v":""},{"$f":"IFERROR(INDEX($CP$4:$CR$48,SMALL(IF((ISERROR(SEARCH($AU$14,PL_YEAR)*SEARCH($AU$14,PL_YEAR)*SEARCH($AU$12,PL_TYPE)))+(COUNTIFS($AT$18:AV40,PL_YEAR,$AU$18:AW40,PL_DAYS,$AU$18:AW40,PL_TYPE)>0),\"\",ROW(PL_YEAR)-MIN(ROW(PL_YEAR))+1),1),COLUMN(C31)),\"\")","v":""},{"$f":"IFERROR(INDEX($CP$4:$CR$48,SMALL(IF((ISERROR(SEARCH($AU$14,PL_YEAR)*SEARCH($AU$14,PL_YEAR)*SEARCH($AU$12,PL_TYPE)))+(COUNTIFS($AT$18:AW40,PL_YEAR,$AU$18:AW40,PL_DAYS,$AU$18:AW40,PL_TYPE)>0),\"\",ROW(PL_YEAR)-MIN(ROW(PL_YEAR))+1),1),COLUMN(E31)),\"\")","v":""},null,null,null,null,null,null,null,45,null,1,{"$error":"#N/A"},"",{"$f":"IF(PL!E51=\"\",\"\",PL!E51)","v":""},{"$f":"IF(PL!F51=\"\",\"\",PL!F51)","v":""},{"$f":"IF(PL!G51=\"\",\"\",PL!G51)","v":""},{"$f":"IF(PL!H51=\"\",\"\",PL!H51)","v":""},0,null,null,null,null,null,null,null,null,null,null,null,null,null,null,null,null,null,null,null,null,null,null,null,null,null,null,38,{"$f":"INDEX($BK$12:$BK$56,MATCH(ROWS($CO$4:CO41),$CO$4:$CO$48,0))","v":""},{"$f":"INDEX($BN$12:$BN$56,MATCH(ROWS($CO$4:CP41),$CO$4:$CO$48,0))","v":0},{"$f":"INDEX($BJ$12:$BJ$56,MATCH(ROWS($CO$4:CQ41),$CO$4:$CO$48,0))","v":""},"",0,""]
[null,"2011-01-01","2011-06-30","2011-06-30","YES","YES","2011-01-01","2011-06-30",2011,"A","2011-A",181,300,15,"2011-A",0,0,0,0,300,300,300,0,0,6,5,"YES",6,false,"YES",null,null,null,null,null,null,null,{"$f":"IFERROR(INDEX($CP$4:$CR$48,SMALL(IF((ISERROR(SEARCH($AM$14,PL_YEAR)*SEARCH($AM$14,PL_YEAR)*SEARCH($AM$12,PL_TYPE)))+(COUNTIFS(AL$18:$AL41,PL_YEAR,$AM$18:AM41,PL_DAYS,$AN$18:AN41,PL_TYPE)>0),\"\",ROW(PL_YEAR)-MIN(ROW(PL_YEAR))+1),1),COLUMN(A32)),\"\")","v":""},{"$f":"IFERROR(INDEX($CP$4:$CR$48,SMALL(IF((ISERROR(SEARCH($AM$14,PL_YEAR)*SEARCH($AM$14,PL_YEAR)*SEARCH($AM$12,PL_TYPE)))+(COUNTIFS($AL$18:AM41,PL_YEAR,$AM$18:AN41,PL_DAYS,$AN$18:AO41,PL_TYPE)>0),\"\",ROW(PL_YEAR)-MIN(ROW(PL_YEAR))+1),1),COLUMN(B32)),\"\")","v":""},{"$f":"IFERROR(INDEX($CP$4:$CR$48,SMALL(IF((ISERROR(SEARCH($AM$14,PL_YEAR)*SEARCH($AM$14,PL_YEAR)*SEARCH($AM$12,PL_TYPE)))+(COUNTIFS($AL$18:AN41,PL_YEAR,$AM$18:AO41,PL_DAYS,$AN$18:AP41,PL_TYPE)>0),\"\",ROW(PL_YEAR)-MIN(ROW(PL_YEAR))+1),1),COLUMN(C32)),\"\")","v":""},{"$f":"IFERROR(INDEX($CP$4:$CR$48,SMALL(IF((ISERROR(SEARCH($AM$14,PL_YEAR)*SEARCH($AM$14,PL_YEAR)*SEARCH($AM$12,PL_TYPE)))+(COUNTIFS($AL$18:AO41,PL_YEAR,$AM$18:AP41,PL_DAYS,$AN$18:AQ41,PL_TYPE)>0),\"\",ROW(PL_YEAR)-MIN(ROW(PL_YEAR))+1),1),COLUMN(E32)),\"\")","v":""},{"$f":"IFERROR(INDEX($CP$4:$CR$48,SMALL(IF((ISERROR(SEARCH($AQ$14,PL_YEAR)*SEARCH($AQ$14,PL_YEAR)*SEARCH($AQ$12,PL_TYPE)))+(COUNTIFS($AP$18:AP41,PL_YEAR,$AQ$18:AQ41,PL_DAYS,$AR$18:AR41,PL_TYPE)>0),\"\",ROW(PL_YEAR)-MIN(ROW(PL_YEAR))+1),1),COLUMN(A32)),\"\")","v":""},{"$f":"IFERROR(INDEX($CP$4:$CR$48,SMALL(IF((ISERROR(SEARCH($AQ$14,PL_YEAR)*SEARCH($AQ$14,PL_YEAR)*SEARCH($AQ$12,PL_TYPE)))+(COUNTIFS($AP$18:AQ41,PL_YEAR,$AQ$18:AR41,PL_DAYS,$AR$18:AS41,PL_TYPE)>0),\"\",ROW(PL_YEAR)-MIN(ROW(PL_YEAR))+1),1),COLUMN(B32)),\"\")","v":""},{"$f":"IFERROR(INDEX($CP$4:$CR$48,SMALL(IF((ISERROR(SEARCH($AQ$14,PL_YEAR)*SEARCH($AQ$14,PL_YEAR)*SEARCH($AQ$12,PL_TYPE)))+(COUNTIFS($AP$18:AR41,PL_YEAR,$AQ$18:AS41,PL_DAYS,$AR$18:AT41,PL_TYPE)>0),\"\",ROW(PL_YEAR)-MIN(ROW(PL_YEAR))+1),1),COLUMN(C32)),\"\")","v":""},{"$f":"IFERROR(INDEX($CP$4:$CR$48,SMALL(IF((ISERROR(SEARCH($AM$14,PL_YEAR)*SEARCH($AM$14,PL_YEAR)*SEARCH($AM$12,PL_TYPE)))+(COUNTIFS($AL$18:AS41,PL_YEAR,$AM$18:AT41,PL_DAYS,$AN$18:AU41,PL_TYPE)>0),\"\",ROW(PL_YEAR)-MIN(ROW(PL_YEAR))+1),1),COLUMN(E32)),\"\")","v":""},{"$f":"IFERROR(INDEX($CP$4:$CR$48,SMALL(IF((ISERROR(SEARCH($AU$14,PL_YEAR)*SEARCH($AU$14,PL_YEAR)*SEARCH($AU$12,PL_TYPE)))+(COUNTIFS($AT$18:AT41,PL_YEAR,$AU$18:AU41,PL_DAYS,$AV$18:AV41,PL_TYPE)>0),\"\",ROW(PL_YEAR)-MIN(ROW(PL_YEAR))+1),1),COLUMN(A32)),\"\")","v":""},{"$f":"IFERROR(INDEX($CP$4:$CR$48,SMALL(IF((ISERROR(SEARCH($AU$14,PL_YEAR)*SEARCH($AU$14,PL_YEAR)*SEARCH($AU$12,PL_TYPE)))+(COUNTIFS($AT$18:AU41,PL_YEAR,$AU$18:AV41,PL_DAYS,$AV$18:AW41,PL_TYPE)>0),\"\",ROW(PL_YEAR)-MIN(ROW(PL_YEAR))+1),1),COLUMN(B32)),\"\")","v":""},{"$f":"IFERROR(INDEX($CP$4:$CR$48,SMALL(IF((ISERROR(SEARCH($AU$14,PL_YEAR)*SEARCH($AU$14,PL_YEAR)*SEARCH($AU$12,PL_TYPE)))+(COUNTIFS($AT$18:AV41,PL_YEAR,$AU$18:AW41,PL_DAYS,$AU$18:AW41,PL_TYPE)>0),\"\",ROW(PL_YEAR)-MIN(ROW(PL_YEAR))+1),1),COLUMN(C32)),\"\")","v":""},{"$f":"IFERROR(INDEX($CP$4:$CR$48,SMALL(IF((ISERROR(SEARCH($AU$14,PL_YEAR)*SEARCH($AU$14,PL_YEAR)*SEARCH($AU$12,PL_TYPE)))+(COUNTIFS($AT$18:AW41,PL_YEAR,$AU$18:AW41,PL_DAYS,$AU$18:AW41,PL_TYPE)>0),\"\",ROW(PL_YEAR)-MIN(ROW(PL_YEAR))+1),1),COLUMN(E32)),\"\")","v":""},null,null,null,null,null,null,null,45,null,1,{"$error":"#N/A"},"",{"$f":"IF(PL!E52=\"\",\"\",PL!E52)","v":""},{"$f":"IF(PL!F52=\"\",\"\",PL!F52)","v":""},{"$f":"IF(PL!G52=\"\",\"\",PL!G52)","v":""},{"$f":"IF(PL!H52=\"\",\"\",PL!H52)","v":""},0,null,null,null,null,null,null,null,null,null,null,null,null,null,null,null,null,null,null,null,null,null,null,null,null,null,null,39,{"$f":"INDEX($BK$12:$BK$56,MATCH(ROWS($CO$4:CO42),$CO$4:$CO$48,0))","v":""},{"$f":"INDEX($BN$12:$BN$56,MATCH(ROWS($CO$4:CP42),$CO$4:$CO$48,0))","v":0},{"$f":"INDEX($BJ$12:$BJ$56,MATCH(ROWS($CO$4:CQ42),$CO$4:$CO$48,0))","v":""},"",0,""]
[null,"2011-07-01","2011-12-31","2011-12-31","YES","YES","2011-07-01","2011-12-31",2011,"B","2011-B",184,300,15,"2011-B",0,0,0,0,300,300,300,0,0,6,5,"YES",6,false,"YES",null,null,null,null,null,null,null,{"$f":"IFERROR(INDEX($CP$4:$CR$48,SMALL(IF((ISERROR(SEARCH($AM$14,PL_YEAR)*SEARCH($AM$14,PL_YEAR)*SEARCH($AM$12,PL_TYPE)))+(COUNTIFS(AL$18:$AL42,PL_YEAR,$AM$18:AM42,PL_DAYS,$AN$18:AN42,PL_TYPE)>0),\"\",ROW(PL_YEAR)-MIN(ROW(PL_YEAR))+1),1),COLUMN(A33)),\"\")","v":""},{"$f":"IFERROR(INDEX($CP$4:$CR$48,SMALL(IF((ISERROR(SEARCH($AM$14,PL_YEAR)*SEARCH($AM$14,PL_YEAR)*SEARCH($AM$12,PL_TYPE)))+(COUNTIFS($AL$18:AM42,PL_YEAR,$AM$18:AN42,PL_DAYS,$AN$18:AO42,PL_TYPE)>0),\"\",ROW(PL_YEAR)-MIN(ROW(PL_YEAR))+1),1),COLUMN(B33)),\"\")","v":""},{"$f":"IFERROR(INDEX($CP$4:$CR$48,SMALL(IF((ISERROR(SEARCH($AM$14,PL_YEAR)*SEARCH($AM$14,PL_YEAR)*SEARCH($AM$12,PL_TYPE)))+(COUNTIFS($AL$18:AN42,PL_YEAR,$AM$18:AO42,PL_DAYS,$AN$18:AP42,PL_TYPE)>0),\"\",ROW(PL_YEAR)-MIN(ROW(PL_YEAR))+1),1),COLUMN(C33)),\"\")","v":""},{"$f":"IFERROR(INDEX($CP$4:$CR$48,SMALL(IF((ISERROR(SEARCH($AM$14,PL_YEAR)*SEARCH($AM$14,PL_YEAR)*SEARCH($AM$12,PL_TYPE)))+(COUNTIFS($AL$18:AO42,PL_YEAR,$AM$18:AP42,PL_DAYS,$AN$18:AQ42,PL_TYPE)>0),\"\",ROW(PL_YEAR)-MIN(ROW(PL_YEAR))+1),1),COLUMN(E33)),\"\")","v":""},{"$f":"IFERROR(INDEX($CP$4:$CR$48,SMALL(IF((ISERROR(SEARCH($AQ$14,PL_YEAR)*SEARCH($AQ$14,PL_YEAR)*SEARCH($AQ$12,PL_TYPE)))+(COUNTIFS($AP$18:AP42,PL_YEAR,$AQ$18:AQ42,PL_DAYS,$AR$18:AR42,PL_TYPE)>0),\"\",ROW(PL_YEAR)-MIN(ROW(PL_YEAR))+1),1),COLUMN(A33)),\"\")","v":""},{"$f":"IFERROR(INDEX($CP$4:$CR$48,SMALL(IF((ISERROR(SEARCH($AQ$14,PL_YEAR)*SEARCH($AQ$14,PL_YEAR)*SEARCH($AQ$12,PL_TYPE)))+(COUNTIFS($AP$18:AQ42,PL_YEAR,$AQ$18:AR42,PL_DAYS,$AR$18:AS42,PL_TYPE)>0),\"\",ROW(PL_YEAR)-MIN(ROW(PL_YEAR))+1),1),COLUMN(B33)),\"\")","v":""},{"$f":"IFERROR(INDEX($CP$4:$CR$48,SMALL(IF((ISERROR(SEARCH($AQ$14,PL_YEAR)*SEARCH($AQ$14,PL_YEAR)*SEARCH($AQ$12,PL_TYPE)))+(COUNTIFS($AP$18:AR42,PL_YEAR,$AQ$18:AS42,PL_DAYS,$AR$18:AT42,PL_TYPE)>0),\"\",ROW(PL_YEAR)-MIN(ROW(PL_YEAR))+1),1),COLUMN(C33)),\"\")","v":""},{"$f":"IFERROR(INDEX($CP$4:$CR$48,SMALL(IF((ISERROR(SEARCH($AM$14,PL_YEAR)*SEARCH($AM$14,PL_YEAR)*SEARCH($AM$12,PL_TYPE)))+(COUNTIFS($AL$18:AS42,PL_YEAR,$AM$18:AT42,PL_DAYS,$AN$18:AU42,PL_TYPE)>0),\"\",ROW(PL_YEAR)-MIN(ROW(PL_YEAR))+1),1),COLUMN(E33)),\"\")","v":""},{"$f":"IFERROR(INDEX($CP$4:$CR$48,SMALL(IF((ISERROR(SEARCH($AU$14,PL_YEAR)*SEARCH($AU$14,PL_YEAR)*SEARCH($AU$12,PL_TYPE)))+(COUNTIFS($AT$18:AT42,PL_YEAR,$AU$18:AU42,PL_DAYS,$AV$18:AV42,PL_TYPE)>0),\"\",ROW(PL_YEAR)-MIN(ROW(PL_YEAR))+1),1),COLUMN(A33)),\"\")","v":""},{"$f":"IFERROR(INDEX($CP$4:$CR$48,SMALL(IF((ISERROR(SEARCH($AU$14,PL_YEAR)*SEARCH($AU$14,PL_YEAR)*SEARCH($AU$12,PL_TYPE)))+(COUNTIFS($AT$18:AU42,PL_YEAR,$AU$18:AV42,PL_DAYS,$AV$18:AW42,PL_TYPE)>0),\"\",ROW(PL_YEAR)-MIN(ROW(PL_YEAR))+1),1),COLUMN(B33)),\"\")","v":""},{"$f":"IFERROR(INDEX($CP$4:$CR$48,SMALL(IF((ISERROR(SEARCH($AU$14,PL_YEAR)*SEARCH($AU$14,PL_YEAR)*SEARCH($AU$12,PL_TYPE)))+(COUNTIFS($AT$18:AV42,PL_YEAR,$AU$18:AW42,PL_DAYS,$AU$18:AW42,PL_TYPE)>0),\"\",ROW(PL_YEAR)-MIN(ROW(PL_YEAR))+1),1),COLUMN(C33)),\"\")","v":""},{"$f":"IFERROR(INDEX($CP$4:$CR$48,SMALL(IF((ISERROR(SEARCH($AU$14,PL_YEAR)*SEARCH($AU$14,PL_YEAR)*SEARCH($AU$12,PL_TYPE)))+(COUNTIFS($AT$18:AW42,PL_YEAR,$AU$18:AW42,PL_DAYS,$AU$18:AW42,PL_TYPE)>0),\"\",ROW(PL_YEAR)-MIN(ROW(PL_YEAR))+1),1),COLUMN(E33)),\"\")","v":""},null,null,null,null,null,null,null,45,null,1,{"$error":"#N/A"},"",{"$f":"IF(PL!E53=\"\",\"\",PL!E53)","v":""},{"$f":"IF(PL!F53=\"\",\"\",PL!F53)","v":""},{"$f":"IF(PL!G53=\"\",\"\",PL!G53)","v":""},{"$f":"IF(PL!H53=\"\",\"\",PL!H53)","v":""},0,null,null,null,null,null,null,null,null,null,null,null,null,null,null,null,null,null,null,null,null,null,null,null,null,null,null,40,{"$f":"INDEX($BK$12:$BK$56,MATCH(ROWS($CO$4:CO43),$CO$4:$CO$48,0))","v":""},{"$f":"INDEX($BN$12:$BN$56,MATCH(ROWS($CO$4:CP43),$CO$4:$CO$48,0))","v":0},{"$f":"INDEX($BJ$12:$BJ$56,MATCH(ROWS($CO$4:CQ43),$CO$4:$CO$48,0))","v":""},"",0,""]
[null,"2012-01-01","2012-06-30","2012-06-30",{"$f":"IF($C$11>=D44,\"YES\",\"NO\")","v":"YES"},{"$f":"IFERROR(E44,\"NO\")","v":"YES"},"2012-01-01","2012-06-30",2012,"A",{"$f":"CONCATENATE(I44,\"-\",J44)","v":"2012-A"},182,300,15,{"$f":"IF(F44=\"NO\",\"\",K44)","v":"2012-A"},0,{"$f":"IF(O44=\"\",\"\",IF(ISERROR(MATCH(O44,$AL$19:$AL$56,0)),0,VLOOKUP(O44,$AL$19:$AV$56,2,0)))","v":0},{"$f":"IF(ISERROR(MATCH(O44,$AP$19:$AP$56,0)),0,VLOOKUP(O44,$AP$19:$AV$56,2,0))","v":0},{"$f":"IF(H44=\"\",\"\",IF(ISERROR(MATCH(O44,$AT$19:$AT$56,0)),0,VLOOKUP(O44,$AT$19:$AV$56,2,0)))","v":0},{"$f":"IF(F44=\"NO\",0,IF(AD44=\"YES\",M44-P44-Q44+R44+S44,M44+N44-P44-Q44+R44+S44))","v":300},300,300,0,0,6,5,"YES",6,false,{"$f":"IF(B44=\"\",\"\",IF(M44>=U44,\"YES\",\"NO\"))","v":"YES"},null,null,null,null,null,null,null,{"$f":"IFERROR(INDEX($CP$4:$CR$48,SMALL(IF((ISERROR(SEARCH($AM$14,PL_YEAR)*SEARCH($AM$14,PL_YEAR)*SEARCH($AM$12,PL_TYPE)))+(COUNTIFS(AL$18:$AL43,PL_YEAR,$AM$18:AM43,PL_DAYS,$AN$18:AN43,PL_TYPE)>0),\"\",ROW(PL_YEAR)-MIN(ROW(PL_YEAR))+1),1),COLUMN(A34)),\"\")","v":""},{"$f":"IFERROR(INDEX($CP$4:$CR$48,SMALL(IF((ISERROR(SEARCH($AM$14,PL_YEAR)*SEARCH($AM$14,PL_YEAR)*SEARCH($AM$12,PL_TYPE)))+(COUNTIFS($AL$18:AM43,PL_YEAR,$AM$18:AN43,PL_DAYS,$AN$18:AO43,PL_TYPE)>0),\"\",ROW(PL_YEAR)-MIN(ROW(PL_YEAR))+1),1),COLUMN(B34)),\"\")","v":""},{"$f":"IFERROR(INDEX($CP$4:$CR$48,SMALL(IF((ISERROR(SEARCH($AM$14,PL_YEAR)*SEARCH($AM$14,PL_YEAR)*SEARCH($AM$12,PL_TYPE)))+(COUNTIFS($AL$18:AN43,PL_YEAR,$AM$18:AO43,PL_DAYS,$AN$18:AP43,PL_TYPE)>0),\"\",ROW(PL_YEAR)-MIN(ROW(PL_YEAR))+1),1),COLUMN(C34)),\"\")","v":""},{"$f":"IFERROR(INDEX($CP$4:$CR$48,SMALL(IF((ISERROR(SEARCH($AM$14,PL_YEAR)*SEARCH($AM$14,PL_YEAR)*SEARCH($AM$12,PL_TYPE)))+(COUNTIFS($AL$18:AO43,PL_YEAR,$AM$18:AP43,PL_DAYS,$AN$18:AQ43,PL_TYPE)>0),\"\",ROW(PL_YEAR)-MIN(ROW(PL_YEAR))+1),1),COLUMN(E34)),\"\")","v":""},{"$f":"IFERROR(INDEX($CP$4:$CR$48,SMALL(IF((ISERROR(SEARCH($AQ$14,PL_YEAR)*SEARCH($AQ$14,PL_YEAR)*SEARCH($AQ$12,PL_TYPE)))+(COUNTIFS($AP$18:AP43,PL_YEAR,$AQ$18:AQ43,PL_DAYS,$AR$18:AR43,PL_TYPE)>0),\"\",ROW(PL_YEAR)-MIN(ROW(PL_YEAR))+1),1),COLUMN(A34)),\"\")","v":""},{"$f":"IFERROR(INDEX($CP$4:$CR$48,SMALL(IF((ISERROR(SEARCH($AQ$14,PL_YEAR)*SEARCH($AQ$14,PL_YEAR)*SEARCH($AQ$12,PL_TYPE)))+(COUNTIFS($AP$18:AQ43,PL_YEAR,$AQ$18:AR43,PL_DAYS,$AR$18:AS43,PL_TYPE)>0),\"\",ROW(PL_YEAR)-MIN(ROW(PL_YEAR))+1),1),COLUMN(B34)),\"\")","v":""},{"$f":"IFERROR(INDEX($CP$4:$CR$48,SMALL(IF((ISERROR(SEARCH($AQ$14,PL_YEAR)*SEARCH($AQ$14,PL_YEAR)*SEARCH($AQ$12,PL_TYPE)))+(COUNTIFS($AP$18:AR43,PL_YEAR,$AQ$18:AS43,PL_DAYS,$AR$18:AT43,PL_TYPE)>0),\"\",ROW(PL_YEAR)-MIN(ROW(PL_YEAR))+1),1),COLUMN(C34)),\"\")","v":""},{"$f":"IFERROR(INDEX($CP$4:$CR$48,SMALL(IF((ISERROR(SEARCH($AM$14,PL_YEAR)*SEARCH($AM$14,PL_YEAR)*SEARCH($AM$12,PL_TYPE)))+(COUNTIFS($AL$18:AS43,PL_YEAR,$AM$18:AT43,PL_DAYS,$AN$18:AU43,PL_TYPE)>0),\"\",ROW(PL_YEAR)-MIN(ROW(PL_YEAR))+1),1),COLUMN(E34)),\"\")","v":""},{"$f":"IFERROR(INDEX($CP$4:$CR$48,SMALL(IF((ISERROR(SEARCH($AU$14,PL_YEAR)*SEARCH($AU$14,PL_YEAR)*SEARCH($AU$12,PL_TYPE)))+(COUNTIFS($AT$18:AT43,PL_YEAR,$AU$18:AU43,PL_DAYS,$AV$18:AV43,PL_TYPE)>0),\"\",ROW(PL_YEAR)-MIN(ROW(PL_YEAR))+1),1),COLUMN(A34)),\"\")","v":""},{"$f":"IFERROR(INDEX($CP$4:$CR$48,SMALL(IF((ISERROR(SEARCH($AU$14,PL_YEAR)*SEARCH($AU$14,PL_YEAR)*SEARCH($AU$12,PL_TYPE)))+(COUNTIFS($AT$18:AU43,PL_YEAR,$AU$18:AV43,PL_DAYS,$AV$18:AW43,PL_TYPE)>0),\"\",ROW(PL_YEAR)-MIN(ROW(PL_YEAR))+1),1),COLUMN(B34)),\"\")","v":""},{"$f":"IFERROR(INDEX($CP$4:$CR$48,SMALL(IF((ISERROR(SEARCH($AU$14,PL_YEAR)*SEARCH($AU$14,PL_YEAR)*SEARCH($AU$12,PL_TYPE)))+(COUNTIFS($AT$18:AV43,PL_YEAR,$AU$18:AW43,PL_DAYS,$AU$18:AW43,PL_TYPE)>0),\"\",ROW(PL_YEAR)-MIN(ROW(PL_YEAR))+1),1),COLUMN(C34)),\"\")","v":""},{"$f":"IFERROR(INDEX($CP$4:$CR$48,SMALL(IF((ISERROR(SEARCH($AU$14,PL_YEAR)*SEARCH($AU$14,PL_YEAR)*SEARCH($AU$12,PL_TYPE)))+(COUNTIFS($AT$18:AW43,PL_YEAR,$AU$18:AW43,PL_DAYS,$AU$18:AW43,PL_TYPE)>0),\"\",ROW(PL_YEAR)-MIN(ROW(PL_YEAR))+1),1),COLUMN(E34)),\"\")","v":""},null,null,null,null,null,null,null,45,null,1,{"$error":"#N/A"},"",{"$f":"IF(PL!E54=\"\",\"\",PL!E54)","v":""},{"$f":"IF(PL!F54=\"\",\"\",PL!F54)","v":""},{"$f":"IF(PL!G54=\"\",\"\",PL!G54)","v":""},{"$f":"IF(PL!H54=\"\",\"\",PL!H54)","v":""},0,null,null,null,null,null,null,null,null,null,null,null,null,null,null,null,null,null,null,null,null,null,null,null,null,null,null,41,{"$f":"INDEX($BK$12:$BK$56,MATCH(ROWS($CO$4:CO44),$CO$4:$CO$48,0))","v":""},{"$f":"INDEX($BN$12:$BN$56,MATCH(ROWS($CO$4:CP44),$CO$4:$CO$48,0))","v":0},{"$f":"INDEX($BJ$12:$BJ$56,MATCH(ROWS($CO$4:CQ44),$CO$4:$CO$48,0))","v":""},"",0,""]
[null,"2012-07-01","2012-12-31","2012-12-31","YES","YES","2012-07-01","2012-12-31",2012,"B","2012-B",{"$f":"IF(F45=\"NO\",\"\",IF(E45=\"YES\",1+H45-G45,H45-G45))","v":184},300,15,"2012-B",0,0,0,0,{"$f":"IF(F45=\"NO\",0,IF(AD45=\"YES\",M45-P45-Q45+R45+S45,M45+N45-P45-Q45+R45+S45))","v":300},300,300,{"$f":"IF(B45=\"\",\"\",INDEX($AJ$7:$AJ$18,MATCH(MONTH(B45),$AG$7:$AG$18,0))-(EOMONTH(B45,0)-B45+1))","v":0},0,6,5,"YES",6,false,{"$f":"IF(B45=\"\",\"\",IF(M45>=U45,\"YES\",\"NO\"))","v":"YES"},null,null,null,null,null,null,null,{"$f":"IFERROR(INDEX($CP$4:$CR$48,SMALL(IF((ISERROR(SEARCH($AM$14,PL_YEAR)*SEARCH($AM$14,PL_YEAR)*SEARCH($AM$12,PL_TYPE)))+(COUNTIFS(AL$18:$AL44,PL_YEAR,$AM$18:AM44,PL_DAYS,$AN$18:AN44,PL_TYPE)>0),\"\",ROW(PL_YEAR)-MIN(ROW(PL_YEAR))+1),1),COLUMN(A35)),\"\")","v":""},{"$f":"IFERROR(INDEX($CP$4:$CR$48,SMALL(IF((ISERROR(SEARCH($AM$14,PL_YEAR)*SEARCH($AM$14,PL_YEAR)*SEARCH($AM$12,PL_TYPE)))+(COUNTIFS($AL$18:AM44,PL_YEAR,$AM$18:AN44,PL_DAYS,$AN$18:AO44,PL_TYPE)>0),\"\",ROW(PL_YEAR)-MIN(ROW(PL_YEAR))+1),1),COLUMN(B35)),\"\")","v":""},{"$f":"IFERROR(INDEX($CP$4:$CR$48,SMALL(IF((ISERROR(SEARCH($AM$14,PL_YEAR)*SEARCH($AM$14,PL_YEAR)*SEARCH($AM$12,PL_TYPE)))+(COUNTIFS($AL$18:AN44,PL_YEAR,$AM$18:AO44,PL_DAYS,$AN$18:AP44,PL_TYPE)>0),\"\",ROW(PL_YEAR)-MIN(ROW(PL_YEAR))+1),1),COLUMN(C35)),\"\")","v":""},{"$f":"IFERROR(INDEX($CP$4:$CR$48,SMALL(IF((ISERROR(SEARCH($AM$14,PL_YEAR)*SEARCH($AM$14,PL_YEAR)*SEARCH($AM$12,PL_TYPE)))+(COUNTIFS($AL$18:AO44,PL_YEAR,$AM$18:AP44,PL_DAYS,$AN$18:AQ44,PL_TYPE)>0),\"\",ROW(PL_YEAR)-MIN(ROW(PL_YEAR))+1),1),COLUMN(E35)),\"\")","v":""},{"$f":"IFERROR(INDEX($CP$4:$CR$48,SMALL(IF((ISERROR(SEARCH($AQ$14,PL_YEAR)*SEARCH($AQ$14,PL_YEAR)*SEARCH($AQ$12,PL_TYPE)))+(COUNTIFS($AP$18:AP44,PL_YEAR,$AQ$18:AQ44,PL_DAYS,$AR$18:AR44,PL_TYPE)>0),\"\",ROW(PL_YEAR)-MIN(ROW(PL_YEAR))+1),1),COLUMN(A35)),\"\")","v":""},{"$f":"IFERROR(INDEX($CP$4:$CR$48,SMALL(IF((ISERROR(SEARCH($AQ$14,PL_YEAR)*SEARCH($AQ$14,PL_YEAR)*SEARCH($AQ$12,PL_TYPE)))+(COUNTIFS($AP$18:AQ44,PL_YEAR,$AQ$18:AR44,PL_DAYS,$AR$18:AS44,PL_TYPE)>0),\"\",ROW(PL_YEAR)-MIN(ROW(PL_YEAR))+1),1),COLUMN(B35)),\"\")","v":""},{"$f":"IFERROR(INDEX($CP$4:$CR$48,SMALL(IF((ISERROR(SEARCH($AQ$14,PL_YEAR)*SEARCH($AQ$14,PL_YEAR)*SEARCH($AQ$12,PL_TYPE)))+(COUNTIFS($AP$18:AR44,PL_YEAR,$AQ$18:AS44,PL_DAYS,$AR$18:AT44,PL_TYPE)>0),\"\",ROW(PL_YEAR)-MIN(ROW(PL_YEAR))+1),1),COLUMN(C35)),\"\")","v":""},{"$f":"IFERROR(INDEX($CP$4:$CR$48,SMALL(IF((ISERROR(SEARCH($AM$14,PL_YEAR)*SEARCH($AM$14,PL_YEAR)*SEARCH($AM$12,PL_TYPE)))+(COUNTIFS($AL$18:AS44,PL_YEAR,$AM$18:AT44,PL_DAYS,$AN$18:AU44,PL_TYPE)>0),\"\",ROW(PL_YEAR)-MIN(ROW(PL_YEAR))+1),1),COLUMN(E35)),\"\")","v":""},{"$f":"IFERROR(INDEX($CP$4:$CR$48,SMALL(IF((ISERROR(SEARCH($AU$14,PL_YEAR)*SEARCH($AU$14,PL_YEAR)*SEARCH($AU$12,PL_TYPE)))+(COUNTIFS($AT$18:AT44,PL_YEAR,$AU$18:AU44,PL_DAYS,$AV$18:AV44,PL_TYPE)>0),\"\",ROW(PL_YEAR)-MIN(ROW(PL_YEAR))+1),1),COLUMN(A35)),\"\")","v":""},{"$f":"IFERROR(INDEX($CP$4:$CR$48,SMALL(IF((ISERROR(SEARCH($AU$14,PL_YEAR)*SEARCH($AU$14,PL_YEAR)*SEARCH($AU$12,PL_TYPE)))+(COUNTIFS($AT$18:AU44,PL_YEAR,$AU$18:AV44,PL_DAYS,$AV$18:AW44,PL_TYPE)>0),\"\",ROW(PL_YEAR)-MIN(ROW(PL_YEAR))+1),1),COLUMN(B35)),\"\")","v":""},{"$f":"IFERROR(INDEX($CP$4:$CR$48,SMALL(IF((ISERROR(SEARCH($AU$14,PL_YEAR)*SEARCH($AU$14,PL_YEAR)*SEARCH($AU$12,PL_TYPE)))+(COUNTIFS($AT$18:AV44,PL_YEAR,$AU$18:AW44,PL_DAYS,$AU$18:AW44,PL_TYPE)>0),\"\",ROW(PL_YEAR)-MIN(ROW(PL_YEAR))+1),1),COLUMN(C35)),\"\")","v":""},{"$f":"IFERROR(INDEX($CP$4:$CR$48,SMALL(IF((ISERROR(SEARCH($AU$14,PL_YEAR)*SEARCH($AU$14,PL_YEAR)*SEARCH($AU$12,PL_TYPE)))+(COUNTIFS($AT$18:AW44,PL_YEAR,$AU$18:AW44,PL_DAYS,$AU$18:AW44,PL_TYPE)>0),\"\",ROW(PL_YEAR)-MIN(ROW(PL_YEAR))+1),1),COLUMN(E35)),\"\")","v":""},null,null,null,null,null,null,null,45,null,1,{"$error":"#N/A"},"",{"$f":"IF(PL!E55=\"\",\"\",PL!E55)","v":""},{"$f":"IF(PL!F55=\"\",\"\",PL!F55)","v":""},{"$f":"IF(PL!G55=\"\",\"\",PL!G55)","v":""},{"$f":"IF(PL!H55=\"\",\"\",PL!H55)","v":""},0,null,null,null,null,null,null,null,null,null,null,null,null,null,null,null,null,null,null,null,null,null,null,null,null,null,null,42,{"$f":"INDEX($BK$12:$BK$56,MATCH(ROWS($CO$4:CO45),$CO$4:$CO$48,0))","v":""},{"$f":"INDEX($BN$12:$BN$56,MATCH(ROWS($CO$4:CP45),$CO$4:$CO$48,0))","v":0},{"$f":"INDEX($BJ$12:$BJ$56,MATCH(ROWS($CO$4:CQ45),$CO$4:$CO$48,0))","v":""},"",0,""]
[null,"2013-01-01","2013-06-30","2013-06-30","YES","YES","2013-01-01","2013-06-30",2013,"A","2013-A",181,300,15,"2013-A",0,0,0,0,315,315,315,0,0,6,5,"YES",6,false,"NO",null,null,null,null,null,null,null,{"$f":"IFERROR(INDEX($CP$4:$CR$48,SMALL(IF((ISERROR(SEARCH($AM$14,PL_YEAR)*SEARCH($AM$14,PL_YEAR)*SEARCH($AM$12,PL_TYPE)))+(COUNTIFS(AL$18:$AL45,PL_YEAR,$AM$18:AM45,PL_DAYS,$AN$18:AN45,PL_TYPE)>0),\"\",ROW(PL_YEAR)-MIN(ROW(PL_YEAR))+1),1),COLUMN(A36)),\"\")","v":""},{"$f":"IFERROR(INDEX($CP$4:$CR$48,SMALL(IF((ISERROR(SEARCH($AM$14,PL_YEAR)*SEARCH($AM$14,PL_YEAR)*SEARCH($AM$12,PL_TYPE)))+(COUNTIFS($AL$18:AM45,PL_YEAR,$AM$18:AN45,PL_DAYS,$AN$18:AO45,PL_TYPE)>0),\"\",ROW(PL_YEAR)-MIN(ROW(PL_YEAR))+1),1),COLUMN(B36)),\"\")","v":""},{"$f":"IFERROR(INDEX($CP$4:$CR$48,SMALL(IF((ISERROR(SEARCH($AM$14,PL_YEAR)*SEARCH($AM$14,PL_YEAR)*SEARCH($AM$12,PL_TYPE)))+(COUNTIFS($AL$18:AN45,PL_YEAR,$AM$18:AO45,PL_DAYS,$AN$18:AP45,PL_TYPE)>0),\"\",ROW(PL_YEAR)-MIN(ROW(PL_YEAR))+1),1),COLUMN(C36)),\"\")","v":""},{"$f":"IFERROR(INDEX($CP$4:$CR$48,SMALL(IF((ISERROR(SEARCH($AM$14,PL_YEAR)*SEARCH($AM$14,PL_YEAR)*SEARCH($AM$12,PL_TYPE)))+(COUNTIFS($AL$18:AO45,PL_YEAR,$AM$18:AP45,PL_DAYS,$AN$18:AQ45,PL_TYPE)>0),\"\",ROW(PL_YEAR)-MIN(ROW(PL_YEAR))+1),1),COLUMN(E36)),\"\")","v":""},{"$f":"IFERROR(INDEX($CP$4:$CR$48,SMALL(IF((ISERROR(SEARCH($AQ$14,PL_YEAR)*SEARCH($AQ$14,PL_YEAR)*SEARCH($AQ$12,PL_TYPE)))+(COUNTIFS($AP$18:AP45,PL_YEAR,$AQ$18:AQ45,PL_DAYS,$AR$18:AR45,PL_TYPE)>0),\"\",ROW(PL_YEAR)-MIN(ROW(PL_YEAR))+1),1),COLUMN(A36)),\"\")","v":""},{"$f":"IFERROR(INDEX($CP$4:$CR$48,SMALL(IF((ISERROR(SEARCH($AQ$14,PL_YEAR)*SEARCH($AQ$14,PL_YEAR)*SEARCH($AQ$12,PL_TYPE)))+(COUNTIFS($AP$18:AQ45,PL_YEAR,$AQ$18:AR45,PL_DAYS,$AR$18:AS45,PL_TYPE)>0),\"\",ROW(PL_YEAR)-MIN(ROW(PL_YEAR))+1),1),COLUMN(B36)),\"\")","v":""},{"$f":"IFERROR(INDEX($CP$4:$CR$48,SMALL(IF((ISERROR(SEARCH($AQ$14,PL_YEAR)*SEARCH($AQ$14,PL_YEAR)*SEARCH($AQ$12,PL_TYPE)))+(COUNTIFS($AP$18:AR45,PL_YEAR,$AQ$18:AS45,PL_DAYS,$AR$18:AT45,PL_TYPE)>0),\"\",ROW(PL_YEAR)-MIN(ROW(PL_YEAR))+1),1),COLUMN(C36)),\"\")","v":""},{"$f":"IFERROR(INDEX($CP$4:$CR$48,SMALL(IF((ISERROR(SEARCH($AM$14,PL_YEAR)*SEARCH($AM$14,PL_YEAR)*SEARCH($AM$12,PL_TYPE)))+(COUNTIFS($AL$18:AS45,PL_YEAR,$AM$18:AT45,PL_DAYS,$AN$18:AU45,PL_TYPE)>0),\"\",ROW(PL_YEAR)-MIN(ROW(PL_YEAR))+1),1),COLUMN(E36)),\"\")","v":""},{"$f":"IFERROR(INDEX($CP$4:$CR$48,SMALL(IF((ISERROR(SEARCH($AU$14,PL_YEAR)*SEARCH($AU$14,PL_YEAR)*SEARCH($AU$12,PL_TYPE)))+(COUNTIFS($AT$18:AT45,PL_YEAR,$AU$18:AU45,PL_DAYS,$AV$18:AV45,PL_TYPE)>0),\"\",ROW(PL_YEAR)-MIN(ROW(PL_YEAR))+1),1),COLUMN(A36)),\"\")","v":""},{"$f":"IFERROR(INDEX($CP$4:$CR$48,SMALL(IF((ISERROR(SEARCH($AU$14,PL_YEAR)*SEARCH($AU$14,PL_YEAR)*SEARCH($AU$12,PL_TYPE)))+(COUNTIFS($AT$18:AU45,PL_YEAR,$AU$18:AV45,PL_DAYS,$AV$18:AW45,PL_TYPE)>0),\"\",ROW(PL_YEAR)-MIN(ROW(PL_YEAR))+1),1),COLUMN(B36)),\"\")","v":""},{"$f":"IFERROR(INDEX($CP$4:$CR$48,SMALL(IF((ISERROR(SEARCH($AU$14,PL_YEAR)*SEARCH($AU$14,PL_YEAR)*SEARCH($AU$12,PL_TYPE)))+(COUNTIFS($AT$18:AV45,PL_YEAR,$AU$18:AW45,PL_DAYS,$AU$18:AW45,PL_TYPE)>0),\"\",ROW(PL_YEAR)-MIN(ROW(PL_YEAR))+1),1),COLUMN(C36)),\"\")","v":""},{"$f":"IFERROR(INDEX($CP$4:$CR$48,SMALL(IF((ISERROR(SEARCH($AU$14,PL_YEAR)*SEARCH($AU$14,PL_YEAR)*SEARCH($AU$12,PL_TYPE)))+(COUNTIFS($AT$18:AW45,PL_YEAR,$AU$18:AW45,PL_DAYS,$AU$18:AW45,PL_TYPE)>0),\"\",ROW(PL_YEAR)-MIN(ROW(PL_YEAR))+1),1),COLUMN(E36)),\"\")","v":""},null,null,null,null,null,null,null,45,null,1,{"$error":"#N/A"},"",{"$f":"IF(PL!E56=\"\",\"\",PL!E56)","v":""},{"$f":"IF(PL!F56=\"\",\"\",PL!F56)","v":""},{"$f":"IF(PL!G56=\"\",\"\",PL!G56)","v":""},{"$f":"IF(PL!H56=\"\",\"\",PL!H56)","v":""},0,null,null,null,null,null,null,null,null,null,null,null,null,null,null,null,null,null,null,null,null,null,null,null,null,null,null,43,{"$f":"INDEX($BK$12:$BK$56,MATCH(ROWS($CO$4:CO46),$CO$4:$CO$48,0))","v":""},{"$f":"INDEX($BN$12:$BN$56,MATCH(ROWS($CO$4:CP46),$CO$4:$CO$48,0))","v":0},{"$f":"INDEX($BJ$12:$BJ$56,MATCH(ROWS($CO$4:CQ46),$CO$4:$CO$48,0))","v":""},"",0,""]
[null,"2013-07-01","2013-12-31","2013-12-31","YES","YES","2013-07-01","2013-12-31",2013,"B","2013-B",184,315,15,"2013-B",0,0,0,0,315,315,315,0,0,6,5,"YES",6,false,"YES",null,null,null,null,null,null,null,{"$f":"IFERROR(INDEX($CP$4:$CR$48,SMALL(IF((ISERROR(SEARCH($AM$14,PL_YEAR)*SEARCH($AM$14,PL_YEAR)*SEARCH($AM$12,PL_TYPE)))+(COUNTIFS(AL$18:$AL46,PL_YEAR,$AM$18:AM46,PL_DAYS,$AN$18:AN46,PL_TYPE)>0),\"\",ROW(PL_YEAR)-MIN(ROW(PL_YEAR))+1),1),COLUMN(A37)),\"\")","v":""},{"$f":"IFERROR(INDEX($CP$4:$CR$48,SMALL(IF((ISERROR(SEARCH($AM$14,PL_YEAR)*SEARCH($AM$14,PL_YEAR)*SEARCH($AM$12,PL_TYPE)))+(COUNTIFS($AL$18:AM46,PL_YEAR,$AM$18:AN46,PL_DAYS,$AN$18:AO46,PL_TYPE)>0),\"\",ROW(PL_YEAR)-MIN(ROW(PL_YEAR))+1),1),COLUMN(B37)),\"\")","v":""},{"$f":"IFERROR(INDEX($CP$4:$CR$48,SMALL(IF((ISERROR(SEARCH($AM$14,PL_YEAR)*SEARCH($AM$14,PL_YEAR)*SEARCH($AM$12,PL_TYPE)))+(COUNTIFS($AL$18:AN46,PL_YEAR,$AM$18:AO46,PL_DAYS,$AN$18:AP46,PL_TYPE)>0),\"\",ROW(PL_YEAR)-MIN(ROW(PL_YEAR))+1),1),COLUMN(C37)),\"\")","v":""},{"$f":"IFERROR(INDEX($CP$4:$CR$48,SMALL(IF((ISERROR(SEARCH($AM$14,PL_YEAR)*SEARCH($AM$14,PL_YEAR)*SEARCH($AM$12,PL_TYPE)))+(COUNTIFS($AL$18:AO46,PL_YEAR,$AM$18:AP46,PL_DAYS,$AN$18:AQ46,PL_TYPE)>0),\"\",ROW(PL_YEAR)-MIN(ROW(PL_YEAR))+1),1),COLUMN(E37)),\"\")","v":""},{"$f":"IFERROR(INDEX($CP$4:$CR$48,SMALL(IF((ISERROR(SEARCH($AQ$14,PL_YEAR)*SEARCH($AQ$14,PL_YEAR)*SEARCH($AQ$12,PL_TYPE)))+(COUNTIFS($AP$18:AP46,PL_YEAR,$AQ$18:AQ46,PL_DAYS,$AR$18:AR46,PL_TYPE)>0),\"\",ROW(PL_YEAR)-MIN(ROW(PL_YEAR))+1),1),COLUMN(A37)),\"\")","v":""},{"$f":"IFERROR(INDEX($CP$4:$CR$48,SMALL(IF((ISERROR(SEARCH($AQ$14,PL_YEAR)*SEARCH($AQ$14,PL_YEAR)*SEARCH($AQ$12,PL_TYPE)))+(COUNTIFS($AP$18:AQ46,PL_YEAR,$AQ$18:AR46,PL_DAYS,$AR$18:AS46,PL_TYPE)>0),\"\",ROW(PL_YEAR)-MIN(ROW(PL_YEAR))+1),1),COLUMN(B37)),\"\")","v":""},{"$f":"IFERROR(INDEX($CP$4:$CR$48,SMALL(IF((ISERROR(SEARCH($AQ$14,PL_YEAR)*SEARCH($AQ$14,PL_YEAR)*SEARCH($AQ$12,PL_TYPE)))+(COUNTIFS($AP$18:AR46,PL_YEAR,$AQ$18:AS46,PL_DAYS,$AR$18:AT46,PL_TYPE)>0),\"\",ROW(PL_YEAR)-MIN(ROW(PL_YEAR))+1),1),COLUMN(C37)),\"\")","v":""},{"$f":"IFERROR(INDEX($CP$4:$CR$48,SMALL(IF((ISERROR(SEARCH($AM$14,PL_YEAR)*SEARCH($AM$14,PL_YEAR)*SEARCH($AM$12,PL_TYPE)))+(COUNTIFS($AL$18:AS46,PL_YEAR,$AM$18:AT46,PL_DAYS,$AN$18:AU46,PL_TYPE)>0),\"\",ROW(PL_YEAR)-MIN(ROW(PL_YEAR))+1),1),COLUMN(E37)),\"\")","v":""},{"$f":"IFERROR(INDEX($CP$4:$CR$48,SMALL(IF((ISERROR(SEARCH($AU$14,PL_YEAR)*SEARCH($AU$14,PL_YEAR)*SEARCH($AU$12,PL_TYPE)))+(COUNTIFS($AT$18:AT46,PL_YEAR,$AU$18:AU46,PL_DAYS,$AV$18:AV46,PL_TYPE)>0),\"\",ROW(PL_YEAR)-MIN(ROW(PL_YEAR))+1),1),COLUMN(A37)),\"\")","v":""},{"$f":"IFERROR(INDEX($CP$4:$CR$48,SMALL(IF((ISERROR(SEARCH($AU$14,PL_YEAR)*SEARCH($AU$14,PL_YEAR)*SEARCH($AU$12,PL_TYPE)))+(COUNTIFS($AT$18:AU46,PL_YEAR,$AU$18:AV46,PL_DAYS,$AV$18:AW46,PL_TYPE)>0),\"\",ROW(PL_YEAR)-MIN(ROW(PL_YEAR))+1),1),COLUMN(B37)),\"\")","v":""},{"$f":"IFERROR(INDEX($CP$4:$CR$48,SMALL(IF((ISERROR(SEARCH($AU$14,PL_YEAR)*SEARCH($AU$14,PL_YEAR)*SEARCH($AU$12,PL_TYPE)))+(COUNTIFS($AT$18:AV46,PL_YEAR,$AU$18:AW46,PL_DAYS,$AU$18:AW46,PL_TYPE)>0),\"\",ROW(PL_YEAR)-MIN(ROW(PL_YEAR))+1),1),COLUMN(C37)),\"\")","v":""},{"$f":"IFERROR(INDEX($CP$4:$CR$48,SMALL(IF((ISERROR(SEARCH($AU$14,PL_YEAR)*SEARCH($AU$14,PL_YEAR)*SEARCH($AU$12,PL_TYPE)))+(COUNTIFS($AT$18:AW46,PL_YEAR,$AU$18:AW46,PL_DAYS,$AU$18:AW46,PL_TYPE)>0),\"\",ROW(PL_YEAR)-MIN(ROW(PL_YEAR))+1),1),COLUMN(E37)),\"\")","v":""},null,null,null,null,null,null,null,45,null,1,{"$error":"#N/A"},"",{"$f":"IF(PL!E57=\"\",\"\",PL!E57)","v":""},{"$f":"IF(PL!F57=\"\",\"\",PL!F57)","v":""},{"$f":"IF(PL!G57=\"\",\"\",PL!G57)","v":""},{"$f":"IF(PL!H57=\"\",\"\",PL!H57)","v":""},0,null,null,null,null,null,null,null,null,null,null,null,null,null,null,null,null,null,null,null,null,null,null,null,null,null,null,44,{"$f":"INDEX($BK$12:$BK$56,MATCH(ROWS($CO$4:CO47),$CO$4:$CO$48,0))","v":""},{"$f":"INDEX($BN$12:$BN$56,MATCH(ROWS($CO$4:CP47),$CO$4:$CO$48,0))","v":0},{"$f":"INDEX($BJ$12:$BJ$56,MATCH(ROWS($CO$4:CQ47),$CO$4:$CO$48,0))","v":""},"",0,""]
[null,"2014-01-01","2014-06-30","2014-06-30","YES","YES","2014-01-01","2014-06-30",2014,"A","2014-A",181,315,15,"2014-A",0,0,0,0,315,315,315,0,0,6,5,"YES",6,false,"YES",null,null,null,null,null,null,null,{"$f":"IFERROR(INDEX($CP$4:$CR$48,SMALL(IF((ISERROR(SEARCH($AM$14,PL_YEAR)*SEARCH($AM$14,PL_YEAR)*SEARCH($AM$12,PL_TYPE)))+(COUNTIFS(AL$18:$AL47,PL_YEAR,$AM$18:AM47,PL_DAYS,$AN$18:AN47,PL_TYPE)>0),\"\",ROW(PL_YEAR)-MIN(ROW(PL_YEAR))+1),1),COLUMN(A38)),\"\")","v":""},{"$f":"IFERROR(INDEX($CP$4:$CR$48,SMALL(IF((ISERROR(SEARCH($AM$14,PL_YEAR)*SEARCH($AM$14,PL_YEAR)*SEARCH($AM$12,PL_TYPE)))+(COUNTIFS($AL$18:AM47,PL_YEAR,$AM$18:AN47,PL_DAYS,$AN$18:AO47,PL_TYPE)>0),\"\",ROW(PL_YEAR)-MIN(ROW(PL_YEAR))+1),1),COLUMN(B38)),\"\")","v":""},{"$f":"IFERROR(INDEX($CP$4:$CR$48,SMALL(IF((ISERROR(SEARCH($AM$14,PL_YEAR)*SEARCH($AM$14,PL_YEAR)*SEARCH($AM$12,PL_TYPE)))+(COUNTIFS($AL$18:AN47,PL_YEAR,$AM$18:AO47,PL_DAYS,$AN$18:AP47,PL_TYPE)>0),\"\",ROW(PL_YEAR)-MIN(ROW(PL_YEAR))+1),1),COLUMN(C38)),\"\")","v":""},{"$f":"IFERROR(INDEX($CP$4:$CR$48,SMALL(IF((ISERROR(SEARCH($AM$14,PL_YEAR)*SEARCH($AM$14,PL_YEAR)*SEARCH($AM$12,PL_TYPE)))+(COUNTIFS($AL$18:AO47,PL_YEAR,$AM$18:AP47,PL_DAYS,$AN$18:AQ47,PL_TYPE)>0),\"\",ROW(PL_YEAR)-MIN(ROW(PL_YEAR))+1),1),COLUMN(E38)),\"\")","v":""},{"$f":"IFERROR(INDEX($CP$4:$CR$48,SMALL(IF((ISERROR(SEARCH($AQ$14,PL_YEAR)*SEARCH($AQ$14,PL_YEAR)*SEARCH($AQ$12,PL_TYPE)))+(COUNTIFS($AP$18:AP47,PL_YEAR,$AQ$18:AQ47,PL_DAYS,$AR$18:AR47,PL_TYPE)>0),\"\",ROW(PL_YEAR)-MIN(ROW(PL_YEAR))+1),1),COLUMN(A38)),\"\")","v":""},{"$f":"IFERROR(INDEX($CP$4:$CR$48,SMALL(IF((ISERROR(SEARCH($AQ$14,PL_YEAR)*SEARCH($AQ$14,PL_YEAR)*SEARCH($AQ$12,PL_TYPE)))+(COUNTIFS($AP$18:AQ47,PL_YEAR,$AQ$18:AR47,PL_DAYS,$AR$18:AS47,PL_TYPE)>0),\"\",ROW(PL_YEAR)-MIN(ROW(PL_YEAR))+1),1),COLUMN(B38)),\"\")","v":""},{"$f":"IFERROR(INDEX($CP$4:$CR$48,SMALL(IF((ISERROR(SEARCH($AQ$14,PL_YEAR)*SEARCH($AQ$14,PL_YEAR)*SEARCH($AQ$12,PL_TYPE)))+(COUNTIFS($AP$18:AR47,PL_YEAR,$AQ$18:AS47,PL_DAYS,$AR$18:AT47,PL_TYPE)>0),\"\",ROW(PL_YEAR)-MIN(ROW(PL_YEAR))+1),1),COLUMN(C38)),\"\")","v":""},{"$f":"IFERROR(INDEX($CP$4:$CR$48,SMALL(IF((ISERROR(SEARCH($AM$14,PL_YEAR)*SEARCH($AM$14,PL_YEAR)*SEARCH($AM$12,PL_TYPE)))+(COUNTIFS($AL$18:AS47,PL_YEAR,$AM$18:AT47,PL_DAYS,$AN$18:AU47,PL_TYPE)>0),\"\",ROW(PL_YEAR)-MIN(ROW(PL_YEAR))+1),1),COLUMN(E38)),\"\")","v":""},{"$f":"IFERROR(INDEX($CP$4:$CR$48,SMALL(IF((ISERROR(SEARCH($AU$14,PL_YEAR)*SEARCH($AU$14,PL_YEAR)*SEARCH($AU$12,PL_TYPE)))+(COUNTIFS($AT$18:AT47,PL_YEAR,$AU$18:AU47,PL_DAYS,$AV$18:AV47,PL_TYPE)>0),\"\",ROW(PL_YEAR)-MIN(ROW(PL_YEAR))+1),1),COLUMN(A38)),\"\")","v":""},{"$f":"IFERROR(INDEX($CP$4:$CR$48,SMALL(IF((ISERROR(SEARCH($AU$14,PL_YEAR)*SEARCH($AU$14,PL_YEAR)*SEARCH($AU$12,PL_TYPE)))+(COUNTIFS($AT$18:AU47,PL_YEAR,$AU$18:AV47,PL_DAYS,$AV$18:AW47,PL_TYPE)>0),\"\",ROW(PL_YEAR)-MIN(ROW(PL_YEAR))+1),1),COLUMN(B38)),\"\")","v":""},{"$f":"IFERROR(INDEX($CP$4:$CR$48,SMALL(IF((ISERROR(SEARCH($AU$14,PL_YEAR)*SEARCH($AU$14,PL_YEAR)*SEARCH($AU$12,PL_TYPE)))+(COUNTIFS($AT$18:AV47,PL_YEAR,$AU$18:AW47,PL_DAYS,$AU$18:AW47,PL_TYPE)>0),\"\",ROW(PL_YEAR)-MIN(ROW(PL_YEAR))+1),1),COLUMN(C38)),\"\")","v":""},{"$f":"IFERROR(INDEX($CP$4:$CR$48,SMALL(IF((ISERROR(SEARCH($AU$14,PL_YEAR)*SEARCH($AU$14,PL_YEAR)*SEARCH($AU$12,PL_TYPE)))+(COUNTIFS($AT$18:AW47,PL_YEAR,$AU$18:AW47,PL_DAYS,$AU$18:AW47,PL_TYPE)>0),\"\",ROW(PL_YEAR)-MIN(ROW(PL_YEAR))+1),1),COLUMN(E38)),\"\")","v":""},null,null,null,null,null,null,null,45,null,1,{"$error":"#N/A"},"",{"$f":"IF(PL!E58=\"\",\"\",PL!E58)","v":""},{"$f":"IF(PL!F58=\"\",\"\",PL!F58)","v":""},{"$f":"IF(PL!G58=\"\",\"\",PL!G58)","v":""},{"$f":"IF(PL!H58=\"\",\"\",PL!H58)","v":""},0,null,null,null,null,null,null,null,null,null,null,null,null,null,null,null,null,null,null,null,null,null,null,null,null,null,null,45,{"$f":"INDEX($BK$12:$BK$56,MATCH(ROWS($CO$4:CO48),$CO$4:$CO$48,0))","v":""},{"$f":"INDEX($BN$12:$BN$56,MATCH(ROWS($CO$4:CP48),$CO$4:$CO$48,0))","v":0},{"$f":"INDEX($BJ$12:$BJ$56,MATCH(ROWS($CO$4:CQ48),$CO$4:$CO$48,0))","v":""},"",0,""]
[null,"2014-07-01","2014-12-31","2014-12-31","YES","YES","2014-07-01","2014-12-31",2014,"B","2014-B",184,315,15,"2014-B",0,0,0,0,315,315,315,0,0,6,5,"YES",6,false,"YES",null,null,null,null,null,null,null,{"$f":"IFERROR(INDEX($CP$4:$CR$48,SMALL(IF((ISERROR(SEARCH($AM$14,PL_YEAR)*SEARCH($AM$14,PL_YEAR)*SEARCH($AM$12,PL_TYPE)))+(COUNTIFS(AL$18:$AL48,PL_YEAR,$AM$18:AM48,PL_DAYS,$AN$18:AN48,PL_TYPE)>0),\"\",ROW(PL_YEAR)-MIN(ROW(PL_YEAR))+1),1),COLUMN(A39)),\"\")","v":""},{"$f":"IFERROR(INDEX($CP$4:$CR$48,SMALL(IF((ISERROR(SEARCH($AM$14,PL_YEAR)*SEARCH($AM$14,PL_YEAR)*SEARCH($AM$12,PL_TYPE)))+(COUNTIFS($AL$18:AM48,PL_YEAR,$AM$18:AN48,PL_DAYS,$AN$18:AO48,PL_TYPE)>0),\"\",ROW(PL_YEAR)-MIN(ROW(PL_YEAR))+1),1),COLUMN(B39)),\"\")","v":""},{"$f":"IFERROR(INDEX($CP$4:$CR$48,SMALL(IF((ISERROR(SEARCH($AM$14,PL_YEAR)*SEARCH($AM$14,PL_YEAR)*SEARCH($AM$12,PL_TYPE)))+(COUNTIFS($AL$18:AN48,PL_YEAR,$AM$18:AO48,PL_DAYS,$AN$18:AP48,PL_TYPE)>0),\"\",ROW(PL_YEAR)-MIN(ROW(PL_YEAR))+1),1),COLUMN(C39)),\"\")","v":""},{"$f":"IFERROR(INDEX($CP$4:$CR$48,SMALL(IF((ISERROR(SEARCH($AM$14,PL_YEAR)*SEARCH($AM$14,PL_YEAR)*SEARCH($AM$12,PL_TYPE)))+(COUNTIFS($AL$18:AO48,PL_YEAR,$AM$18:AP48,PL_DAYS,$AN$18:AQ48,PL_TYPE)>0),\"\",ROW(PL_YEAR)-MIN(ROW(PL_YEAR))+1),1),COLUMN(E39)),\"\")","v":""},{"$f":"IFERROR(INDEX($CP$4:$CR$48,SMALL(IF((ISERROR(SEARCH($AQ$14,PL_YEAR)*SEARCH($AQ$14,PL_YEAR)*SEARCH($AQ$12,PL_TYPE)))+(COUNTIFS($AP$18:AP48,PL_YEAR,$AQ$18:AQ48,PL_DAYS,$AR$18:AR48,PL_TYPE)>0),\"\",ROW(PL_YEAR)-MIN(ROW(PL_YEAR))+1),1),COLUMN(A39)),\"\")","v":""},{"$f":"IFERROR(INDEX($CP$4:$CR$48,SMALL(IF((ISERROR(SEARCH($AQ$14,PL_YEAR)*SEARCH($AQ$14,PL_YEAR)*SEARCH($AQ$12,PL_TYPE)))+(COUNTIFS($AP$18:AQ48,PL_YEAR,$AQ$18:AR48,PL_DAYS,$AR$18:AS48,PL_TYPE)>0),\"\",ROW(PL_YEAR)-MIN(ROW(PL_YEAR))+1),1),COLUMN(B39)),\"\")","v":""},{"$f":"IFERROR(INDEX($CP$4:$CR$48,SMALL(IF((ISERROR(SEARCH($AQ$14,PL_YEAR)*SEARCH($AQ$14,PL_YEAR)*SEARCH($AQ$12,PL_TYPE)))+(COUNTIFS($AP$18:AR48,PL_YEAR,$AQ$18:AS48,PL_DAYS,$AR$18:AT48,PL_TYPE)>0),\"\",ROW(PL_YEAR)-MIN(ROW(PL_YEAR))+1),1),COLUMN(C39)),\"\")","v":""},{"$f":"IFERROR(INDEX($CP$4:$CR$48,SMALL(IF((ISERROR(SEARCH($AM$14,PL_YEAR)*SEARCH($AM$14,PL_YEAR)*SEARCH($AM$12,PL_TYPE)))+(COUNTIFS($AL$18:AS48,PL_YEAR,$AM$18:AT48,PL_DAYS,$AN$18:AU48,PL_TYPE)>0),\"\",ROW(PL_YEAR)-MIN(ROW(PL_YEAR))+1),1),COLUMN(E39)),\"\")","v":""},{"$f":"IFERROR(INDEX($CP$4:$CR$48,SMALL(IF((ISERROR(SEARCH($AU$14,PL_YEAR)*SEARCH($AU$14,PL_YEAR)*SEARCH($AU$12,PL_TYPE)))+(COUNTIFS($AT$18:AT48,PL_YEAR,$AU$18:AU48,PL_DAYS,$AV$18:AV48,PL_TYPE)>0),\"\",ROW(PL_YEAR)-MIN(ROW(PL_YEAR))+1),1),COLUMN(A39)),\"\")","v":""},{"$f":"IFERROR(INDEX($CP$4:$CR$48,SMALL(IF((ISERROR(SEARCH($AU$14,PL_YEAR)*SEARCH($AU$14,PL_YEAR)*SEARCH($AU$12,PL_TYPE)))+(COUNTIFS($AT$18:AU48,PL_YEAR,$AU$18:AV48,PL_DAYS,$AV$18:AW48,PL_TYPE)>0),\"\",ROW(PL_YEAR)-MIN(ROW(PL_YEAR))+1),1),COLUMN(B39)),\"\")","v":""},{"$f":"IFERROR(INDEX($CP$4:$CR$48,SMALL(IF((ISERROR(SEARCH($AU$14,PL_YEAR)*SEARCH($AU$14,PL_YEAR)*SEARCH($AU$12,PL_TYPE)))+(COUNTIFS($AT$18:AV48,PL_YEAR,$AU$18:AW48,PL_DAYS,$AU$18:AW48,PL_TYPE)>0),\"\",ROW(PL_YEAR)-MIN(ROW(PL_YEAR))+1),1),COLUMN(C39)),\"\")","v":""},{"$f":"IFERROR(INDEX($CP$4:$CR$48,SMALL(IF((ISERROR(SEARCH($AU$14,PL_YEAR)*SEARCH($AU$14,PL_YEAR)*SEARCH($AU$12,PL_TYPE)))+(COUNTIFS($AT$18:AW48,PL_YEAR,$AU$18:AW48,PL_DAYS,$AU$18:AW48,PL_TYPE)>0),\"\",ROW(PL_YEAR)-MIN(ROW(PL_YEAR))+1),1),COLUMN(E39)),\"\")","v":""},null,null,null,null,null,null,null,45,null,1,{"$error":"#N/A"},"",{"$f":"IF(PL!E59=\"\",\"\",PL!E59)","v":""},{"$f":"IF(PL!F59=\"\",\"\",PL!F59)","v":""},{"$f":"IF(PL!G59=\"\",\"\",PL!G59)","v":""},{"$f":"IF(PL!H59=\"\",\"\",PL!H59)","v":""},0]
[null,"2015-01-01","2015-06-30","2015-06-30","YES","YES","2015-01-01","2015-06-30",2015,"A","2015-A",181,315,15,"2015-A",0,0,0,0,315,315,315,0,0,6,5,"YES",6,false,"YES",null,null,null,null,null,null,null,{"$f":"IFERROR(INDEX($CP$4:$CR$48,SMALL(IF((ISERROR(SEARCH($AM$14,PL_YEAR)*SEARCH($AM$14,PL_YEAR)*SEARCH($AM$12,PL_TYPE)))+(COUNTIFS(AL$18:$AL49,PL_YEAR,$AM$18:AM49,PL_DAYS,$AN$18:AN49,PL_TYPE)>0),\"\",ROW(PL_YEAR)-MIN(ROW(PL_YEAR))+1),1),COLUMN(A40)),\"\")","v":""},{"$f":"IFERROR(INDEX($CP$4:$CR$48,SMALL(IF((ISERROR(SEARCH($AM$14,PL_YEAR)*SEARCH($AM$14,PL_YEAR)*SEARCH($AM$12,PL_TYPE)))+(COUNTIFS($AL$18:AM49,PL_YEAR,$AM$18:AN49,PL_DAYS,$AN$18:AO49,PL_TYPE)>0),\"\",ROW(PL_YEAR)-MIN(ROW(PL_YEAR))+1),1),COLUMN(B40)),\"\")","v":""},{"$f":"IFERROR(INDEX($CP$4:$CR$48,SMALL(IF((ISERROR(SEARCH($AM$14,PL_YEAR)*SEARCH($AM$14,PL_YEAR)*SEARCH($AM$12,PL_TYPE)))+(COUNTIFS($AL$18:AN49,PL_YEAR,$AM$18:AO49,PL_DAYS,$AN$18:AP49,PL_TYPE)>0),\"\",ROW(PL_YEAR)-MIN(ROW(PL_YEAR))+1),1),COLUMN(C40)),\"\")","v":""},{"$f":"IFERROR(INDEX($CP$4:$CR$48,SMALL(IF((ISERROR(SEARCH($AM$14,PL_YEAR)*SEARCH($AM$14,PL_YEAR)*SEARCH($AM$12,PL_TYPE)))+(COUNTIFS($AL$18:AO49,PL_YEAR,$AM$18:AP49,PL_DAYS,$AN$18:AQ49,PL_TYPE)>0),\"\",ROW(PL_YEAR)-MIN(ROW(PL_YEAR))+1),1),COLUMN(E40)),\"\")","v":""},{"$f":"IFERROR(INDEX($CP$4:$CR$48,SMALL(IF((ISERROR(SEARCH($AQ$14,PL_YEAR)*SEARCH($AQ$14,PL_YEAR)*SEARCH($AQ$12,PL_TYPE)))+(COUNTIFS($AP$18:AP49,PL_YEAR,$AQ$18:AQ49,PL_DAYS,$AR$18:AR49,PL_TYPE)>0),\"\",ROW(PL_YEAR)-MIN(ROW(PL_YEAR))+1),1),COLUMN(A40)),\"\")","v":""},{"$f":"IFERROR(INDEX($CP$4:$CR$48,SMALL(IF((ISERROR(SEARCH($AQ$14,PL_YEAR)*SEARCH($AQ$14,PL_YEAR)*SEARCH($AQ$12,PL_TYPE)))+(COUNTIFS($AP$18:AQ49,PL_YEAR,$AQ$18:AR49,PL_DAYS,$AR$18:AS49,PL_TYPE)>0),\"\",ROW(PL_YEAR)-MIN(ROW(PL_YEAR))+1),1),COLUMN(B40)),\"\")","v":""},{"$f":"IFERROR(INDEX($CP$4:$CR$48,SMALL(IF((ISERROR(SEARCH($AQ$14,PL_YEAR)*SEARCH($AQ$14,PL_YEAR)*SEARCH($AQ$12,PL_TYPE)))+(COUNTIFS($AP$18:AR49,PL_YEAR,$AQ$18:AS49,PL_DAYS,$AR$18:AT49,PL_TYPE)>0),\"\",ROW(PL_YEAR)-MIN(ROW(PL_YEAR))+1),1),COLUMN(C40)),\"\")","v":""},{"$f":"IFERROR(INDEX($CP$4:$CR$48,SMALL(IF((ISERROR(SEARCH($AM$14,PL_YEAR)*SEARCH($AM$14,PL_YEAR)*SEARCH($AM$12,PL_TYPE)))+(COUNTIFS($AL$18:AS49,PL_YEAR,$AM$18:AT49,PL_DAYS,$AN$18:AU49,PL_TYPE)>0),\"\",ROW(PL_YEAR)-MIN(ROW(PL_YEAR))+1),1),COLUMN(E40)),\"\")","v":""},{"$f":"IFERROR(INDEX($CP$4:$CR$48,SMALL(IF((ISERROR(SEARCH($AU$14,PL_YEAR)*SEARCH($AU$14,PL_YEAR)*SEARCH($AU$12,PL_TYPE)))+(COUNTIFS($AT$18:AT49,PL_YEAR,$AU$18:AU49,PL_DAYS,$AV$18:AV49,PL_TYPE)>0),\"\",ROW(PL_YEAR)-MIN(ROW(PL_YEAR))+1),1),COLUMN(A40)),\"\")","v":""},{"$f":"IFERROR(INDEX($CP$4:$CR$48,SMALL(IF((ISERROR(SEARCH($AU$14,PL_YEAR)*SEARCH($AU$14,PL_YEAR)*SEARCH($AU$12,PL_TYPE)))+(COUNTIFS($AT$18:AU49,PL_YEAR,$AU$18:AV49,PL_DAYS,$AV$18:AW49,PL_TYPE)>0),\"\",ROW(PL_YEAR)-MIN(ROW(PL_YEAR))+1),1),COLUMN(B40)),\"\")","v":""},{"$f":"IFERROR(INDEX($CP$4:$CR$48,SMALL(IF((ISERROR(SEARCH($AU$14,PL_YEAR)*SEARCH($AU$14,PL_YEAR)*SEARCH($AU$12,PL_TYPE)))+(COUNTIFS($AT$18:AV49,PL_YEAR,$AU$18:AW49,PL_DAYS,$AU$18:AW49,PL_TYPE)>0),\"\",ROW(PL_YEAR)-MIN(ROW(PL_YEAR))+1),1),COLUMN(C40)),\"\")","v":""},{"$f":"IFERROR(INDEX($CP$4:$CR$48,SMALL(IF((ISERROR(SEARCH($AU$14,PL_YEAR)*SEARCH($AU$14,PL_YEAR)*SEARCH($AU$12,PL_TYPE)))+(COUNTIFS($AT$18:AW49,PL_YEAR,$AU$18:AW49,PL_DAYS,$AU$18:AW49,PL_TYPE)>0),\"\",ROW(PL_YEAR)-MIN(ROW(PL_YEAR))+1),1),COLUMN(E40)),\"\")","v":""},null,null,null,null,null,null,null,45,null,1,{"$error":"#N/A"},"",{"$f":"IF(PL!E60=\"\",\"\",PL!E60)","v":""},{"$f":"IF(PL!F60=\"\",\"\",PL!F60)","v":""},{"$f":"IF(PL!G60=\"\",\"\",PL!G60)","v":""},{"$f":"IF(PL!H60=\"\",\"\",PL!H60)","v":""},0]
[null,"2015-07-01","2015-12-31","2015-12-31","YES","YES","2015-07-01","2015-12-31",2015,"B","2015-B",184,315,15,"2015-B",0,0,0,0,315,315,315,0,0,6,5,"YES",6,false,"YES",null,null,null,null,null,null,null,{"$f":"IFERROR(INDEX($CP$4:$CR$48,SMALL(IF((ISERROR(SEARCH($AM$14,PL_YEAR)*SEARCH($AM$14,PL_YEAR)*SEARCH($AM$12,PL_TYPE)))+(COUNTIFS(AL$18:$AL50,PL_YEAR,$AM$18:AM50,PL_DAYS,$AN$18:AN50,PL_TYPE)>0),\"\",ROW(PL_YEAR)-MIN(ROW(PL_YEAR))+1),1),COLUMN(A41)),\"\")","v":""},{"$f":"IFERROR(INDEX($CP$4:$CR$48,SMALL(IF((ISERROR(SEARCH($AM$14,PL_YEAR)*SEARCH($AM$14,PL_YEAR)*SEARCH($AM$12,PL_TYPE)))+(COUNTIFS($AL$18:AM50,PL_YEAR,$AM$18:AN50,PL_DAYS,$AN$18:AO50,PL_TYPE)>0),\"\",ROW(PL_YEAR)-MIN(ROW(PL_YEAR))+1),1),COLUMN(B41)),\"\")","v":""},{"$f":"IFERROR(INDEX($CP$4:$CR$48,SMALL(IF((ISERROR(SEARCH($AM$14,PL_YEAR)*SEARCH($AM$14,PL_YEAR)*SEARCH($AM$12,PL_TYPE)))+(COUNTIFS($AL$18:AN50,PL_YEAR,$AM$18:AO50,PL_DAYS,$AN$18:AP50,PL_TYPE)>0),\"\",ROW(PL_YEAR)-MIN(ROW(PL_YEAR))+1),1),COLUMN(C41)),\"\")","v":""},{"$f":"IFERROR(INDEX($CP$4:$CR$48,SMALL(IF((ISERROR(SEARCH($AM$14,PL_YEAR)*SEARCH($AM$14,PL_YEAR)*SEARCH($AM$12,PL_TYPE)))+(COUNTIFS($AL$18:AO50,PL_YEAR,$AM$18:AP50,PL_DAYS,$AN$18:AQ50,PL_TYPE)>0),\"\",ROW(PL_YEAR)-MIN(ROW(PL_YEAR))+1),1),COLUMN(E41)),\"\")","v":""},{"$f":"IFERROR(INDEX($CP$4:$CR$48,SMALL(IF((ISERROR(SEARCH($AQ$14,PL_YEAR)*SEARCH($AQ$14,PL_YEAR)*SEARCH($AQ$12,PL_TYPE)))+(COUNTIFS($AP$18:AP50,PL_YEAR,$AQ$18:AQ50,PL_DAYS,$AR$18:AR50,PL_TYPE)>0),\"\",ROW(PL_YEAR)-MIN(ROW(PL_YEAR))+1),1),COLUMN(A41)),\"\")","v":""},{"$f":"IFERROR(INDEX($CP$4:$CR$48,SMALL(IF((ISERROR(SEARCH($AQ$14,PL_YEAR)*SEARCH($AQ$14,PL_YEAR)*SEARCH($AQ$12,PL_TYPE)))+(COUNTIFS($AP$18:AQ50,PL_YEAR,$AQ$18:AR50,PL_DAYS,$AR$18:AS50,PL_TYPE)>0),\"\",ROW(PL_YEAR)-MIN(ROW(PL_YEAR))+1),1),COLUMN(B41)),\"\")","v":""},{"$f":"IFERROR(INDEX($CP$4:$CR$48,SMALL(IF((ISERROR(SEARCH($AQ$14,PL_YEAR)*SEARCH($AQ$14,PL_YEAR)*SEARCH($AQ$12,PL_TYPE)))+(COUNTIFS($AP$18:AR50,PL_YEAR,$AQ$18:AS50,PL_DAYS,$AR$18:AT50,PL_TYPE)>0),\"\",ROW(PL_YEAR)-MIN(ROW(PL_YEAR))+1),1),COLUMN(C41)),\"\")","v":""},{"$f":"IFERROR(INDEX($CP$4:$CR$48,SMALL(IF((ISERROR(SEARCH($AM$14,PL_YEAR)*SEARCH($AM$14,PL_YEAR)*SEARCH($AM$12,PL_TYPE)))+(COUNTIFS($AL$18:AS50,PL_YEAR,$AM$18:AT50,PL_DAYS,$AN$18:AU50,PL_TYPE)>0),\"\",ROW(PL_YEAR)-MIN(ROW(PL_YEAR))+1),1),COLUMN(E41)),\"\")","v":""},{"$f":"IFERROR(INDEX($CP$4:$CR$48,SMALL(IF((ISERROR(SEARCH($AU$14,PL_YEAR)*SEARCH($AU$14,PL_YEAR)*SEARCH($AU$12,PL_TYPE)))+(COUNTIFS($AT$18:AT50,PL_YEAR,$AU$18:AU50,PL_DAYS,$AV$18:AV50,PL_TYPE)>0),\"\",ROW(PL_YEAR)-MIN(ROW(PL_YEAR))+1),1),COLUMN(A41)),\"\")","v":""},{"$f":"IFERROR(INDEX($CP$4:$CR$48,SMALL(IF((ISERROR(SEARCH($AU$14,PL_YEAR)*SEARCH($AU$14,PL_YEAR)*SEARCH($AU$12,PL_TYPE)))+(COUNTIFS($AT$18:AU50,PL_YEAR,$AU$18:AV50,PL_DAYS,$AV$18:AW50,PL_TYPE)>0),\"\",ROW(PL_YEAR)-MIN(ROW(PL_YEAR))+1),1),COLUMN(B41)),\"\")","v":""},{"$f":"IFERROR(INDEX($CP$4:$CR$48,SMALL(IF((ISERROR(SEARCH($AU$14,PL_YEAR)*SEARCH($AU$14,PL_YEAR)*SEARCH($AU$12,PL_TYPE)))+(COUNTIFS($AT$18:AV50,PL_YEAR,$AU$18:AW50,PL_DAYS,$AU$18:AW50,PL_TYPE)>0),\"\",ROW(PL_YEAR)-MIN(ROW(PL_YEAR))+1),1),COLUMN(C41)),\"\")","v":""},{"$f":"IFERROR(INDEX($CP$4:$CR$48,SMALL(IF((ISERROR(SEARCH($AU$14,PL_YEAR)*SEARCH($AU$14,PL_YEAR)*SEARCH($AU$12,PL_TYPE)))+(COUNTIFS($AT$18:AW50,PL_YEAR,$AU$18:AW50,PL_DAYS,$AU$18:AW50,PL_TYPE)>0),\"\",ROW(PL_YEAR)-MIN(ROW(PL_YEAR))+1),1),COLUMN(E41)),\"\")","v":""},null,null,null,null,null,null,null,45,null,1,{"$error":"#N/A"},"",{"$f":"IF(PL!E61=\"\",\"\",PL!E61)","v":""},{"$f":"IF(PL!F61=\"\",\"\",PL!F61)","v":""},{"$f":"IF(PL!G61=\"\",\"\",PL!G61)","v":""},{"$f":"IF(PL!H61=\"\",\"\",PL!H61)","v":""},0]
[null,"2016-01-01","2016-06-30","2016-06-30","YES","YES","2016-01-01","2016-06-30",2016,"A","2016-A",182,315,15,"2016-A",0,0,0,0,315,315,315,0,0,6,5,"YES",6,false,"YES",null,null,null,null,null,null,null,{"$f":"IFERROR(INDEX($CP$4:$CR$48,SMALL(IF((ISERROR(SEARCH($AM$14,PL_YEAR)*SEARCH($AM$14,PL_YEAR)*SEARCH($AM$12,PL_TYPE)))+(COUNTIFS(AL$18:$AL51,PL_YEAR,$AM$18:AM51,PL_DAYS,$AN$18:AN51,PL_TYPE)>0),\"\",ROW(PL_YEAR)-MIN(ROW(PL_YEAR))+1),1),COLUMN(A42)),\"\")","v":""},{"$f":"IFERROR(INDEX($CP$4:$CR$48,SMALL(IF((ISERROR(SEARCH($AM$14,PL_YEAR)*SEARCH($AM$14,PL_YEAR)*SEARCH($AM$12,PL_TYPE)))+(COUNTIFS($AL$18:AM51,PL_YEAR,$AM$18:AN51,PL_DAYS,$AN$18:AO51,PL_TYPE)>0),\"\",ROW(PL_YEAR)-MIN(ROW(PL_YEAR))+1),1),COLUMN(B42)),\"\")","v":""},{"$f":"IFERROR(INDEX($CP$4:$CR$48,SMALL(IF((ISERROR(SEARCH($AM$14,PL_YEAR)*SEARCH($AM$14,PL_YEAR)*SEARCH($AM$12,PL_TYPE)))+(COUNTIFS($AL$18:AN51,PL_YEAR,$AM$18:AO51,PL_DAYS,$AN$18:AP51,PL_TYPE)>0),\"\",ROW(PL_YEAR)-MIN(ROW(PL_YEAR))+1),1),COLUMN(C42)),\"\")","v":""},{"$f":"IFERROR(INDEX($CP$4:$CR$48,SMALL(IF((ISERROR(SEARCH($AM$14,PL_YEAR)*SEARCH($AM$14,PL_YEAR)*SEARCH($AM$12,PL_TYPE)))+(COUNTIFS($AL$18:AO51,PL_YEAR,$AM$18:AP51,PL_DAYS,$AN$18:AQ51,PL_TYPE)>0),\"\",ROW(PL_YEAR)-MIN(ROW(PL_YEAR))+1),1),COLUMN(E42)),\"\")","v":""},{"$f":"IFERROR(INDEX($CP$4:$CR$48,SMALL(IF((ISERROR(SEARCH($AQ$14,PL_YEAR)*SEARCH($AQ$14,PL_YEAR)*SEARCH($AQ$12,PL_TYPE)))+(COUNTIFS($AP$18:AP51,PL_YEAR,$AQ$18:AQ51,PL_DAYS,$AR$18:AR51,PL_TYPE)>0),\"\",ROW(PL_YEAR)-MIN(ROW(PL_YEAR))+1),1),COLUMN(A42)),\"\")","v":""},{"$f":"IFERROR(INDEX($CP$4:$CR$48,SMALL(IF((ISERROR(SEARCH($AQ$14,PL_YEAR)*SEARCH($AQ$14,PL_YEAR)*SEARCH($AQ$12,PL_TYPE)))+(COUNTIFS($AP$18:AQ51,PL_YEAR,$AQ$18:AR51,PL_DAYS,$AR$18:AS51,PL_TYPE)>0),\"\",ROW(PL_YEAR)-MIN(ROW(PL_YEAR))+1),1),COLUMN(B42)),\"\")","v":""},{"$f":"IFERROR(INDEX($CP$4:$CR$48,SMALL(IF((ISERROR(SEARCH($AQ$14,PL_YEAR)*SEARCH($AQ$14,PL_YEAR)*SEARCH($AQ$12,PL_TYPE)))+(COUNTIFS($AP$18:AR51,PL_YEAR,$AQ$18:AS51,PL_DAYS,$AR$18:AT51,PL_TYPE)>0),\"\",ROW(PL_YEAR)-MIN(ROW(PL_YEAR))+1),1),COLUMN(C42)),\"\")","v":""},{"$f":"IFERROR(INDEX($CP$4:$CR$48,SMALL(IF((ISERROR(SEARCH($AM$14,PL_YEAR)*SEARCH($AM$14,PL_YEAR)*SEARCH($AM$12,PL_TYPE)))+(COUNTIFS($AL$18:AS51,PL_YEAR,$AM$18:AT51,PL_DAYS,$AN$18:AU51,PL_TYPE)>0),\"\",ROW(PL_YEAR)-MIN(ROW(PL_YEAR))+1),1),COLUMN(E42)),\"\")","v":""},{"$f":"IFERROR(INDEX($CP$4:$CR$48,SMALL(IF((ISERROR(SEARCH($AU$14,PL_YEAR)*SEARCH($AU$14,PL_YEAR)*SEARCH($AU$12,PL_TYPE)))+(COUNTIFS($AT$18:AT51,PL_YEAR,$AU$18:AU51,PL_DAYS,$AV$18:AV51,PL_TYPE)>0),\"\",ROW(PL_YEAR)-MIN(ROW(PL_YEAR))+1),1),COLUMN(A42)),\"\")","v":""},{"$f":"IFERROR(INDEX($CP$4:$CR$48,SMALL(IF((ISERROR(SEARCH($AU$14,PL_YEAR)*SEARCH($AU$14,PL_YEAR)*SEARCH($AU$12,PL_TYPE)))+(COUNTIFS($AT$18:AU51,PL_YEAR,$AU$18:AV51,PL_DAYS,$AV$18:AW51,PL_TYPE)>0),\"\",ROW(PL_YEAR)-MIN(ROW(PL_YEAR))+1),1),COLUMN(B42)),\"\")","v":""},{"$f":"IFERROR(INDEX($CP$4:$CR$48,SMALL(IF((ISERROR(SEARCH($AU$14,PL_YEAR)*SEARCH($AU$14,PL_YEAR)*SEARCH($AU$12,PL_TYPE)))+(COUNTIFS($AT$18:AV51,PL_YEAR,$AU$18:AW51,PL_DAYS,$AU$18:AW51,PL_TYPE)>0),\"\",ROW(PL_YEAR)-MIN(ROW(PL_YEAR))+1),1),COLUMN(C42)),\"\")","v":""},{"$f":"IFERROR(INDEX($CP$4:$CR$48,SMALL(IF((ISERROR(SEARCH($AU$14,PL_YEAR)*SEARCH($AU$14,PL_YEAR)*SEARCH($AU$12,PL_TYPE)))+(COUNTIFS($AT$18:AW51,PL_YEAR,$AU$18:AW51,PL_DAYS,$AU$18:AW51,PL_TYPE)>0),\"\",ROW(PL_YEAR)-MIN(ROW(PL_YEAR))+1),1),COLUMN(E42)),\"\")","v":""},null,null,null,null,null,null,null,45,null,1,{"$error":"#N/A"},"",{"$f":"IF(PL!E62=\"\",\"\",PL!E62)","v":""},{"$f":"IF(PL!F62=\"\",\"\",PL!F62)","v":""},{"$f":"IF(PL!G62=\"\",\"\",PL!G62)","v":""},{"$f":"IF(PL!H62=\"\",\"\",PL!H62)","v":""},0]
[null,"2016-07-01","2016-12-31","2016-12-31","YES","YES","2016-07-01","2016-12-31",2016,"B","2016-B",184,315,15,"2016-B",0,0,0,0,315,315,315,0,0,6,5,"YES",6,false,"YES",null,null,null,null,null,null,null,{"$f":"IFERROR(INDEX($CP$4:$CR$48,SMALL(IF((ISERROR(SEARCH($AM$14,PL_YEAR)*SEARCH($AM$14,PL_YEAR)*SEARCH($AM$12,PL_TYPE)))+(COUNTIFS(AL$18:$AL52,PL_YEAR,$AM$18:AM52,PL_DAYS,$AN$18:AN52,PL_TYPE)>0),\"\",ROW(PL_YEAR)-MIN(ROW(PL_YEAR))+1),1),COLUMN(A43)),\"\")","v":""},{"$f":"IFERROR(INDEX($CP$4:$CR$48,SMALL(IF((ISERROR(SEARCH($AM$14,PL_YEAR)*SEARCH($AM$14,PL_YEAR)*SEARCH($AM$12,PL_TYPE)))+(COUNTIFS($AL$18:AM52,PL_YEAR,$AM$18:AN52,PL_DAYS,$AN$18:AO52,PL_TYPE)>0),\"\",ROW(PL_YEAR)-MIN(ROW(PL_YEAR))+1),1),COLUMN(B43)),\"\")","v":""},{"$f":"IFERROR(INDEX($CP$4:$CR$48,SMALL(IF((ISERROR(SEARCH($AM$14,PL_YEAR)*SEARCH($AM$14,PL_YEAR)*SEARCH($AM$12,PL_TYPE)))+(COUNTIFS($AL$18:AN52,PL_YEAR,$AM$18:AO52,PL_DAYS,$AN$18:AP52,PL_TYPE)>0),\"\",ROW(PL_YEAR)-MIN(ROW(PL_YEAR))+1),1),COLUMN(C43)),\"\")","v":""},{"$f":"IFERROR(INDEX($CP$4:$CR$48,SMALL(IF((ISERROR(SEARCH($AM$14,PL_YEAR)*SEARCH($AM$14,PL_YEAR)*SEARCH($AM$12,PL_TYPE)))+(COUNTIFS($AL$18:AO52,PL_YEAR,$AM$18:AP52,PL_DAYS,$AN$18:AQ52,PL_TYPE)>0),\"\",ROW(PL_YEAR)-MIN(ROW(PL_YEAR))+1),1),COLUMN(E43)),\"\")","v":""},{"$f":"IFERROR(INDEX($CP$4:$CR$48,SMALL(IF((ISERROR(SEARCH($AQ$14,PL_YEAR)*SEARCH($AQ$14,PL_YEAR)*SEARCH($AQ$12,PL_TYPE)))+(COUNTIFS($AP$18:AP52,PL_YEAR,$AQ$18:AQ52,PL_DAYS,$AR$18:AR52,PL_TYPE)>0),\"\",ROW(PL_YEAR)-MIN(ROW(PL_YEAR))+1),1),COLUMN(A43)),\"\")","v":""},{"$f":"IFERROR(INDEX($CP$4:$CR$48,SMALL(IF((ISERROR(SEARCH($AQ$14,PL_YEAR)*SEARCH($AQ$14,PL_YEAR)*SEARCH($AQ$12,PL_TYPE)))+(COUNTIFS($AP$18:AQ52,PL_YEAR,$AQ$18:AR52,PL_DAYS,$AR$18:AS52,PL_TYPE)>0),\"\",ROW(PL_YEAR)-MIN(ROW(PL_YEAR))+1),1),COLUMN(B43)),\"\")","v":""},{"$f":"IFERROR(INDEX($CP$4:$CR$48,SMALL(IF((ISERROR(SEARCH($AQ$14,PL_YEAR)*SEARCH($AQ$14,PL_YEAR)*SEARCH($AQ$12,PL_TYPE)))+(COUNTIFS($AP$18:AR52,PL_YEAR,$AQ$18:AS52,PL_DAYS,$AR$18:AT52,PL_TYPE)>0),\"\",ROW(PL_YEAR)-MIN(ROW(PL_YEAR))+1),1),COLUMN(C43)),\"\")","v":""},{"$f":"IFERROR(INDEX($CP$4:$CR$48,SMALL(IF((ISERROR(SEARCH($AM$14,PL_YEAR)*SEARCH($AM$14,PL_YEAR)*SEARCH($AM$12,PL_TYPE)))+(COUNTIFS($AL$18:AS52,PL_YEAR,$AM$18:AT52,PL_DAYS,$AN$18:AU52,PL_TYPE)>0),\"\",ROW(PL_YEAR)-MIN(ROW(PL_YEAR))+1),1),COLUMN(E43)),\"\")","v":""},{"$f":"IFERROR(INDEX($CP$4:$CR$48,SMALL(IF((ISERROR(SEARCH($AU$14,PL_YEAR)*SEARCH($AU$14,PL_YEAR)*SEARCH($AU$12,PL_TYPE)))+(COUNTIFS($AT$18:AT52,PL_YEAR,$AU$18:AU52,PL_DAYS,$AV$18:AV52,PL_TYPE)>0),\"\",ROW(PL_YEAR)-MIN(ROW(PL_YEAR))+1),1),COLUMN(A43)),\"\")","v":""},{"$f":"IFERROR(INDEX($CP$4:$CR$48,SMALL(IF((ISERROR(SEARCH($AU$14,PL_YEAR)*SEARCH($AU$14,PL_YEAR)*SEARCH($AU$12,PL_TYPE)))+(COUNTIFS($AT$18:AU52,PL_YEAR,$AU$18:AV52,PL_DAYS,$AV$18:AW52,PL_TYPE)>0),\"\",ROW(PL_YEAR)-MIN(ROW(PL_YEAR))+1),1),COLUMN(B43)),\"\")","v":""},{"$f":"IFERROR(INDEX($CP$4:$CR$48,SMALL(IF((ISERROR(SEARCH($AU$14,PL_YEAR)*SEARCH($AU$14,PL_YEAR)*SEARCH($AU$12,PL_TYPE)))+(COUNTIFS($AT$18:AV52,PL_YEAR,$AU$18:AW52,PL_DAYS,$AU$18:AW52,PL_TYPE)>0),\"\",ROW(PL_YEAR)-MIN(ROW(PL_YEAR))+1),1),COLUMN(C43)),\"\")","v":""},{"$f":"IFERROR(INDEX($CP$4:$CR$48,SMALL(IF((ISERROR(SEARCH($AU$14,PL_YEAR)*SEARCH($AU$14,PL_YEAR)*SEARCH($AU$12,PL_TYPE)))+(COUNTIFS($AT$18:AW52,PL_YEAR,$AU$18:AW52,PL_DAYS,$AU$18:AW52,PL_TYPE)>0),\"\",ROW(PL_YEAR)-MIN(ROW(PL_YEAR))+1),1),COLUMN(E43)),\"\")","v":""},null,null,null,null,null,null,null,45,null,1,{"$error":"#N/A"},"",{"$f":"IF(PL!E63=\"\",\"\",PL!E63)","v":""},{"$f":"IF(PL!F63=\"\",\"\",PL!F63)","v":""},{"$f":"IF(PL!G63=\"\",\"\",PL!G63)","v":""},{"$f":"IF(PL!H63=\"\",\"\",PL!H63)","v":""},0]
[null,"2017-01-01","2017-06-30","2017-06-30","YES","YES","2017-01-01","2017-06-30",2017,"A","2017-A",181,315,15,"2017-A",0,0,0,0,315,315,315,0,0,6,5,"YES",6,false,"YES",null,null,null,null,null,null,null,{"$f":"IFERROR(INDEX($CP$4:$CR$48,SMALL(IF((ISERROR(SEARCH($AM$14,PL_YEAR)*SEARCH($AM$14,PL_YEAR)*SEARCH($AM$12,PL_TYPE)))+(COUNTIFS(AL$18:$AL53,PL_YEAR,$AM$18:AM53,PL_DAYS,$AN$18:AN53,PL_TYPE)>0),\"\",ROW(PL_YEAR)-MIN(ROW(PL_YEAR))+1),1),COLUMN(A44)),\"\")","v":""},{"$f":"IFERROR(INDEX($CP$4:$CR$48,SMALL(IF((ISERROR(SEARCH($AM$14,PL_YEAR)*SEARCH($AM$14,PL_YEAR)*SEARCH($AM$12,PL_TYPE)))+(COUNTIFS($AL$18:AM53,PL_YEAR,$AM$18:AN53,PL_DAYS,$AN$18:AO53,PL_TYPE)>0),\"\",ROW(PL_YEAR)-MIN(ROW(PL_YEAR))+1),1),COLUMN(B44)),\"\")","v":""},{"$f":"IFERROR(INDEX($CP$4:$CR$48,SMALL(IF((ISERROR(SEARCH($AM$14,PL_YEAR)*SEARCH($AM$14,PL_YEAR)*SEARCH($AM$12,PL_TYPE)))+(COUNTIFS($AL$18:AN53,PL_YEAR,$AM$18:AO53,PL_DAYS,$AN$18:AP53,PL_TYPE)>0),\"\",ROW(PL_YEAR)-MIN(ROW(PL_YEAR))+1),1),COLUMN(C44)),\"\")","v":""},{"$f":"IFERROR(INDEX($CP$4:$CR$48,SMALL(IF((ISERROR(SEARCH($AM$14,PL_YEAR)*SEARCH($AM$14,PL_YEAR)*SEARCH($AM$12,PL_TYPE)))+(COUNTIFS($AL$18:AO53,PL_YEAR,$AM$18:AP53,PL_DAYS,$AN$18:AQ53,PL_TYPE)>0),\"\",ROW(PL_YEAR)-MIN(ROW(PL_YEAR))+1),1),COLUMN(E44)),\"\")","v":""},{"$f":"IFERROR(INDEX($CP$4:$CR$48,SMALL(IF((ISERROR(SEARCH($AQ$14,PL_YEAR)*SEARCH($AQ$14,PL_YEAR)*SEARCH($AQ$12,PL_TYPE)))+(COUNTIFS($AP$18:AP53,PL_YEAR,$AQ$18:AQ53,PL_DAYS,$AR$18:AR53,PL_TYPE)>0),\"\",ROW(PL_YEAR)-MIN(ROW(PL_YEAR))+1),1),COLUMN(A44)),\"\")","v":""},{"$f":"IFERROR(INDEX($CP$4:$CR$48,SMALL(IF((ISERROR(SEARCH($AQ$14,PL_YEAR)*SEARCH($AQ$14,PL_YEAR)*SEARCH($AQ$12,PL_TYPE)))+(COUNTIFS($AP$18:AQ53,PL_YEAR,$AQ$18:AR53,PL_DAYS,$AR$18:AS53,PL_TYPE)>0),\"\",ROW(PL_YEAR)-MIN(ROW(PL_YEAR))+1),1),COLUMN(B44)),\"\")","v":""},{"$f":"IFERROR(INDEX($CP$4:$CR$48,SMALL(IF((ISERROR(SEARCH($AQ$14,PL_YEAR)*SEARCH($AQ$14,PL_YEAR)*SEARCH($AQ$12,PL_TYPE)))+(COUNTIFS($AP$18:AR53,PL_YEAR,$AQ$18:AS53,PL_DAYS,$AR$18:AT53,PL_TYPE)>0),\"\",ROW(PL_YEAR)-MIN(ROW(PL_YEAR))+1),1),COLUMN(C44)),\"\")","v":""},{"$f":"IFERROR(INDEX($CP$4:$CR$48,SMALL(IF((ISERROR(SEARCH($AM$14,PL_YEAR)*SEARCH($AM$14,PL_YEAR)*SEARCH($AM$12,PL_TYPE)))+(COUNTIFS($AL$18:AS53,PL_YEAR,$AM$18:AT53,PL_DAYS,$AN$18:AU53,PL_TYPE)>0),\"\",ROW(PL_YEAR)-MIN(ROW(PL_YEAR))+1),1),COLUMN(E44)),\"\")","v":""},{"$f":"IFERROR(INDEX($CP$4:$CR$48,SMALL(IF((ISERROR(SEARCH($AU$14,PL_YEAR)*SEARCH($AU$14,PL_YEAR)*SEARCH($AU$12,PL_TYPE)))+(COUNTIFS($AT$18:AT53,PL_YEAR,$AU$18:AU53,PL_DAYS,$AV$18:AV53,PL_TYPE)>0),\"\",ROW(PL_YEAR)-MIN(ROW(PL_YEAR))+1),1),COLUMN(A44)),\"\")","v":""},{"$f":"IFERROR(INDEX($CP$4:$CR$48,SMALL(IF((ISERROR(SEARCH($AU$14,PL_YEAR)*SEARCH($AU$14,PL_YEAR)*SEARCH($AU$12,PL_TYPE)))+(COUNTIFS($AT$18:AU53,PL_YEAR,$AU$18:AV53,PL_DAYS,$AV$18:AW53,PL_TYPE)>0),\"\",ROW(PL_YEAR)-MIN(ROW(PL_YEAR))+1),1),COLUMN(B44)),\"\")","v":""},{"$f":"IFERROR(INDEX($CP$4:$CR$48,SMALL(IF((ISERROR(SEARCH($AU$14,PL_YEAR)*SEARCH($AU$14,PL_YEAR)*SEARCH($AU$12,PL_TYPE)))+(COUNTIFS($AT$18:AV53,PL_YEAR,$AU$18:AW53,PL_DAYS,$AU$18:AW53,PL_TYPE)>0),\"\",ROW(PL_YEAR)-MIN(ROW(PL_YEAR))+1),1),COLUMN(C44)),\"\")","v":""},{"$f":"IFERROR(INDEX($CP$4:$CR$48,SMALL(IF((ISERROR(SEARCH($AU$14,PL_YEAR)*SEARCH($AU$14,PL_YEAR)*SEARCH($AU$12,PL_TYPE)))+(COUNTIFS($AT$18:AW53,PL_YEAR,$AU$18:AW53,PL_DAYS,$AU$18:AW53,PL_TYPE)>0),\"\",ROW(PL_YEAR)-MIN(ROW(PL_YEAR))+1),1),COLUMN(E44)),\"\")","v":""},null,null,null,null,null,null,null,45,null,1,{"$error":"#N/A"},"",{"$f":"IF(PL!E64=\"\",\"\",PL!E64)","v":""},{"$f":"IF(PL!F64=\"\",\"\",PL!F64)","v":""},{"$f":"IF(PL!G64=\"\",\"\",PL!G64)","v":""},{"$f":"IF(PL!H64=\"\",\"\",PL!H64)","v":""},0]
[null,"2017-07-01","2017-12-31","2017-12-31","YES","YES","2017-07-01","2017-12-31",2017,"B","2017-B",184,315,15,"2017-B",0,0,0,0,315,315,315,0,0,6,5,"YES",6,false,"YES",null,null,null,null,null,null,null,{"$f":"IFERROR(INDEX($CP$4:$CR$48,SMALL(IF((ISERROR(SEARCH($AM$14,PL_YEAR)*SEARCH($AM$14,PL_YEAR)*SEARCH($AM$12,PL_TYPE)))+(COUNTIFS(AL$18:$AL54,PL_YEAR,$AM$18:AM54,PL_DAYS,$AN$18:AN54,PL_TYPE)>0),\"\",ROW(PL_YEAR)-MIN(ROW(PL_YEAR))+1),1),COLUMN(A45)),\"\")","v":""},{"$f":"IFERROR(INDEX($CP$4:$CR$48,SMALL(IF((ISERROR(SEARCH($AM$14,PL_YEAR)*SEARCH($AM$14,PL_YEAR)*SEARCH($AM$12,PL_TYPE)))+(COUNTIFS($AL$18:AM54,PL_YEAR,$AM$18:AN54,PL_DAYS,$AN$18:AO54,PL_TYPE)>0),\"\",ROW(PL_YEAR)-MIN(ROW(PL_YEAR))+1),1),COLUMN(B45)),\"\")","v":""},{"$f":"IFERROR(INDEX($CP$4:$CR$48,SMALL(IF((ISERROR(SEARCH($AM$14,PL_YEAR)*SEARCH($AM$14,PL_YEAR)*SEARCH($AM$12,PL_TYPE)))+(COUNTIFS($AL$18:AN54,PL_YEAR,$AM$18:AO54,PL_DAYS,$AN$18:AP54,PL_TYPE)>0),\"\",ROW(PL_YEAR)-MIN(ROW(PL_YEAR))+1),1),COLUMN(C45)),\"\")","v":""},{"$f":"IFERROR(INDEX($CP$4:$CR$48,SMALL(IF((ISERROR(SEARCH($AM$14,PL_YEAR)*SEARCH($AM$14,PL_YEAR)*SEARCH($AM$12,PL_TYPE)))+(COUNTIFS($AL$18:AO54,PL_YEAR,$AM$18:AP54,PL_DAYS,$AN$18:AQ54,PL_TYPE)>0),\"\",ROW(PL_YEAR)-MIN(ROW(PL_YEAR))+1),1),COLUMN(E45)),\"\")","v":""},{"$f":"IFERROR(INDEX($CP$4:$CR$48,SMALL(IF((ISERROR(SEARCH($AQ$14,PL_YEAR)*SEARCH($AQ$14,PL_YEAR)*SEARCH($AQ$12,PL_TYPE)))+(COUNTIFS($AP$18:AP54,PL_YEAR,$AQ$18:AQ54,PL_DAYS,$AR$18:AR54,PL_TYPE)>0),\"\",ROW(PL_YEAR)-MIN(ROW(PL_YEAR))+1),1),COLUMN(A45)),\"\")","v":""},{"$f":"IFERROR(INDEX($CP$4:$CR$48,SMALL(IF((ISERROR(SEARCH($AQ$14,PL_YEAR)*SEARCH($AQ$14,PL_YEAR)*SEARCH($AQ$12,PL_TYPE)))+(COUNTIFS($AP$18:AQ54,PL_YEAR,$AQ$18:AR54,PL_DAYS,$AR$18:AS54,PL_TYPE)>0),\"\",ROW(PL_YEAR)-MIN(ROW(PL_YEAR))+1),1),COLUMN(B45)),\"\")","v":""},{"$f":"IFERROR(INDEX($CP$4:$CR$48,SMALL(IF((ISERROR(SEARCH($AQ$14,PL_YEAR)*SEARCH($AQ$14,PL_YEAR)*SEARCH($AQ$12,PL_TYPE)))+(COUNTIFS($AP$18:AR54,PL_YEAR,$AQ$18:AS54,PL_DAYS,$AR$18:AT54,PL_TYPE)>0),\"\",ROW(PL_YEAR)-MIN(ROW(PL_YEAR))+1),1),COLUMN(C45)),\"\")","v":""},{"$f":"IFERROR(INDEX($CP$4:$CR$48,SMALL(IF((ISERROR(SEARCH($AM$14,PL_YEAR)*SEARCH($AM$14,PL_YEAR)*SEARCH($AM$12,PL_TYPE)))+(COUNTIFS($AL$18:AS54,PL_YEAR,$AM$18:AT54,PL_DAYS,$AN$18:AU54,PL_TYPE)>0),\"\",ROW(PL_YEAR)-MIN(ROW(PL_YEAR))+1),1),COLUMN(E45)),\"\")","v":""},{"$f":"IFERROR(INDEX($CP$4:$CR$48,SMALL(IF((ISERROR(SEARCH($AU$14,PL_YEAR)*SEARCH($AU$14,PL_YEAR)*SEARCH($AU$12,PL_TYPE)))+(COUNTIFS($AT$18:AT54,PL_YEAR,$AU$18:AU54,PL_DAYS,$AV$18:AV54,PL_TYPE)>0),\"\",ROW(PL_YEAR)-MIN(ROW(PL_YEAR))+1),1),COLUMN(A45)),\"\")","v":""},{"$f":"IFERROR(INDEX($CP$4:$CR$48,SMALL(IF((ISERROR(SEARCH($AU$14,PL_YEAR)*SEARCH($AU$14,PL_YEAR)*SEARCH($AU$12,PL_TYPE)))+(COUNTIFS($AT$18:AU54,PL_YEAR,$AU$18:AV54,PL_DAYS,$AV$18:AW54,PL_TYPE)>0),\"\",ROW(PL_YEAR)-MIN(ROW(PL_YEAR))+1),1),COLUMN(B45)),\"\")","v":""},{"$f":"IFERROR(INDEX($CP$4:$CR$48,SMALL(IF((ISERROR(SEARCH($AU$14,PL_YEAR)*SEARCH($AU$14,PL_YEAR)*SEARCH($AU$12,PL_TYPE)))+(COUNTIFS($AT$18:AV54,PL_YEAR,$AU$18:AW54,PL_DAYS,$AU$18:AW54,PL_TYPE)>0),\"\",ROW(PL_YEAR)-MIN(ROW(PL_YEAR))+1),1),COLUMN(C45)),\"\")","v":""},{"$f":"IFERROR(INDEX($CP$4:$CR$48,SMALL(IF((ISERROR(SEARCH($AU$14,PL_YEAR)*SEARCH($AU$14,PL_YEAR)*SEARCH($AU$12,PL_TYPE)))+(COUNTIFS($AT$18:AW54,PL_YEAR,$AU$18:AW54,PL_DAYS,$AU$18:AW54,PL_TYPE)>0),\"\",ROW(PL_YEAR)-MIN(ROW(PL_YEAR))+1),1),COLUMN(E45)),\"\")","v":""},null,null,null,null,null,null,null,45,null,1,{"$error":"#N/A"},"",{"$f":"IF(PL!E65=\"\",\"\",PL!E65)","v":""},{"$f":"IF(PL!F65=\"\",\"\",PL!F65)","v":""},{"$f":"IF(PL!G65=\"\",\"\",PL!G65)","v":""},{"$f":"IF(PL!H65=\"\",\"\",PL!H65)","v":""},0]
[null,"2018-01-01","2018-06-30","2018-06-30","YES","YES","2018-01-01","2018-06-30",2018,"A","2018-A",181,315,15,"2018-A",0,0,0,0,315,315,315,0,0,6,5,"YES",6,false,"YES",null,null,null,null,null,null,null,{"$f":"IFERROR(INDEX($CP$4:$CR$48,SMALL(IF((ISERROR(SEARCH($AM$14,PL_YEAR)*SEARCH($AM$14,PL_YEAR)*SEARCH($AM$12,PL_TYPE)))+(COUNTIFS(AL$18:$AL55,PL_YEAR,$AM$18:AM55,PL_DAYS,$AN$18:AN55,PL_TYPE)>0),\"\",ROW(PL_YEAR)-MIN(ROW(PL_YEAR))+1),1),COLUMN(A46)),\"\")","v":""},{"$f":"IFERROR(INDEX($CP$4:$CR$48,SMALL(IF((ISERROR(SEARCH($AM$14,PL_YEAR)*SEARCH($AM$14,PL_YEAR)*SEARCH($AM$12,PL_TYPE)))+(COUNTIFS($AL$18:AM55,PL_YEAR,$AM$18:AN55,PL_DAYS,$AN$18:AO55,PL_TYPE)>0),\"\",ROW(PL_YEAR)-MIN(ROW(PL_YEAR))+1),1),COLUMN(B46)),\"\")","v":""},{"$f":"IFERROR(INDEX($CP$4:$CR$48,SMALL(IF((ISERROR(SEARCH($AM$14,PL_YEAR)*SEARCH($AM$14,PL_YEAR)*SEARCH($AM$12,PL_TYPE)))+(COUNTIFS($AL$18:AN55,PL_YEAR,$AM$18:AO55,PL_DAYS,$AN$18:AP55,PL_TYPE)>0),\"\",ROW(PL_YEAR)-MIN(ROW(PL_YEAR))+1),1),COLUMN(C46)),\"\")","v":""},{"$f":"IFERROR(INDEX($CP$4:$CR$48,SMALL(IF((ISERROR(SEARCH($AM$14,PL_YEAR)*SEARCH($AM$14,PL_YEAR)*SEARCH($AM$12,PL_TYPE)))+(COUNTIFS($AL$18:AO55,PL_YEAR,$AM$18:AP55,PL_DAYS,$AN$18:AQ55,PL_TYPE)>0),\"\",ROW(PL_YEAR)-MIN(ROW(PL_YEAR))+1),1),COLUMN(E46)),\"\")","v":""},{"$f":"IFERROR(INDEX($CP$4:$CR$48,SMALL(IF((ISERROR(SEARCH($AQ$14,PL_YEAR)*SEARCH($AQ$14,PL_YEAR)*SEARCH($AQ$12,PL_TYPE)))+(COUNTIFS($AP$18:AP55,PL_YEAR,$AQ$18:AQ55,PL_DAYS,$AR$18:AR55,PL_TYPE)>0),\"\",ROW(PL_YEAR)-MIN(ROW(PL_YEAR))+1),1),COLUMN(A46)),\"\")","v":""},{"$f":"IFERROR(INDEX($CP$4:$CR$48,SMALL(IF((ISERROR(SEARCH($AQ$14,PL_YEAR)*SEARCH($AQ$14,PL_YEAR)*SEARCH($AQ$12,PL_TYPE)))+(COUNTIFS($AP$18:AQ55,PL_YEAR,$AQ$18:AR55,PL_DAYS,$AR$18:AS55,PL_TYPE)>0),\"\",ROW(PL_YEAR)-MIN(ROW(PL_YEAR))+1),1),COLUMN(B46)),\"\")","v":""},{"$f":"IFERROR(INDEX($CP$4:$CR$48,SMALL(IF((ISERROR(SEARCH($AQ$14,PL_YEAR)*SEARCH($AQ$14,PL_YEAR)*SEARCH($AQ$12,PL_TYPE)))+(COUNTIFS($AP$18:AR55,PL_YEAR,$AQ$18:AS55,PL_DAYS,$AR$18:AT55,PL_TYPE)>0),\"\",ROW(PL_YEAR)-MIN(ROW(PL_YEAR))+1),1),COLUMN(C46)),\"\")","v":""},{"$f":"IFERROR(INDEX($CP$4:$CR$48,SMALL(IF((ISERROR(SEARCH($AM$14,PL_YEAR)*SEARCH($AM$14,PL_YEAR)*SEARCH($AM$12,PL_TYPE)))+(COUNTIFS($AL$18:AS55,PL_YEAR,$AM$18:AT55,PL_DAYS,$AN$18:AU55,PL_TYPE)>0),\"\",ROW(PL_YEAR)-MIN(ROW(PL_YEAR))+1),1),COLUMN(E46)),\"\")","v":""},{"$f":"IFERROR(INDEX($CP$4:$CR$48,SMALL(IF((ISERROR(SEARCH($AU$14,PL_YEAR)*SEARCH($AU$14,PL_YEAR)*SEARCH($AU$12,PL_TYPE)))+(COUNTIFS($AT$18:AT55,PL_YEAR,$AU$18:AU55,PL_DAYS,$AV$18:AV55,PL_TYPE)>0),\"\",ROW(PL_YEAR)-MIN(ROW(PL_YEAR))+1),1),COLUMN(A46)),\"\")","v":""},{"$f":"IFERROR(INDEX($CP$4:$CR$48,SMALL(IF((ISERROR(SEARCH($AU$14,PL_YEAR)*SEARCH($AU$14,PL_YEAR)*SEARCH($AU$12,PL_TYPE)))+(COUNTIFS($AT$18:AU55,PL_YEAR,$AU$18:AV55,PL_DAYS,$AV$18:AW55,PL_TYPE)>0),\"\",ROW(PL_YEAR)-MIN(ROW(PL_YEAR))+1),1),COLUMN(B46)),\"\")","v":""},{"$f":"IFERROR(INDEX($CP$4:$CR$48,SMALL(IF((ISERROR(SEARCH($AU$14,PL_YEAR)*SEARCH($AU$14,PL_YEAR)*SEARCH($AU$12,PL_TYPE)))+(COUNTIFS($AT$18:AV55,PL_YEAR,$AU$18:AW55,PL_DAYS,$AU$18:AW55,PL_TYPE)>0),\"\",ROW(PL_YEAR)-MIN(ROW(PL_YEAR))+1),1),COLUMN(C46)),\"\")","v":""},{"$f":"IFERROR(INDEX($CP$4:$CR$48,SMALL(IF((ISERROR(SEARCH($AU$14,PL_YEAR)*SEARCH($AU$14,PL_YEAR)*SEARCH($AU$12,PL_TYPE)))+(COUNTIFS($AT$18:AW55,PL_YEAR,$AU$18:AW55,PL_DAYS,$AU$18:AW55,PL_TYPE)>0),\"\",ROW(PL_YEAR)-MIN(ROW(PL_YEAR))+1),1),COLUMN(E46)),\"\")","v":""},null,null,null,null,null,null,null,45,null,1,{"$error":"#N/A"},"",{"$f":"IF(PL!E66=\"\",\"\",PL!E66)","v":""},{"$f":"IF(PL!F66=\"\",\"\",PL!F66)","v":""},{"$f":"IF(PL!G66=\"\",\"\",PL!G66)","v":""},{"$f":"IF(PL!H66=\"\",\"\",PL!H66)","v":""},0]
[null,"2018-07-01","2018-12-31","2018-12-31","YES","YES","2018-07-01","2018-12-31",2018,"B","2018-B",184,315,15,"2018-B",0,0,0,0,315,315,315,0,0,6,5,"YES",6,false,"YES",null,null,null,null,null,null,null,null,null,null,null,null,null,null,null,null,null,null,null,null,null,null,null,null,null,null,"END LINE","END LINE",{"$f":"SUM(BG12:BG56)","v":45}]
[null,"2019-01-01","2019-06-30","2019-06-30","YES","YES","2019-01-01","2019-06-30",2019,"A","2019-A",181,315,15,"2019-A",0,0,0,0,315,315,315,0,0,6,5,"YES",6,false,"YES"]
[null,"2019-07-01","2019-12-31","2019-12-31","YES","YES","2019-07-01","2019-12-31",2019,"B","2019-B",184,315,15,"2019-B",0,0,0,0,315,315,315,0,0,6,5,"YES",6,false,"YES"]
[null,"2020-01-01","2020-06-30","2020-06-30","YES","YES","2020-01-01","2020-06-30",2020,"A","2020-A",182,315,15,"2020-A",0,0,0,0,315,315,315,0,0,6,5,"YES",6,false,"YES"]
[null,"2020-07-01","2020-12-31","2020-12-31","YES","YES","2020-07-01","2020-12-31",2020,"B","2020-B",184,315,15,"2020-B",0,0,0,0,315,315,315,0,0,6,5,"YES",6,false,"YES"]
[null,"2021-01-01","2021-06-30","2021-06-30","YES","YES","2021-01-01","2021-06-30",2021,"A","2021-A",181,{"$f":"IF(L62=\"\",\"\",IF(V61>300,V61,MIN($T$10,V61)))","v":315},15,"2021-A",0,0,0,0,315,315,315,0,0,6,5,"YES",6,false,"YES"]
[null,"2021-07-01","2021-12-31","2021-12-31","YES","YES","2021-07-01","2021-12-31",2021,"B","2021-B",184,{"$f":"IF(L63=\"\",\"\",IF(V62>300,V62,MIN($T$10,V62)))","v":315},15,"2021-B",0,0,0,0,315,315,315,0,0,6,5,"YES",6,false,"YES"]
[null,"2022-01-01","2022-06-30","2022-06-30","YES","YES","2022-01-01","2022-06-30",2022,"A","2022-A",181,315,15,"2022-A",0,0,0,0,315,315,315,0,0,6,5,"YES",6,false,"YES"]
[null,"2022-07-01","2022-12-31","2022-12-31","YES","YES","2022-07-01","2022-12-31",2022,"B","2022-B",184,315,15,"2022-B",0,0,0,0,315,315,315,0,0,6,5,"YES",6,false,"YES"]
[null,"2023-01-01","2023-06-30","2023-06-30","YES","YES","2023-01-01","2023-06-30",2023,"A","2023-A",181,315,15,"2023-A",0,0,0,0,315,315,315,0,0,6,5,"YES",6,false,"YES"]
[null,"2023-07-01","2023-08-31","2023-08-31","YES","YES","2023-07-01","2023-08-31",2023,"B","2023-B",62,315,5,"2023-B",0,0,0,0,315,315,315,0,0,2,1,"YES",2,false,"YES"]
[null,"","","","NO","NO","","","","","-","","","","","","","","",0,{"$error":"#N/A"},"","","","","","","",false,""]
[null,"","","","NO","NO","","","","","-","","","","","","","","",0,{"$error":"#N/A"},"","","","","","","",false,""]
[null,"","","","NO","NO","","","","","-","","","","","","","","",0,{"$error":"#N/A"},"","","","","","","",false,""]
[null,"","","","NO","NO","","","","","-","","","","","","","","",0,{"$error":"#N/A"},"","","","","","","",false,""]
[null,"","","","NO","NO","","","","","-","","","","","","","","",0,{"$error":"#N/A"},"","","","","","","",false,""]
[null,"","","","NO","NO","","","","","-","","","","","","","","",0,{"$error":"#N/A"},"","","","","","","",false,""]
[null,"","","","NO","NO","","","","","-","","","","","","","","",0,{"$error":"#N/A"},"","","","","","","",false,""]
[null,"","","","NO","NO","","","","","-","","","","","","","","",0,{"$error":"#N/A"},"","","","","","","",false,""]
[null,"","","",{"$f":"IF($C$11>=D76,\"YES\",\"NO\")","v":"NO"},{"$f":"IFERROR(E76,\"NO\")","v":"NO"},"","","","",{"$f":"CONCATENATE(I76,\"-\",J76)","v":"-"},"","","",{"$f":"IF(F76=\"NO\",\"\",K76)","v":""},"",{"$f":"IF(O76=\"\",\"\",IF(ISERROR(MATCH(O76,$AL$19:$AL$56,0)),0,VLOOKUP(O76,$AL$19:$AV$56,2,0)))","v":""},{"$f":"IF(ISERROR(MATCH(O76,$AP$19:$AP$56,0)),0,VLOOKUP(O76,$AP$19:$AV$56,2,0))","v":""},{"$f":"IF(H76=\"\",\"\",IF(ISERROR(MATCH(O76,$AT$19:$AT$56,0)),0,VLOOKUP(O76,$AT$19:$AV$56,2,0)))","v":""},0,{"$error":"#N/A"},"","","","","","","",false,""]
[null,"","","","NO","NO","","","","","-",{"$f":"IF(F77=\"NO\",\"\",IF(E77=\"YES\",1+H77-G77,H77-G77))","v":""},"","","",{"$f":"IF(F77=\"NO\",\"\",IF(L76>0,INDEX($M$452:$CO$452,MATCH(O77,$M$453:$CO$453,0))))","v":""},"","","",0,{"$error":"#N/A"},"",{"$f":"IF(B77=\"\",\"\",INDEX($AJ$7:$AJ$18,MATCH(MONTH(B77),$AG$7:$AG$18,0))-(EOMONTH(B77,0)-B77+1))","v":""},"","","","","",{"$f":"IF($N$2=\"Vacation Deptt\",IF($J$5>B77,$K$5,$H$5))","v":false},""]
[null,{"$f":"IF(C77=\"\",\"\",IF($B$10=C77,\"\",C77+1))","v":""},"","","NO","NO",{"$f":"B78","v":""},{"$f":"IF(G78=\"\",\"\",IF(F78=\"YES\",D78,$C$11))","v":""},{"$f":"IF(H78=\"\",\"\",YEAR(G78))","v":""},{"$f":"IF(I78=\"\",\"\",IF(MONTH(H78)>6,\"B\",\"A\"))","v":""},"-","","","","","","","","",0,{"$f":"IF($N$3=\"A\",VLOOKUP(B78,$B$3:$E$6,4),VLOOKUP(B78,$B$3:$D$6,3))","v":{"$error":"#N/A"}},{"$f":"IF(F78=\"NO\",\"\",MIN(T78:U78))","v":""},"","","","","","",false,""]
[null,"","","","NO","NO","","","","","-","","","","","","","","",0,{"$error":"#N/A"},"","","","","",{"$f":"IF(B79=\"\",\"\",IF(Y79>=X79,\"YES\",\"NO\"))","v":""},{"$f":"IF(B79=\"\",\"\",IF(AA79=\"YES\",Z79+1,Z79))","v":""},false,""]
[null,"","","","NO","NO","","","","","-","","","","","","","","",0,{"$error":"#N/A"},"","","","",{"$f":"IFERROR(DATEDIF(B80,C80,\"M\"),\"\")","v":""},"","",false,""]
[null,"","","","NO","NO","","","","","-","","","","","","","","",0,{"$error":"#N/A"},"","","","","","","",false,""]
[null,"","","","NO","NO","","","","","-","","","","","","","","",0,{"$error":"#N/A"},"","","","","","","",false,""]
[null,"","","","NO","NO","","","","","-","","","","","","","","",0,{"$error":"#N/A"},"","","","","","","",false,""]
[null,"","","","NO","NO","","","","","-","","",{"$f":"IF(F84=\"NO\",\"\",IF(L84>0,MIN(AC84,MAX(Y84:Z84)*$N$5)))","v":""},"","","","","",0,{"$error":"#N/A"},"","","","","","","",false,""]
[null,"",{"$f":"IF(B85=\"\",\"\",IF(EOMONTH(B85,5)>=$B$10,$B$10,IF($N$3=\"B\",(EOMONTH(B85,5)),IF(EOMONTH(B85,11)>$B$10,$B$10,(EOMONTH(B85,11))))))","v":""},{"$f":"IF(B85=\"\",\"\",SMALL(IF(($C$11:$C$94<=$C$11)*($C$11:$C$94>=$D$11),$C$11:$C$94,\"A\"),ROW(A74)))","v":""},"NO","NO","","","","","-","","","","","","","","",0,{"$error":"#N/A"},"","","",{"$f":"IF(B85=\"\",\"\",IF(X85>0,TRUNC((L85-DAY(C85))/30,0),Z85+1))","v":""},"","","",false,""]
[null,"","","","NO","NO","","","",{"$f":"IF(I86=\"\",\"\",IF(MONTH(H86)>6,\"B\",\"A\"))","v":""},"-","","","","","","","","",0,{"$error":"#N/A"},"","",{"$f":"IF(B86=\"\",\"\",EOMONTH(C86,0)-C86)","v":""},"","","","",false,""]
[null,"","","","NO","NO","","","",{"$f":"IF(I87=\"\",\"\",IF(MONTH(H87)>6,\"B\",\"A\"))","v":""},"-","","","","","","","","",0,{"$error":"#N/A"},"","","","","","","",false,""]
[null,"","","","NO","NO","","","","","-","","","","","","","","",0,{"$error":"#N/A"},"","","","","","","",false,""]
[null,"","","","NO","NO","","","","","-","","","","","","","","",0,{"$error":"#N/A"},"","","","","","","",false,""]
[null,"","","","NO","NO","","","","","-","","","","","","","","",0,{"$error":"#N/A"},"","","","","","","",false,""]
[null,"","","","NO","NO","","","","","-","","","","","","","","",0,{"$error":"#N/A"},"","","","","","","",false,""]
[null,"","","","NO","NO","","","","","-","","","","","","","","",0,{"$error":"#N/A"},"","","","","","","",false,""]
[null,"","","","NO","NO","","","","","-","","","","","","","","",0,{"$error":"#N/A"},"","","","","","","",false,""]
[null,"","","","NO","NO","","","","","-","","","","",{"$f":"IF(F94=\"NO\",\"\",IF(L93>0,INDEX($M$452:$CO$452,MATCH(O94,$M$453:$CO$453,0))))","v":""},"","","",0,{"$error":"#N/A"},"","","","","","","",false,""]
[null,"END LINE","END LINE","END LINE","END LINE","END LINE","END LINE","END LINE","END LINE","END LINE","END LINE","END LINE","END LINE",{"$f":"SUM(N12:N94)","v":825},0,0,0,0,0,14190,"END LINE",{"$f":"OFFSET(V12,MATCH(MAX(V12:V94)+1,V12:V94,1)-1,0)","v":315},"END LINE",{"$error":"#VALUE!"},"END LINE","END LINE","END LINE","END LINE","END LINE","END LINE","END LINE","END LINE","END LINE","END LINE","END LINE","END LINE"]
[]
[null,null,null,null,null,null,null,null,null,null,null,null,null,null,"earmed",{"$f":"N95","v":825},"s. Leave",{"$f":"Q95","v":0}]
[null,null,null,null,null,null,null,null,null,null,null,null,null,null,"joining",{"$f":"R95","v":0},"taken",{"$f":"P95","v":0}]
[null,null,null,null,null,null,null,null,null,null,null,null,null,null,"op balance",0,null,0]
[null,null,null,null,null,null,null,null,null,null,null,null,null,null,"leave adj",{"$f":"S95","v":0}]
[null,null,null,null,null,null,null,null,null,null,null,null,null,null,null,{"$f":"SUM(P97:P100)","v":825},{"$f":"SUM(Q97:Q100)","v":0},{"$f":"SUM(R97:R100)","v":0}]
[null,null,null,null,null,null,null,null,null,null,null,null,null,null,null,null,{"$f":"P101-R101","v":825}]
[]
[]
[]
[]
[]
[]
[]
[]
[]
[]
[]
[]
[]
[]
[]
[]
[]
[]
[]
[]
[]
[]
[]
[]
[]
[]
[]
[]
[]
[]
[]
[]
[]
[]
[]
[]
[]
[]
[]
[]
[]
[]
[]
[]
[]
[]
[]
[]
[]
[]
[]
[]
[]
[]
[]
[]
[]
[]
[]
[]
[]
[]
[]
[]
[]
[]
[]
[]
[]
[]
[]
[]
[]
[]
[]
[]
[]
[]
[]
[]
[]
[]
[]
[]
[]
[]
[]
[]
[]
[]
[]
[]
[]
[]
[]
[]
[]
[]
[]
[]
[]
[]
[]
[]
[]
[]
[]
[]
[]
[]
[]
[]
[]
[]
[]
[]
[]
[]
[]
[]
[]
[]
[]
[]
[]
[]
[]
[]
[]
[]
[]
[]
[]
[]
[]
[]
[]
[]
[]
[]
[]
[null,null,"Base End Period",null,null,null,null,null,null,null,null,{"$f":"E252","v":"1996-02-20"},{"$f":"L245+1","v":"1996-07-01"},"1997-01-01","1997-07-01","1998-01-01","1998-07-01","1999-01-01","1999-07-01","2000-01-01","2000-07-01","2001-01-01","2001-07-01","2002-01-01","2002-07-01","2003-01-01","2003-07-01","2004-01-01","2004-07-01","2005-01-01","2005-07-01","2006-01-01","2006-07-01","2007-01-01","2007-07-01","2008-01-01","2008-07-01","2009-01-01","2009-07-01","2010-01-01","2010-07-01","2011-01-01","2011-07-01","2012-01-01",{"$f":"AR245+1","v":"2012-07-01"},"2013-01-01","2013-07-01","2014-01-01","2014-07-01","2015-01-01","2015-07-01","2016-01-01","2016-07-01","2017-01-01","2017-07-01","2018-01-01","2018-07-01","2019-01-01","2019-07-01","2020-01-01","2020-07-01","2021-01-01","2021-07-01","2022-01-01","2022-07-01","2023-01-01","2023-07-01","2023-09-01","2023-09-01","2023-09-01","2023-09-01","2023-09-01","2023-09-01","2023-09-01","2023-09-01","2023-09-01",{"$f":"BX245+1","v":"2023-09-01"},"2023-09-01","2023-09-01","2023-09-01","2023-09-01","2023-09-01","2023-09-01","2023-09-01","2023-09-01","2023-09-01","2023-09-01","2023-09-01","2023-09-01","2023-09-01","2023-09-01","2023-09-01","2023-09-01","2023-09-01","End Line"]
[null,"Base Start Period",{"$f":"C11","v":"2023-12-31"},{"$f":"D11","v":"1996-02-20"},null,null,null,null,null,null,null,{"$f":"F252","v":"1996-06-30"},{"$f":"IF(EOMONTH(M244,5)>$B$10,$B$10,EOMONTH(M244,5))","v":"1996-12-31"},"1997-06-30","1997-12-31","1998-06-30","1998-12-31","1999-06-30","1999-12-31","2000-06-30","2000-12-31","2001-06-30","2001-12-31","2002-06-30","2002-12-31","2003-06-30","2003-12-31","2004-06-30","2004-12-31","2005-06-30","2005-12-31","2006-06-30","2006-12-31","2007-06-30","2007-12-31","2008-06-30","2008-12-31","2009-06-30","2009-12-31","2010-06-30","2010-12-31","2011-06-30","2011-12-31","2012-06-30","2012-12-31","2013-06-30","2013-12-31","2014-06-30","2014-12-31","2015-06-30","2015-12-31","2016-06-30","2016-12-31","2017-06-30","2017-12-31","2018-06-30","2018-12-31","2019-06-30","2019-12-31","2020-06-30","2020-12-31","2021-06-30","2021-12-31","2022-06-30","2022-12-31","2023-06-30","2023-08-31","2023-08-31","2023-08-31","2023-08-31","2023-08-31","2023-08-31","2023-08-31","2023-08-31","2023-08-31","2023-08-31",{"$f":"IF(EOMONTH(BY244,5)>$B$10,$B$10,EOMONTH(BY244,5))","v":"2023-08-31"},"2023-08-31","2023-08-31","2023-08-31","2023-08-31","2023-08-31","2023-08-31","2023-08-31","2023-08-31","2023-08-31","2023-08-31","2023-08-31","2023-08-31","2023-08-31","2023-08-31",{"$f":"IF(EOMONTH(CN244,5)>$B$10,$B$10,EOMONTH(CN244,5))","v":"2023-08-31"},{"$f":"IF(EOMONTH(CO244,5)>$B$10,$B$10,EOMONTH(CO244,5))","v":"2023-08-31"},{"$f":"IF(EOMONTH(CP244,5)>$B$10,$B$10,EOMONTH(CP244,5))","v":"2023-08-31"},"End Line"]
[null,null,null,null,null,null,null,null,null,null,null,{"$f":"SMALL(IF(($L$245:$CP$245<=$C$11)*($L$245:$CP$245>=$D$11),$L$245:$CP$245,\"A\"),COLUMN(A243))","v":"1996-06-30"},{"$f":"SMALL(IF(($L$245:$CP$245<=$C$11)*($L$245:$CP$245>=$D$11),$L$245:$CP$245,\"A\"),COLUMN(B243))","v":"1996-12-31"},{"$f":"SMALL(IF(($L$245:$CP$245<=$C$11)*($L$245:$CP$245>=$D$11),$L$245:$CP$245,\"A\"),COLUMN(C243))","v":"1997-06-30"},{"$f":"SMALL(IF(($L$245:$CP$245<=$C$11)*($L$245:$CP$245>=$D$11),$L$245:$CP$245,\"A\"),COLUMN(D243))","v":"1997-12-31"},{"$f":"SMALL(IF(($L$245:$CP$245<=$C$11)*($L$245:$CP$245>=$D$11),$L$245:$CP$245,\"A\"),COLUMN(E243))","v":"1998-06-30"},{"$f":"SMALL(IF(($L$245:$CP$245<=$C$11)*($L$245:$CP$245>=$D$11),$L$245:$CP$245,\"A\"),COLUMN(F243))","v":"1998-12-31"},{"$f":"SMALL(IF(($L$245:$CP$245<=$C$11)*($L$245:$CP$245>=$D$11),$L$245:$CP$245,\"A\"),COLUMN(G243))","v":"1999-06-30"},{"$f":"SMALL(IF(($L$245:$CP$245<=$C$11)*($L$245:$CP$245>=$D$11),$L$245:$CP$245,\"A\"),COLUMN(H243))","v":"1999-12-31"},{"$f":"SMALL(IF(($L$245:$CP$245<=$C$11)*($L$245:$CP$245>=$D$11),$L$245:$CP$245,\"A\"),COLUMN(I243))","v":"2000-06-30"},{"$f":"SMALL(IF(($L$245:$CP$245<=$C$11)*($L$245:$CP$245>=$D$11),$L$245:$CP$245,\"A\"),COLUMN(J243))","v":"2000-12-31"},{"$f":"SMALL(IF(($L$245:$CP$245<=$C$11)*($L$245:$CP$245>=$D$11),$L$245:$CP$245,\"A\"),COLUMN(K243))","v":"2001-06-30"},{"$f":"SMALL(IF(($L$245:$CP$245<=$C$11)*($L$245:$CP$245>=$D$11),$L$245:$CP$245,\"A\"),COLUMN(L243))","v":"2001-12-31"},{"$f":"SMALL(IF(($L$245:$CP$245<=$C$11)*($L$245:$CP$245>=$D$11),$L$245:$CP$245,\"A\"),COLUMN(M243))","v":"2002-06-30"},{"$f":"SMALL(IF(($L$245:$CP$245<=$C$11)*($L$245:$CP$245>=$D$11),$L$245:$CP$245,\"A\"),COLUMN(N243))","v":"2002-12-31"},{"$f":"SMALL(IF(($L$245:$CP$245<=$C$11)*($L$245:$CP$245>=$D$11),$L$245:$CP$245,\"A\"),COLUMN(O243))","v":"2003-06-30"},{"$f":"SMALL(IF(($L$245:$CP$245<=$C$11)*($L$245:$CP$245>=$D$11),$L$245:$CP$245,\"A\"),COLUMN(P243))","v":"2003-12-31"},{"$f":"SMALL(IF(($L$245:$CP$245<=$C$11)*($L$245:$CP$245>=$D$11),$L$245:$CP$245,\"A\"),COLUMN(Q243))","v":"2004-06-30"},{"$f":"SMALL(IF(($L$245:$CP$245<=$C$11)*($L$245:$CP$245>=$D$11),$L$245:$CP$245,\"A\"),COLUMN(R243))","v":"2004-12-31"},{"$f":"SMALL(IF(($L$245:$CP$245<=$C$11)*($L$245:$CP$245>=$D$11),$L$245:$CP$245,\"A\"),COLUMN(S243))","v":"2005-06-30"},{"$f":"SMALL(IF(($L$245:$CP$245<=$C$11)*($L$245:$CP$245>=$D$11),$L$245:$CP$245,\"A\"),COLUMN(T243))","v":"2005-12-31"},{"$f":"SMALL(IF(($L$245:$CP$245<=$C$11)*($L$245:$CP$245>=$D$11),$L$245:$CP$245,\"A\"),COLUMN(U243))","v":"2006-06-30"},{"$f":"SMALL(IF(($L$245:$CP$245<=$C$11)*($L$245:$CP$245>=$D$11),$L$245:$CP$245,\"A\"),COLUMN(V243))","v":"2006-12-31"},{"$f":"SMALL(IF(($L$245:$CP$245<=$C$11)*($L$245:$CP$245>=$D$11),$L$245:$CP$245,\"A\"),COLUMN(W243))","v":"2007-06-30"},{"$f":"SMALL(IF(($L$245:$CP$245<=$C$11)*($L$245:$CP$245>=$D$11),$L$245:$CP$245,\"A\"),COLUMN(X243))","v":"2007-12-31"},{"$f":"SMALL(IF(($L$245:$CP$245<=$C$11)*($L$245:$CP$245>=$D$11),$L$245:$CP$245,\"A\"),COLUMN(Y243))","v":"2008-06-30"},{"$f":"SMALL(IF(($L$245:$CP$245<=$C$11)*($L$245:$CP$245>=$D$11),$L$245:$CP$245,\"A\"),COLUMN(Z243))","v":"2008-12-31"},{"$f":"SMALL(IF(($L$245:$CP$245<=$C$11)*($L$245:$CP$245>=$D$11),$L$245:$CP$245,\"A\"),COLUMN(AA243))","v":"2009-06-30"},{"$f":"SMALL(IF(($L$245:$CP$245<=$C$11)*($L$245:$CP$245>=$D$11),$L$245:$CP$245,\"A\"),COLUMN(AB243))","v":"2009-12-31"},{"$f":"SMALL(IF(($L$245:$CP$245<=$C$11)*($L$245:$CP$245>=$D$11),$L$245:$CP$245,\"A\"),COLUMN(AC243))","v":"2010-06-30"},{"$f":"SMALL(IF(($L$245:$CP$245<=$C$11)*($L$245:$CP$245>=$D$11),$L$245:$CP$245,\"A\"),COLUMN(AD243))","v":"2010-12-31"},{"$f":"SMALL(IF(($L$245:$CP$245<=$C$11)*($L$245:$CP$245>=$D$11),$L$245:$CP$245,\"A\"),COLUMN(AE243))","v":"2011-06-30"},{"$f":"SMALL(IF(($L$245:$CP$245<=$C$11)*($L$245:$CP$245>=$D$11),$L$245:$CP$245,\"A\"),COLUMN(AF243))","v":"2011-12-31"},{"$f":"SMALL(IF(($L$245:$CP$245<=$C$11)*($L$245:$CP$245>=$D$11),$L$245:$CP$245,\"A\"),COLUMN(AG243))","v":"2012-06-30"},{"$f":"SMALL(IF(($L$245:$CP$245<=$C$11)*($L$245:$CP$245>=$D$11),$L$245:$CP$245,\"A\"),COLUMN(AH243))","v":"2012-12-31"},{"$f":"SMALL(IF(($L$245:$CP$245<=$C$11)*($L$245:$CP$245>=$D$11),$L$245:$CP$245,\"A\"),COLUMN(AI243))","v":"2013-06-30"},{"$f":"SMALL(IF(($L$245:$CP$245<=$C$11)*($L$245:$CP$245>=$D$11),$L$245:$CP$245,\"A\"),COLUMN(AJ243))","v":"2013-12-31"},{"$f":"SMALL(IF(($L$245:$CP$245<=$C$11)*($L$245:$CP$245>=$D$11),$L$245:$CP$245,\"A\"),COLUMN(AK243))","v":"2014-06-30"},{"$f":"SMALL(IF(($L$245:$CP$245<=$C$11)*($L$245:$CP$245>=$D$11),$L$245:$CP$245,\"A\"),COLUMN(AL243))","v":"2014-12-31"},{"$f":"SMALL(IF(($L$245:$CP$245<=$C$11)*($L$245:$CP$245>=$D$11),$L$245:$CP$245,\"A\"),COLUMN(AM243))","v":"2015-06-30"},{"$f":"SMALL(IF(($L$245:$CP$245<=$C$11)*($L$245:$CP$245>=$D$11),$L$245:$CP$245,\"A\"),COLUMN(AN243))","v":"2015-12-31"},{"$f":"SMALL(IF(($L$245:$CP$245<=$C$11)*($L$245:$CP$245>=$D$11),$L$245:$CP$245,\"A\"),COLUMN(AO243))","v":"2016-06-30"},{"$f":"SMALL(IF(($L$245:$CP$245<=$C$11)*($L$245:$CP$245>=$D$11),$L$245:$CP$245,\"A\"),COLUMN(AP243))","v":"2016-12-31"},{"$f":"SMALL(IF(($L$245:$CP$245<=$C$11)*($L$245:$CP$245>=$D$11),$L$245:$CP$245,\"A\"),COLUMN(AQ243))","v":"2017-06-30"},{"$f":"SMALL(IF(($L$245:$CP$245<=$C$11)*($L$245:$CP$245>=$D$11),$L$245:$CP$245,\"A\"),COLUMN(AR243))","v":"2017-12-31"},{"$f":"SMALL(IF(($L$245:$CP$245<=$C$11)*($L$245:$CP$245>=$D$11),$L$245:$CP$245,\"A\"),COLUMN(AS243))","v":"2018-06-30"},{"$f":"SMALL(IF(($L$245:$CP$245<=$C$11)*($L$245:$CP$245>=$D$11),$L$245:$CP$245,\"A\"),COLUMN(AT243))","v":"2018-12-31"},{"$f":"SMALL(IF(($L$245:$CP$245<=$C$11)*($L$245:$CP$245>=$D$11),$L$245:$CP$245,\"A\"),COLUMN(AU243))","v":"2019-06-30"},{"$f":"SMALL(IF(($L$245:$CP$245<=$C$11)*($L$245:$CP$245>=$D$11),$L$245:$CP$245,\"A\"),COLUMN(AV243))","v":"2019-12-31"},{"$f":"SMALL(IF(($L$245:$CP$245<=$C$11)*($L$245:$CP$245>=$D$11),$L$245:$CP$245,\"A\"),COLUMN(AW243))","v":"2020-06-30"},{"$f":"SMALL(IF(($L$245:$CP$245<=$C$11)*($L$245:$CP$245>=$D$11),$L$245:$CP$245,\"A\"),COLUMN(AX243))","v":"2020-12-31"},{"$f":"SMALL(IF(($L$245:$CP$245<=$C$11)*($L$245:$CP$245>=$D$11),$L$245:$CP$245,\"A\"),COLUMN(AY243))","v":"2021-06-30"},{"$f":"SMALL(IF(($L$245:$CP$245<=$C$11)*($L$245:$CP$245>=$D$11),$L$245:$CP$245,\"A\"),COLUMN(AZ243))","v":"2021-12-31"},{"$f":"SMALL(IF(($L$245:$CP$245<=$C$11)*($L$245:$CP$245>=$D$11),$L$245:$CP$245,\"A\"),COLUMN(BA243))","v":"2022-06-30"},{"$f":"SMALL(IF(($L$245:$CP$245<=$C$11)*($L$245:$CP$245>=$D$11),$L$245:$CP$245,\"A\"),COLUMN(BB243))","v":"2022-12-31"},{"$f":"SMALL(IF(($L$245:$CP$245<=$C$11)*($L$245:$CP$245>=$D$11),$L$245:$CP$245,\"A\"),COLUMN(BC243))","v":"2023-06-30"},{"$f":"SMALL(IF(($L$245:$CP$245<=$C$11)*($L$245:$CP$245>=$D$11),$L$245:$CP$245,\"A\"),COLUMN(BD243))","v":"2023-08-31"},{"$f":"SMALL(IF(($L$245:$CP$245<=$C$11)*($L$245:$CP$245>=$D$11),$L$245:$CP$245,\"A\"),COLUMN(BE243))","v":"2023-08-31"},{"$f":"SMALL(IF(($L$245:$CP$245<=$C$11)*($L$245:$CP$245>=$D$11),$L$245:$CP$245,\"A\"),COLUMN(BF243))","v":"2023-08-31"},{"$f":"SMALL(IF(($L$245:$CP$245<=$C$11)*($L$245:$CP$245>=$D$11),$L$245:$CP$245,\"A\"),COLUMN(BG243))","v":"2023-08-31"},{"$f":"SMALL(IF(($L$245:$CP$245<=$C$11)*($L$245:$CP$245>=$D$11),$L$245:$CP$245,\"A\"),COLUMN(BH243))","v":"2023-08-31"},{"$f":"SMALL(IF(($L$245:$CP$245<=$C$11)*($L$245:$CP$245>=$D$11),$L$245:$CP$245,\"A\"),COLUMN(BI243))","v":"2023-08-31"},{"$f":"SMALL(IF(($L$245:$CP$245<=$C$11)*($L$245:$CP$245>=$D$11),$L$245:$CP$245,\"A\"),COLUMN(BJ243))","v":"2023-08-31"},{"$f":"SMALL(IF(($L$245:$CP$245<=$C$11)*($L$245:$CP$245>=$D$11),$L$245:$CP$245,\"A\"),COLUMN(BK243))","v":"2023-08-31"},{"$f":"SMALL(IF(($L$245:$CP$245<=$C$11)*($L$245:$CP$245>=$D$11),$L$245:$CP$245,\"A\"),COLUMN(BL243))","v":"2023-08-31"},{"$f":"SMALL(IF(($L$245:$CP$245<=$C$11)*($L$245:$CP$245>=$D$11),$L$245:$CP$245,\"A\"),COLUMN(BM243))","v":"2023-08-31"},{"$f":"SMALL(IF(($L$245:$CP$245<=$C$11)*($L$245:$CP$245>=$D$11),$L$245:$CP$245,\"A\"),COLUMN(BN243))","v":"2023-08-31"},{"$f":"SMALL(IF(($L$245:$CP$245<=$C$11)*($L$245:$CP$245>=$D$11),$L$245:$CP$245,\"A\"),COLUMN(BO243))","v":"2023-08-31"},{"$f":"SMALL(IF(($L$245:$CP$245<=$C$11)*($L$245:$CP$245>=$D$11),$L$245:$CP$245,\"A\"),COLUMN(BP243))","v":"2023-08-31"},{"$f":"SMALL(IF(($L$245:$CP$245<=$C$11)*($L$245:$CP$245>=$D$11),$L$245:$CP$245,\"A\"),COLUMN(BQ243))","v":"2023-08-31"},{"$f":"SMALL(IF(($L$245:$CP$245<=$C$11)*($L$245:$CP$245>=$D$11),$L$245:$CP$245,\"A\"),COLUMN(BR243))","v":"2023-08-31"},{"$f":"SMALL(IF(($L$245:$CP$245<=$C$11)*($L$245:$CP$245>=$D$11),$L$245:$CP$245,\"A\"),COLUMN(BS243))","v":"2023-08-31"},{"$f":"SMALL(IF(($L$245:$CP$245<=$C$11)*($L$245:$CP$245>=$D$11),$L$245:$CP$245,\"A\"),COLUMN(BT243))","v":"2023-08-31"},{"$f":"SMALL(IF(($L$245:$CP$245<=$C$11)*($L$245:$CP$245>=$D$11),$L$245:$CP$245,\"A\"),COLUMN(BU243))","v":"2023-08-31"},{"$f":"SMALL(IF(($L$245:$CP$245<=$C$11)*($L$245:$CP$245>=$D$11),$L$245:$CP$245,\"A\"),COLUMN(BV243))","v":"2023-08-31"},{"$f":"SMALL(IF(($L$245:$CP$245<=$C$11)*($L$245:$CP$245>=$D$11),$L$245:$CP$245,\"A\"),COLUMN(BW243))","v":"2023-08-31"},{"$f":"SMALL(IF(($L$245:$CP$245<=$C$11)*($L$245:$CP$245>=$D$11),$L$245:$CP$245,\"A\"),COLUMN(BX243))","v":"2023-08-31"},{"$f":"SMALL(IF(($L$245:$CP$245<=$C$11)*($L$245:$CP$245>=$D$11),$L$245:$CP$245,\"A\"),COLUMN(BY243))","v":"2023-08-31"},{"$f":"SMALL(IF(($L$245:$CP$245<=$C$11)*($L$245:$CP$245>=$D$11),$L$245:$CP$245,\"A\"),COLUMN(BZ243))","v":"2023-08-31"},{"$f":"SMALL(IF(($L$245:$CP$245<=$C$11)*($L$245:$CP$245>=$D$11),$L$245:$CP$245,\"A\"),COLUMN(CA243))","v":"2023-08-31"},{"$f":"SMALL(IF(($L$245:$CP$245<=$C$11)*($L$245:$CP$245>=$D$11),$L$245:$CP$245,\"A\"),COLUMN(CB243))","v":"2023-08-31"},{"$f":"SMALL(IF(($L$245:$CP$245<=$C$11)*($L$245:$CP$245>=$D$11),$L$245:$CP$245,\"A\"),COLUMN(CC243))","v":"2023-08-31"},{"$f":"SMALL(IF(($L$245:$CP$245<=$C$11)*($L$245:$CP$245>=$D$11),$L$245:$CP$245,\"A\"),COLUMN(CD243))","v":"2023-08-31"},{"$f":"SMALL(IF(($L$245:$CP$245<=$C$11)*($L$245:$CP$245>=$D$11),$L$245:$CP$245,\"A\"),COLUMN(CE243))","v":"2023-08-31"},"End Line"]
[null,null,null,null,null,null,null,null,null,null,null,null,null,null,null,null,null,null,null,null,null,null,null,null,null,null,null,null,null,null,null,null,null,null,null,null,null,null,null,null,null,null,null,null,null,null,null,null,null,null,null,null,null,null,null,null,null,null,null,null,null,null,null,null,null,null,null,null,null,null,null,null,null,null,null,null,null,null,null,null,null,null,null,null,null,null,null,null,null,null,null,null,null,null,"End Line"]
[null,null,null,null,null,null,null,null,null,null,null,{"$f":"INDEX($G$252:$G$451,MATCH(L246,$F$252:$F$451,0))","v":"1996-A"},"1996-B","1997-A","1997-B","1998-A","1998-B","1999-A","1999-B","2000-A","2000-B","2001-A","2001-B","2002-A","2002-B","2003-A","2003-B","2004-A","2004-B","2005-A","2005-B","2006-A","2006-B","2007-A","2007-B","2008-A","2008-B","2009-A","2009-B","2010-A","2010-B","2011-A","2011-B",{"$f":"INDEX($G$252:$G$451,MATCH(AR246,$F$252:$F$451,0))","v":"2012-A"},"2012-B","2013-A","2013-B","2014-A","2014-B","2015-A","2015-B","2016-A","2016-B","2017-A","2017-B","2018-A","2018-B","2019-A","2019-B","2020-A","2020-B","2021-A","2021-B","2022-A","2022-B","2023-A","2023-B","2023-B","2023-B","2023-B","2023-B","2023-B","2023-B","2023-B","2023-B",{"$f":"INDEX($G$252:$G$451,MATCH(BX246,$F$252:$F$451,0))","v":"2023-B"},"2023-B","2023-B","2023-B","2023-B","2023-B","2023-B","2023-B","2023-B","2023-B","2023-B","2023-B","2023-B","2023-B","2023-B","2023-B","2023-B","2023-B","2023-B","End Line"]
[null,"S.N.",{"$f":"PL!B21","v":"From"},{"$f":"PL!C21","v":"To"},null,null,null,null,null,{"$f":"PL!D21","v":"No of Days"},null,{"$f":"L248","v":"1996-A"},"1996-B","1997-A","1997-B","1998-A","1998-B","1999-A","1999-B","2000-A","2000-B","2001-A","2001-B","2002-A","2002-B","2003-A","2003-B","2004-A","2004-B","2005-A","2005-B","2006-A","2006-B","2007-A","2007-B","2008-A","2008-B","2009-A","2009-B","2010-A","2010-B","2011-A","2011-B",{"$f":"AR248","v":"2012-A"},"2012-B","2013-A","2013-B","2014-A","2014-B","2015-A","2015-B","2016-A","2016-B","2017-A","2017-B","2018-A","2018-B","2019-A","2019-B","2020-A","2020-B","2021-A","2021-B","2022-A","2022-B","2023-A","2023-B","2023-B","2023-B","2023-B","2023-B","2023-B","2023-B","2023-B","2023-B",{"$f":"BX248","v":"2023-B"},"2023-B","2023-B","2023-B","2023-B","2023-B","2023-B","2023-B","2023-B","2023-B","2023-B","2023-B","2023-B","2023-B","2023-B","2023-B","2023-B","2023-B",null,"End Line"]
[null,null,null,null,null,null,null,null,null,null,null,null,null,null,null,null,null,null,null,null,null,null,null,null,null,null,null,null,null,null,null,null,null,null,null,null,null,null,null,null,null,null,null,null,null,null,null,null,null,null,null,null,null,null,null,null,null,null,null,null,null,null,null,null,null,null,null,null,null,null,null,null,null,null,null,null,null,null,null,null,null,null,null,null,null,null,null,null,null,null,null,null,null,null,"End Line"]
["Condt.",null,null,null,null,null,null,null,null,null,null,null,null,null,null,null,null,null,null,null,null,null,null,null,null,null,null,null,null,null,null,null,null,null,null,null,null,null,null,null,null,null,null,null,null,null,null,null,null,null,null,null,null,null,null,null,null,null,null,null,null,null,null,null,null,null,null,null,null,null,null,null,null,null,null,null,null,null,null,null,null,null,null,null,null,null,null,null,null,null,null,null,null,null,"End Line"]
[{"$f":"IF(AND(D252>=$D$11,D252<=$B$10),\"x\",\"\")","v":""},{"$f":"PL!A22","v":1},{"$f":"IF(PL!B22=\"\",\"\",PL!B22)","v":""},{"$f":"IF(PL!C22=\"\",\"\",PL!C22)","v":""},{"$f":"G12","v":"1996-02-20"},{"$f":"H12","v":"1996-06-30"},{"$f":"K12","v":"1996-A"},{"$f":"VLOOKUP(D252,$E$252:$G$334,3)","v":"-"},null,{"$f":"PL!D22","v":""},{"$f":"IF(C252=\"\",\"\",H252)","v":""},{"$f":"IF(K252=$L$249,J252,0)","v":0},{"$f":"IF(K252=$M$249,J252,0)","v":0},{"$f":"IF(K252=$N$249,J252,0)","v":0},{"$f":"IF(K252=$O$249,J252,0)","v":0},{"$f":"IF(K252=$P$249,J252,0)","v":0},{"$f":"IF(K252=$Q$249,J252,0)","v":0},{"$f":"IF(K252=$R$249,J252,0)","v":0},{"$f":"IF(K252=$S$249,J252,0)","v":0},{"$f":"IF(K252=$T$249,J252,0)","v":0},{"$f":"IF(K252=$U$249,J252,0)","v":0},{"$f":"IF(K252=$V$249,J252,0)","v":0},{"$f":"IF(K252=$W$249,J252,0)","v":0},{"$f":"IF(K252=$X$249,J252,0)","v":0},{"$f":"IF(K252=$Y$249,J252,0)","v":0},{"$f":"IF(K252=$Z$249,J252,0)","v":0},{"$f":"IF(K252=$AA$249,J252,0)","v":0},{"$f":"IF(K252=$AB$249,J252,0)","v":0},{"$f":"IF(K252=$AC$249,J252,0)","v":0},{"$f":"IF(K252=$AD$249,J252,0)","v":0},{"$f":"IF(K252=$AE$249,J252,0)","v":0},{"$f":"IF(K252=$AF$249,J252,0)","v":0},{"$f":"IF(K252=$AG$249,J252,0)","v":0},{"$f":"IF(K252=$AH$249,J252,0)","v":0},{"$f":"IF(K252=$AI$249,J252,0)","v":0},{"$f":"IF(K252=$AJ$249,J252,0)","v":0},{"$f":"IF(K252=$AK$249,J252,0)","v":0},{"$f":"IF(K252=$AL$249,J252,0)","v":0},{"$f":"IF(K252=$AM$249,J252,0)","v":0},{"$f":"IF(K252=$AN$249,J252,0)","v":0},{"$f":"IF(K252=$AO$249,J252,0)","v":0},{"$f":"IF(K252=$AP$249,J252,0)","v":0},{"$f":"IF(K252=$AQ$249,J252,0)","v":0},{"$f":"IF(K252=$AR$249,J252,0)","v":0},{"$f":"IF(K252=$AS$249,J252,0)","v":0},{"$f":"IF(K252=$AT$249,J252,0)","v":0},{"$f":"IF(K252=$AU$249,J252,0)","v":0},{"$f":"IF(K252=$AV$249,J252,0)","v":0},{"$f":"IF(K252=$AW$249,J252,0)","v":0},{"$f":"IF(K252=$AX$249,J252,0)","v":0},{"$f":"IF(K252=$AY$249,J252,0)","v":0},{"$f":"IF(K252=$AZ$249,J252,0)","v":0},{"$f":"IF(K252=$BA$249,J252,0)","v":0},{"$f":"IF(K252=$BB$249,J252,0)","v":0},{"$f":"IF(K252=$BC$249,J252,0)","v":0},{"$f":"IF(K252=$BD$249,J252,0)","v":0},{"$f":"IF(K252=$BE$249,J252,0)","v":0},{"$f":"IF(K252=$BF$249,J252,0)","v":0},{"$f":"IF(K252=$BG$249,J252,0)","v":0},{"$f":"IF(K252=$BH$249,J252,0)","v":0},{"$f":"IF(K252=$BI$249,J252,0)","v":0},{"$f":"IF(K252=$BJ$249,J252,0)","v":0},{"$f":"IF(K252=$BK$249,J252,0)","v":0},{"$f":"IF(K252=$BL$249,J252,0)","v":0},{"$f":"IF(K252=$BM$249,J252,0)","v":0},{"$f":"IF(K252=$BN$249,J252,0)","v":0},{"$f":"IF(K252=$BO$249,J252,0)","v":0},{"$f":"IF(K252=$BP$249,J252,0)","v":0},{"$f":"IF(K252=$BQ$249,J252,0)","v":0},{"$f":"IF(K252=$BR$249,J252,0)","v":0},{"$f":"IF(K252=$BS$249,J252,0)","v":0},{"$f":"IF(K252=$BT$249,J252,0)","v":0},{"$f":"IF(K252=$BU$249,J252,0)","v":0},{"$f":"IF(K252=$BV$249,J252,0)","v":0},{"$f":"IF(K252=$BW$249,J252,0)","v":0},{"$f":"IF(K252=$BX$249,J252,0)","v":0},{"$f":"IF(K252=$BY$249,J252,0)","v":0},{"$f":"IF(K252=$BZ$249,J252,0)","v":0},{"$f":"IF(K252=$CA$249,J252,0)","v":0},{"$f":"IF(K252=$CB$249,J252,0)","v":0},{"$f":"IF(K252=$CC$249,J252,0)","v":0},{"$f":"IF(K252=$CD$249,J252,0)","v":0},{"$f":"IF(K252=$CE$249,J252,0)","v":0},{"$f":"IF(K252=$CF$249,J252,0)","v":0},{"$f":"IF(K252=$CG$249,J252,0)","v":0},{"$f":"IF(K252=$CH$249,J252,0)","v":0},{"$f":"IF(K252=$CI$249,J252,0)","v":0},{"$f":"IF(K252=$CJ$249,J252,0)","v":0},{"$f":"IF(K252=$CK$249,J252,0)","v":0},{"$f":"IF(K252=$CL$249,J252,0)","v":0},{"$f":"IF(K252=$CM$249,J252,0)","v":0},{"$f":"IF(K252=$CN$249,J252,0)","v":0},{"$f":"IF(K252=$CO$249,J252,0)","v":0},null,"End Line"]
["",{"$f":"PL!A23","v":""},{"$f":"IF(PL!B23=\"\",\"\",PL!B23)","v":""},{"$f":"IF(PL!C23=\"\",\"\",PL!C23)","v":""},"1996-07-01","1996-12-31","1996-B","-",null,{"$f":"IF(A253=\"x\",PL!D23,0)","v":0},"",0,0,{"$f":"IF(K253=$N$249,J253,0)","v":0},0,0,0,0,0,0,0,0,0,0,0,0,0,0,0,0,0,0,0,0,0,0,0,0,0,0,0,0,0,0,0,0,0,0,0,0,0,0,0,0,0,0,0,0,0,0,0,0,0,0,0,0,0,0,0,0,0,0,0,0,0,0,0,0,0,0,0,0,0,0,0,0,0,0,0,0,0,0,0,null,"End Line"]
["",{"$f":"PL!A24","v":""},{"$f":"IF(PL!B24=\"\",\"\",PL!B24)","v":""},{"$f":"IF(PL!C24=\"\",\"\",PL!C24)","v":""},"1997-01-01","1997-06-30","1997-A","-",null,{"$f":"IF(A254=\"x\",PL!D24,0)","v":0},"",0,0,0,0,0,0,0,0,0,0,0,0,0,0,0,0,0,0,0,0,0,0,0,0,0,0,0,0,0,0,0,0,0,0,0,0,0,0,0,0,0,0,0,0,0,0,0,0,0,0,0,0,0,0,0,0,0,0,0,0,0,0,0,0,0,0,0,0,0,0,0,0,0,0,0,0,0,0,0,0,0,0,null,"End Line"]
["",{"$f":"PL!A25","v":""},{"$f":"IF(PL!B25=\"\",\"\",PL!B25)","v":""},{"$f":"IF(PL!C25=\"\",\"\",PL!C25)","v":""},"1997-07-01","1997-12-31","1997-B","-",null,{"$f":"IF(A255=\"x\",PL!D25,0)","v":0},"",0,0,0,0,0,0,0,0,0,0,0,0,0,0,0,0,0,0,0,0,0,0,0,0,0,0,0,0,0,0,0,0,0,0,0,0,0,0,0,0,0,0,0,0,0,0,0,0,0,0,0,0,0,0,0,0,0,0,0,0,0,0,0,0,0,0,0,0,0,0,0,0,0,0,0,0,0,0,0,0,0,0,null,"End Line"]
["",{"$f":"PL!A26","v":""},{"$f":"IF(PL!B26=\"\",\"\",PL!B26)","v":""},{"$f":"IF(PL!C26=\"\",\"\",PL!C26)","v":""},"1998-01-01","1998-06-30","1998-A","-",null,{"$f":"IF(A256=\"x\",PL!D26,0)","v":0},"",0,0,0,0,0,0,0,0,0,0,0,0,0,0,0,0,0,0,0,0,0,0,0,0,0,0,0,0,0,0,0,0,0,0,0,0,0,0,0,0,0,0,0,0,0,0,0,0,0,0,0,0,0,0,0,0,0,0,0,0,0,0,0,0,0,0,0,0,0,0,0,0,0,0,0,0,0,0,0,0,0,0,null,"End Line"]
["",{"$f":"PL!A27","v":""},{"$f":"IF(PL!B27=\"\",\"\",PL!B27)","v":""},{"$f":"IF(PL!C27=\"\",\"\",PL!C27)","v":""},"1998-07-01","1998-12-31","1998-B","-",null,{"$f":"IF(A257=\"x\",PL!D27,0)","v":0},"",0,0,0,0,0,0,0,0,0,0,0,0,0,0,0,0,0,0,0,0,0,0,0,0,0,0,0,0,0,0,0,0,0,0,0,0,0,0,0,0,0,0,0,0,0,0,0,0,0,0,0,0,0,0,0,0,0,0,0,0,0,0,0,0,0,0,0,0,0,0,0,0,0,0,0,0,0,0,0,0,0,0,null,"End Line"]
["",{"$f":"PL!A28","v":""},{"$f":"IF(PL!B28=\"\",\"\",PL!B28)","v":""},{"$f":"IF(PL!C28=\"\",\"\",PL!C28)","v":""},"1999-01-01","1999-06-30","1999-A","-",null,{"$f":"IF(A258=\"x\",PL!D28,0)","v":0},"",0,0,0,0,0,0,0,0,0,0,0,0,0,0,0,0,0,0,0,0,0,0,0,0,0,0,0,0,0,0,0,0,0,0,0,0,0,0,0,0,0,0,0,0,0,0,0,0,0,0,0,0,0,0,0,0,0,0,0,0,0,0,0,0,0,0,0,0,0,0,0,0,0,0,0,0,0,0,0,0,0,0,null,"End Line"]
["",{"$f":"PL!A29","v":""},{"$f":"IF(PL!B29=\"\",\"\",PL!B29)","v":""},{"$f":"IF(PL!C29=\"\",\"\",PL!C29)","v":""},"1999-07-01","1999-12-31","1999-B","-",null,{"$f":"IF(A259=\"x\",PL!D29,0)","v":0},"",0,0,0,0,0,0,0,0,0,0,0,0,0,0,0,0,0,0,0,0,0,0,0,0,0,0,0,0,0,0,0,0,0,0,0,0,0,0,0,0,0,0,0,0,0,0,0,0,0,0,0,0,0,0,0,0,0,0,0,0,0,0,0,0,0,0,0,0,0,0,0,0,0,0,0,0,0,0,0,0,0,0,null,"End Line"]
["",{"$f":"PL!A30","v":""},{"$f":"IF(PL!B30=\"\",\"\",PL!B30)","v":""},{"$f":"IF(PL!C30=\"\",\"\",PL!C30)","v":""},"2000-01-01","2000-06-30","2000-A","-",null,{"$f":"IF(A260=\"x\",PL!D30,0)","v":0},"",0,0,0,0,0,0,0,0,0,0,0,0,0,0,0,0,0,0,0,0,0,0,0,0,0,0,0,0,0,0,0,0,0,0,0,0,0,0,0,0,0,0,0,0,0,0,0,0,0,0,0,0,0,0,0,0,0,0,0,0,0,0,0,0,0,0,0,0,0,0,0,0,0,0,0,0,0,0,0,0,0,0,null,"End Line"]
["",{"$f":"PL!A31","v":""},{"$f":"IF(PL!B31=\"\",\"\",PL!B31)","v":""},{"$f":"IF(PL!C31=\"\",\"\",PL!C31)","v":""},"2000-07-01","2000-12-31","2000-B","-",null,{"$f":"IF(A261=\"x\",PL!D31,0)","v":0},"",0,0,0,0,0,0,0,0,0,0,0,0,0,0,0,0,0,0,0,0,0,0,0,0,0,0,0,0,0,0,0,0,0,0,0,0,0,0,0,0,0,0,0,0,0,0,0,0,0,0,0,0,0,0,0,0,0,0,0,0,0,0,0,0,0,0,0,0,0,0,0,0,0,0,0,0,0,0,0,0,0,0,null,"End Line"]
["",{"$f":"PL!A32","v":""},{"$f":"IF(PL!B32=\"\",\"\",PL!B32)","v":""},{"$f":"IF(PL!C32=\"\",\"\",PL!C32)","v":""},"2001-01-01","2001-06-30","2001-A","-",null,{"$f":"IF(A262=\"x\",PL!D32,0)","v":0},"",0,0,0,0,0,0,0,0,0,0,0,0,0,0,0,0,0,0,0,0,0,0,0,0,0,0,0,0,0,0,0,0,0,0,0,0,0,0,0,0,0,0,0,0,0,0,0,0,0,0,0,0,0,0,0,0,0,0,0,0,0,0,0,0,0,0,0,0,0,0,0,0,0,0,0,0,0,0,0,0,0,0,null,"End Line"]
["",{"$f":"PL!A33","v":""},{"$f":"IF(PL!B33=\"\",\"\",PL!B33)","v":""},{"$f":"IF(PL!C33=\"\",\"\",PL!C33)","v":""},"2001-07-01","2001-12-31","2001-B","-",null,{"$f":"IF(A263=\"x\",PL!D33,0)","v":0},"",0,0,0,0,0,0,0,0,0,0,0,0,0,0,0,0,0,0,0,0,0,0,0,0,0,0,0,0,0,0,0,0,0,0,0,0,0,0,0,0,0,0,0,0,0,0,0,0,0,0,0,0,0,0,0,0,0,0,0,0,0,0,0,0,0,0,0,0,0,0,0,0,0,0,0,0,0,0,0,0,0,0,null,"End Line"]
["",{"$f":"PL!A34","v":""},{"$f":"IF(PL!B34=\"\",\"\",PL!B34)","v":""},{"$f":"IF(PL!C34=\"\",\"\",PL!C34)","v":""},"2002-01-01","2002-06-30","2002-A","-",null,{"$f":"IF(A264=\"x\",PL!D34,0)","v":0},"",0,0,0,0,0,0,0,0,0,0,0,0,0,0,0,0,0,0,0,0,0,0,0,0,0,0,0,0,0,0,0,0,0,0,0,0,0,0,0,0,0,0,0,0,0,0,0,0,0,0,0,0,0,0,0,0,0,0,0,0,0,0,0,0,0,0,0,0,0,0,0,0,0,0,0,0,0,0,0,0,0,0,null,"End Line"]
["",{"$f":"PL!A35","v":""},{"$f":"IF(PL!B35=\"\",\"\",PL!B35)","v":""},{"$f":"IF(PL!C35=\"\",\"\",PL!C35)","v":""},"2002-07-01","2002-12-31","2002-B","-",null,{"$f":"IF(A265=\"x\",PL!D35,0)","v":0},"",0,0,0,0,0,0,0,0,0,0,0,0,0,0,0,0,0,0,0,0,0,0,0,0,0,0,0,0,0,0,0,0,0,0,0,0,0,0,0,0,0,0,0,0,0,0,0,0,0,0,0,0,0,0,0,0,0,0,0,0,0,0,0,0,0,0,0,0,0,0,0,0,0,0,0,0,0,0,0,0,0,0,null,"End Line"]
["",{"$f":"PL!A36","v":""},{"$f":"IF(PL!B36=\"\",\"\",PL!B36)","v":""},{"$f":"IF(PL!C36=\"\",\"\",PL!C36)","v":""},"2003-01-01","2003-06-30","2003-A","-",null,{"$f":"IF(A266=\"x\",PL!D36,0)","v":0},"",0,0,0,0,0,0,0,0,0,0,0,0,0,0,0,0,0,0,0,0,0,0,0,0,0,0,0,0,0,0,0,0,0,0,0,0,0,0,0,0,0,0,0,0,0,0,0,0,0,0,0,0,0,0,0,0,0,0,0,0,0,0,0,0,0,0,0,0,0,0,0,0,0,0,0,0,0,0,0,0,0,0,null,"End Line"]
["",{"$f":"PL!A37","v":""},{"$f":"IF(PL!B37=\"\",\"\",PL!B37)","v":""},{"$f":"IF(PL!C37=\"\",\"\",PL!C37)","v":""},"2003-07-01","2003-12-31","2003-B","-",null,{"$f":"IF(A267=\"x\",PL!D37,0)","v":0},"",0,0,0,0,0,0,0,0,0,0,0,0,0,0,0,0,0,0,0,0,0,0,0,0,0,0,0,0,0,0,0,0,0,0,0,0,0,0,0,0,0,0,0,0,0,0,0,0,0,0,0,0,0,0,0,0,0,0,0,0,0,0,0,0,0,0,0,0,0,0,0,0,0,0,0,0,0,0,0,0,0,0,null,"End Line"]
["",{"$f":"PL!A38","v":""},{"$f":"IF(PL!B38=\"\",\"\",PL!B38)","v":""},{"$f":"IF(PL!C38=\"\",\"\",PL!C38)","v":""},"2004-01-01","2004-06-30","2004-A","-",null,{"$f":"IF(A268=\"x\",PL!D38,0)","v":0},"",0,0,0,0,0,0,0,0,0,0,0,0,0,0,0,0,0,0,0,0,0,0,0,0,0,0,0,0,0,0,0,0,0,0,0,0,0,0,0,0,0,0,0,0,0,0,0,0,0,0,0,0,0,0,0,0,0,0,0,0,0,0,0,0,0,0,0,0,0,0,0,0,0,0,0,0,0,0,0,0,0,0,null,"End Line"]
["",{"$f":"PL!A39","v":""},{"$f":"IF(PL!B39=\"\",\"\",PL!B39)","v":""},{"$f":"IF(PL!C39=\"\",\"\",PL!C39)","v":""},"2004-07-01","2004-12-31","2004-B","-",null,{"$f":"IF(A269=\"x\",PL!D39,0)","v":0},"",0,0,0,0,0,0,0,0,0,0,0,0,0,0,0,0,0,0,0,0,0,0,0,0,0,0,0,0,0,0,0,0,0,0,0,0,0,0,0,0,0,0,0,0,0,0,0,0,0,0,0,0,0,0,0,0,0,0,0,0,0,0,0,0,0,0,0,0,0,0,0,0,0,0,0,0,0,0,0,0,0,0,null,"End Line"]
["",{"$f":"PL!A40","v":""},{"$f":"IF(PL!B40=\"\",\"\",PL!B40)","v":""},{"$f":"IF(PL!C40=\"\",\"\",PL!C40)","v":""},"2005-01-01","2005-06-30","2005-A","-",null,{"$f":"IF(A270=\"x\",PL!D40,0)","v":0},"",0,0,0,0,0,0,0,0,0,0,0,0,0,0,0,0,0,0,0,0,0,0,0,0,0,0,0,0,0,0,0,0,0,0,0,0,0,0,0,0,0,0,0,0,0,0,0,0,0,0,0,0,0,0,0,0,0,0,0,0,0,0,0,0,0,0,0,0,0,0,0,0,0,0,0,0,0,0,0,0,0,0,null,"End Line"]
["",{"$f":"PL!A41","v":""},{"$f":"IF(PL!B41=\"\",\"\",PL!B41)","v":""},{"$f":"IF(PL!C41=\"\",\"\",PL!C41)","v":""},"2005-07-01","2005-12-31","2005-B","-",null,{"$f":"IF(A271=\"x\",PL!D41,0)","v":0},"",0,0,0,0,0,0,0,0,0,0,0,0,0,0,0,0,0,0,0,0,0,0,0,0,0,0,0,0,0,0,0,0,0,0,0,0,0,0,0,0,0,0,0,0,0,0,0,0,0,0,0,0,0,0,0,0,0,0,0,0,0,0,0,0,0,0,0,0,0,0,0,0,0,0,0,0,0,0,0,0,0,0,null,"End Line"]
["",{"$f":"PL!A42","v":""},{"$f":"IF(PL!B42=\"\",\"\",PL!B42)","v":""},{"$f":"IF(PL!C42=\"\",\"\",PL!C42)","v":""},"2006-01-01","2006-06-30","2006-A","-",null,{"$f":"IF(A272=\"x\",PL!D42,0)","v":0},"",0,0,0,0,0,0,0,0,0,0,0,0,0,0,0,0,0,0,0,0,0,0,0,0,0,0,0,0,0,0,0,0,0,0,0,0,0,0,0,0,0,0,0,0,0,0,0,0,0,0,0,0,0,0,0,0,0,0,0,0,0,0,0,0,0,0,0,0,0,0,0,0,0,0,0,0,0,0,0,0,0,0,null,"End Line"]
["",{"$f":"PL!A43","v":""},{"$f":"IF(PL!B43=\"\",\"\",PL!B43)","v":""},{"$f":"IF(PL!C43=\"\",\"\",PL!C43)","v":""},"2006-07-01","2006-12-31","2006-B","-",null,{"$f":"IF(A273=\"x\",PL!D43,0)","v":0},"",0,0,0,0,0,0,0,0,0,0,0,0,0,0,0,0,0,0,0,0,0,0,0,0,0,0,0,0,0,0,0,0,0,0,0,0,0,0,0,0,0,0,0,0,0,0,0,0,0,0,0,0,0,0,0,0,0,0,0,0,0,0,0,0,0,0,0,0,0,0,0,0,0,0,0,0,0,0,0,0,0,0,null,"End Line"]
["",{"$f":"PL!A44","v":""},{"$f":"IF(PL!B44=\"\",\"\",PL!B44)","v":""},{"$f":"IF(PL!C44=\"\",\"\",PL!C44)","v":""},"2007-01-01","2007-06-30","2007-A","-",null,{"$f":"IF(A274=\"x\",PL!D44,0)","v":0},"",0,0,0,0,0,0,0,0,0,0,0,0,0,0,0,0,0,0,0,0,0,0,0,0,0,0,0,0,0,0,0,0,0,0,0,0,0,0,0,0,0,0,0,0,0,0,0,0,0,0,0,0,0,0,0,0,0,0,0,0,0,0,0,0,0,0,0,0,0,0,0,0,0,0,0,0,0,0,0,0,0,0,null,"End Line"]
["",{"$f":"PL!A45","v":""},{"$f":"IF(PL!B45=\"\",\"\",PL!B45)","v":""},{"$f":"IF(PL!C45=\"\",\"\",PL!C45)","v":""},"2007-07-01","2007-12-31","2007-B","-",null,{"$f":"IF(A275=\"x\",PL!D45,0)","v":0},"",0,0,0,0,0,0,0,0,0,0,0,0,0,0,0,0,0,0,0,0,0,0,0,0,0,0,0,0,0,0,0,0,0,0,0,0,0,0,0,0,0,0,0,0,0,0,0,0,0,0,0,0,0,0,0,0,0,0,0,0,0,0,0,0,0,0,0,0,0,0,0,0,0,0,0,0,0,0,0,0,0,0,null,"End Line"]
["",{"$f":"PL!A46","v":""},{"$f":"IF(PL!B46=\"\",\"\",PL!B46)","v":""},{"$f":"IF(PL!C46=\"\",\"\",PL!C46)","v":""},"2008-01-01","2008-06-30","2008-A","-",null,{"$f":"IF(A276=\"x\",PL!D46,0)","v":0},"",0,0,0,0,0,0,0,0,0,0,0,0,0,0,0,0,0,0,0,0,0,0,0,0,0,0,0,0,0,0,0,0,0,0,0,0,0,0,0,0,0,0,0,0,0,0,0,0,0,0,0,0,0,0,0,0,0,0,0,0,0,0,0,0,0,0,0,0,0,0,0,0,0,0,0,0,0,0,0,0,0,0,null,"End Line"]
["",{"$f":"PL!A47","v":""},{"$f":"IF(PL!B47=\"\",\"\",PL!B47)","v":""},{"$f":"IF(PL!C47=\"\",\"\",PL!C47)","v":""},"2008-07-01","2008-12-31","2008-B","-",null,{"$f":"IF(A277=\"x\",PL!D47,0)","v":0},"",0,0,0,0,0,0,0,0,0,0,0,0,0,0,0,0,0,0,0,0,0,0,0,0,0,0,0,0,0,0,0,0,0,0,0,0,0,0,0,0,0,0,0,0,0,0,0,0,0,0,0,0,0,0,0,0,0,0,0,0,0,0,0,0,0,0,0,0,0,0,0,0,0,0,0,0,0,0,0,0,0,0,null,"End Line"]
["",{"$f":"PL!A48","v":""},{"$f":"IF(PL!B48=\"\",\"\",PL!B48)","v":""},{"$f":"IF(PL!C48=\"\",\"\",PL!C48)","v":""},"2009-01-01","2009-06-30","2009-A","-",null,{"$f":"IF(A278=\"x\",PL!D48,0)","v":0},"",0,0,0,0,0,0,0,0,0,0,0,0,0,0,0,0,0,0,0,0,0,0,0,0,0,0,0,0,0,0,0,0,0,0,0,0,0,0,0,0,0,0,0,0,0,0,0,0,0,0,0,0,0,0,0,0,0,0,0,0,0,0,0,0,0,0,0,0,0,0,0,0,0,0,0,0,0,0,0,0,0,0,null,"End Line"]
["",{"$f":"PL!A49","v":""},{"$f":"IF(PL!B49=\"\",\"\",PL!B49)","v":""},{"$f":"IF(PL!C49=\"\",\"\",PL!C49)","v":""},"2009-07-01","2009-12-31","2009-B","-",null,{"$f":"IF(A279=\"x\",PL!D49,0)","v":0},"",0,0,0,0,0,0,0,0,0,0,0,0,0,0,0,0,0,0,0,0,0,0,0,0,0,0,0,0,0,0,0,0,0,0,0,0,0,0,0,0,0,0,0,0,0,0,0,0,0,0,0,0,0,0,0,0,0,0,0,0,0,0,0,0,0,0,0,0,0,0,0,0,0,0,0,0,0,0,0,0,0,0,null,"End Line"]
["",{"$f":"PL!A50","v":""},{"$f":"IF(PL!B50=\"\",\"\",PL!B50)","v":""},{"$f":"IF(PL!C50=\"\",\"\",PL!C50)","v":""},"2010-01-01","2010-06-30","2010-A","-",null,{"$f":"IF(A280=\"x\",PL!D50,0)","v":0},"",0,0,0,0,0,0,0,0,0,0,0,0,0,0,0,0,0,0,0,0,0,0,0,0,0,0,0,0,0,0,0,0,0,0,0,0,0,0,0,0,0,0,0,0,0,0,0,0,0,0,0,0,0,0,0,0,0,0,0,0,0,0,0,0,0,0,0,0,0,0,0,0,0,0,0,0,0,0,0,0,0,0,null,"End Line"]
["",{"$f":"PL!A51","v":""},{"$f":"IF(PL!B51=\"\",\"\",PL!B51)","v":""},{"$f":"IF(PL!C51=\"\",\"\",PL!C51)","v":""},"2010-07-01","2010-12-31","2010-B","-",null,{"$f":"IF(A281=\"x\",PL!D51,0)","v":0},"",0,0,0,0,0,0,0,0,0,0,0,0,0,0,0,0,0,0,0,0,0,0,0,0,0,0,0,0,0,0,0,0,0,0,0,0,0,0,0,0,0,0,0,0,0,0,0,0,0,0,0,0,0,0,0,0,0,0,0,0,0,0,0,0,0,0,0,0,0,0,0,0,0,0,0,0,0,0,0,0,0,0,null,"End Line"]
["",{"$f":"PL!A52","v":""},{"$f":"IF(PL!B52=\"\",\"\",PL!B52)","v":""},{"$f":"IF(PL!C52=\"\",\"\",PL!C52)","v":""},"2011-01-01","2011-06-30","2011-A","-",null,{"$f":"IF(A282=\"x\",PL!D52,0)","v":0},"",0,0,0,0,0,0,0,0,0,0,0,0,0,0,0,0,0,0,0,0,0,0,0,0,0,0,0,0,0,0,0,0,0,0,0,0,0,0,0,0,0,0,0,0,0,0,0,0,0,0,0,0,0,0,0,0,0,0,0,0,0,0,0,0,0,0,0,0,0,0,0,0,0,0,0,0,0,0,0,0,0,0,null,"End Line"]
["",{"$f":"PL!A53","v":""},{"$f":"IF(PL!B53=\"\",\"\",PL!B53)","v":""},{"$f":"IF(PL!C53=\"\",\"\",PL!C53)","v":""},"2011-07-01","2011-12-31","2011-B","-",null,{"$f":"IF(A283=\"x\",PL!D53,0)","v":0},"",0,0,0,0,0,0,0,0,0,0,0,0,0,0,0,0,0,0,0,0,0,0,0,0,0,0,0,0,0,0,0,0,0,0,0,0,0,0,0,0,0,0,0,0,0,0,0,0,0,0,0,0,0,0,0,0,0,0,0,0,0,0,0,0,0,0,0,0,0,0,0,0,0,0,0,0,0,0,0,0,0,0,null,"End Line"]
["",{"$f":"PL!A54","v":""},{"$f":"IF(PL!B54=\"\",\"\",PL!B54)","v":""},{"$f":"IF(PL!C54=\"\",\"\",PL!C54)","v":""},{"$f":"G44","v":"2012-01-01"},{"$f":"H44","v":"2012-06-30"},{"$f":"K44","v":"2012-A"},{"$f":"VLOOKUP(D284,$E$252:$G$334,3)","v":"-"},null,{"$f":"IF(A284=\"x\",PL!D54,0)","v":0},{"$f":"IF(C284=\"\",\"\",H284)","v":""},{"$f":"IF(K284=$L$249,J284,0)","v":0},{"$f":"IF(K284=$M$249,J284,0)","v":0},0,{"$f":"IF(K284=$O$249,J284,0)","v":0},{"$f":"IF(K284=$P$249,J284,0)","v":0},{"$f":"IF(K284=$Q$249,J284,0)","v":0},{"$f":"IF(K284=$R$249,J284,0)","v":0},{"$f":"IF(K284=$S$249,J284,0)","v":0},{"$f":"IF(K284=$T$249,J284,0)","v":0},{"$f":"IF(K284=$U$249,J284,0)","v":0},{"$f":"IF(K284=$V$249,J284,0)","v":0},{"$f":"IF(K284=$W$249,J284,0)","v":0},{"$f":"IF(K284=$X$249,J284,0)","v":0},{"$f":"IF(K284=$Y$249,J284,0)","v":0},{"$f":"IF(K284=$Z$249,J284,0)","v":0},{"$f":"IF(K284=$AA$249,J284,0)","v":0},{"$f":"IF(K284=$AB$249,J284,0)","v":0},{"$f":"IF(K284=$AC$249,J284,0)","v":0},{"$f":"IF(K284=$AD$249,J284,0)","v":0},{"$f":"IF(K284=$AE$249,J284,0)","v":0},{"$f":"IF(K284=$AF$249,J284,0)","v":0},{"$f":"IF(K284=$AG$249,J284,0)","v":0},{"$f":"IF(K284=$AH$249,J284,0)","v":0},{"$f":"IF(K284=$AI$249,J284,0)","v":0},{"$f":"IF(K284=$AJ$249,J284,0)","v":0},{"$f":"IF(K284=$AK$249,J284,0)","v":0},{"$f":"IF(K284=$AL$249,J284,0)","v":0},{"$f":"IF(K284=$AM$249,J284,0)","v":0},{"$f":"IF(K284=$AN$249,J284,0)","v":0},{"$f":"IF(K284=$AO$249,J284,0)","v":0},{"$f":"IF(K284=$AP$249,J284,0)","v":0},{"$f":"IF(K284=$AQ$249,J284,0)","v":0},{"$f":"IF(K284=$AR$249,J284,0)","v":0},{"$f":"IF(K284=$AS$249,J284,0)","v":0},{"$f":"IF(K284=$AT$249,J284,0)","v":0},{"$f":"IF(K284=$AU$249,J284,0)","v":0},{"$f":"IF(K284=$AV$249,J284,0)","v":0},{"$f":"IF(K284=$AW$249,J284,0)","v":0},{"$f":"IF(K284=$AX$249,J284,0)","v":0},{"$f":"IF(K284=$AY$249,J284,0)","v":0},{"$f":"IF(K284=$AZ$249,J284,0)","v":0},{"$f":"IF(K284=$BA$249,J284,0)","v":0},{"$f":"IF(K284=$BB$249,J284,0)","v":0},{"$f":"IF(K284=$BC$249,J284,0)","v":0},{"$f":"IF(K284=$BD$249,J284,0)","v":0},{"$f":"IF(K284=$BE$249,J284,0)","v":0},{"$f":"IF(K284=$BF$249,J284,0)","v":0},{"$f":"IF(K284=$BG$249,J284,0)","v":0},{"$f":"IF(K284=$BH$249,J284,0)","v":0},{"$f":"IF(K284=$BI$249,J284,0)","v":0},{"$f":"IF(K284=$BJ$249,J284,0)","v":0},{"$f":"IF(K284=$BK$249,J284,0)","v":0},{"$f":"IF(K284=$BL$249,J284,0)","v":0},{"$f":"IF(K284=$BM$249,J284,0)","v":0},{"$f":"IF(K284=$BN$249,J284,0)","v":0},{"$f":"IF(K284=$BO$249,J284,0)","v":0},{"$f":"IF(K284=$BP$249,J284,0)","v":0},{"$f":"IF(K284=$BQ$249,J284,0)","v":0},{"$f":"IF(K284=$BR$249,J284,0)","v":0},{"$f":"IF(K284=$BS$249,J284,0)","v":0},{"$f":"IF(K284=$BT$249,J284,0)","v":0},{"$f":"IF(K284=$BU$249,J284,0)","v":0},{"$f":"IF(K284=$BV$249,J284,0)","v":0},{"$f":"IF(K284=$BW$249,J284,0)","v":0},{"$f":"IF(K284=$BX$249,J284,0)","v":0},{"$f":"IF(K284=$BY$249,J284,0)","v":0},{"$f":"IF(K284=$BZ$249,J284,0)","v":0},{"$f":"IF(K284=$CA$249,J284,0)","v":0},{"$f":"IF(K284=$CB$249,J284,0)","v":0},{"$f":"IF(K284=$CC$249,J284,0)","v":0},{"$f":"IF(K284=$CD$249,J284,0)","v":0},{"$f":"IF(K284=$CE$249,J284,0)","v":0},{"$f":"IF(K284=$CF$249,J284,0)","v":0},{"$f":"IF(K284=$CG$249,J284,0)","v":0},{"$f":"IF(K284=$CH$249,J284,0)","v":0},{"$f":"IF(K284=$CI$249,J284,0)","v":0},{"$f":"IF(K284=$CJ$249,J284,0)","v":0},{"$f":"IF(K284=$CK$249,J284,0)","v":0},{"$f":"IF(K284=$CL$249,J284,0)","v":0},{"$f":"IF(K284=$CM$249,J284,0)","v":0},{"$f":"IF(K284=$CN$249,J284,0)","v":0},{"$f":"IF(K284=$CO$249,J284,0)","v":0},null,"End Line"]
["",{"$f":"PL!A55","v":""},{"$f":"IF(PL!B55=\"\",\"\",PL!B55)","v":""},{"$f":"IF(PL!C55=\"\",\"\",PL!C55)","v":""},"2012-07-01","2012-12-31","2012-B","-",null,{"$f":"IF(A285=\"x\",PL!D55,0)","v":0},"",0,0,0,0,0,0,0,0,0,0,0,0,0,0,0,0,0,0,0,0,0,0,0,0,0,0,0,0,0,0,0,0,0,0,0,0,0,0,0,0,0,0,0,0,0,0,0,0,0,0,0,0,0,0,0,0,0,0,0,0,0,0,0,0,0,0,0,0,0,0,0,0,0,0,0,0,0,0,0,0,0,0,null,"End Line"]
["",{"$f":"PL!A56","v":""},{"$f":"IF(PL!B56=\"\",\"\",PL!B56)","v":""},{"$f":"IF(PL!C56=\"\",\"\",PL!C56)","v":""},"2013-01-01","2013-06-30","2013-A","-",null,{"$f":"IF(A286=\"x\",PL!D56,0)","v":0},"",0,0,0,0,0,0,0,0,0,0,0,0,0,0,0,0,0,0,0,0,0,0,0,0,0,0,0,0,0,0,0,0,0,0,0,0,0,0,0,0,0,0,0,0,0,0,0,0,0,0,0,0,0,0,0,0,0,0,0,0,0,0,0,0,0,0,0,0,0,0,0,0,0,0,0,0,0,0,0,0,0,0,null,"End Line"]
["",{"$f":"PL!A57","v":""},{"$f":"IF(PL!B57=\"\",\"\",PL!B57)","v":""},{"$f":"IF(PL!C57=\"\",\"\",PL!C57)","v":""},"2013-07-01","2013-12-31","2013-B","-",null,{"$f":"IF(A287=\"x\",PL!D57,0)","v":0},"",0,0,0,0,0,0,0,0,0,0,0,0,0,0,0,0,0,0,0,0,0,0,0,0,0,0,0,0,0,0,0,0,0,0,0,0,0,0,0,0,0,0,0,0,0,0,0,0,0,0,0,0,0,0,0,0,0,0,0,0,0,0,0,0,0,0,0,0,0,0,0,0,0,0,0,0,0,0,0,0,0,0,null,"End Line"]
["",{"$f":"PL!A58","v":""},{"$f":"IF(PL!B58=\"\",\"\",PL!B58)","v":""},{"$f":"IF(PL!C58=\"\",\"\",PL!C58)","v":""},"2014-01-01","2014-06-30","2014-A","-",null,{"$f":"IF(A288=\"x\",PL!D58,0)","v":0},"",0,0,0,0,0,0,0,0,0,0,0,0,0,0,0,0,0,0,0,0,0,0,0,0,0,0,0,0,0,0,0,0,0,0,0,0,0,0,0,0,0,0,0,0,0,0,0,0,0,0,0,0,0,0,0,0,0,0,0,0,0,0,0,0,0,0,0,0,0,0,0,0,0,0,0,0,0,0,0,0,0,0,null,"End Line"]
["",{"$f":"PL!A59","v":""},{"$f":"IF(PL!B59=\"\",\"\",PL!B59)","v":""},{"$f":"IF(PL!C59=\"\",\"\",PL!C59)","v":""},"2014-07-01","2014-12-31","2014-B","-",null,{"$f":"IF(A289=\"x\",PL!D59,0)","v":0},"",0,0,0,0,0,0,0,0,0,0,0,0,0,0,0,0,0,0,0,0,0,0,0,0,0,0,0,0,0,0,0,0,0,0,0,0,0,0,0,0,0,0,0,0,0,0,0,0,0,0,0,0,0,0,0,0,0,0,0,0,0,0,0,0,0,0,0,0,0,0,0,0,0,0,0,0,0,0,0,0,0,0,null,"End Line"]
["",{"$f":"PL!A60","v":""},{"$f":"IF(PL!B60=\"\",\"\",PL!B60)","v":""},{"$f":"IF(PL!C60=\"\",\"\",PL!C60)","v":""},"2015-01-01","2015-06-30","2015-A","-",null,{"$f":"IF(A290=\"x\",PL!D60,0)","v":0},"",0,0,0,0,0,0,0,0,0,0,0,0,0,0,0,0,0,0,0,0,0,0,0,0,0,0,0,0,0,0,0,0,0,0,0,0,0,0,0,0,0,0,0,0,0,0,0,0,0,0,0,0,0,0,0,0,0,0,0,0,0,0,0,0,0,0,0,0,0,0,0,0,0,0,0,0,0,0,0,0,0,0,null,"End Line"]
["",{"$f":"PL!A61","v":""},{"$f":"IF(PL!B61=\"\",\"\",PL!B61)","v":""},{"$f":"IF(PL!C61=\"\",\"\",PL!C61)","v":""},"2015-07-01","2015-12-31","2015-B","-",null,{"$f":"IF(A291=\"x\",PL!D61,0)","v":0},"",0,0,0,0,0,0,0,0,0,0,0,0,0,0,0,0,0,0,0,0,0,0,0,0,0,0,0,0,0,0,0,0,0,0,0,0,0,0,0,0,0,0,0,0,0,0,0,0,0,0,0,0,0,0,0,0,0,0,0,0,0,0,0,0,0,0,0,0,0,0,0,0,0,0,0,0,0,0,0,0,0,0,null,"End Line"]
["",{"$f":"PL!A62","v":""},{"$f":"IF(PL!B62=\"\",\"\",PL!B62)","v":""},{"$f":"IF(PL!C62=\"\",\"\",PL!C62)","v":""},"2016-01-01","2016-06-30","2016-A","-",null,{"$f":"IF(A292=\"x\",PL!D62,0)","v":0},"",0,0,0,0,0,0,0,0,0,0,0,0,0,0,0,0,0,0,0,0,0,0,0,0,0,0,0,0,0,0,0,0,0,0,0,0,0,0,0,0,0,0,0,0,0,0,0,0,0,0,0,0,0,0,0,0,0,0,0,0,0,0,0,0,0,0,0,0,0,0,0,0,0,0,0,0,0,0,0,0,0,0,null,"End Line"]
["",{"$f":"PL!A63","v":""},{"$f":"IF(PL!B63=\"\",\"\",PL!B63)","v":""},{"$f":"IF(PL!C63=\"\",\"\",PL!C63)","v":""},"2016-07-01","2016-12-31","2016-B","-",null,{"$f":"IF(A293=\"x\",PL!D63,0)","v":0},"",0,0,0,0,0,0,0,0,0,0,0,0,0,0,0,0,0,0,0,0,0,0,0,0,0,0,0,0,0,0,0,0,0,0,0,0,0,0,0,0,0,0,0,0,0,0,0,0,0,0,0,0,0,0,0,0,0,0,0,0,0,0,0,0,0,0,0,0,0,0,0,0,0,0,0,0,0,0,0,0,0,0,null,"End Line"]
["",{"$f":"PL!A64","v":""},{"$f":"IF(PL!B64=\"\",\"\",PL!B64)","v":""},{"$f":"IF(PL!C64=\"\",\"\",PL!C64)","v":""},"2017-01-01","2017-06-30","2017-A","-",null,{"$f":"IF(A294=\"x\",PL!D64,0)","v":0},"",0,0,0,0,0,0,0,0,0,0,0,0,0,0,0,0,0,0,0,0,0,0,0,0,0,0,0,0,0,0,0,0,0,0,0,0,0,0,0,0,0,0,0,0,0,0,0,0,0,0,0,0,0,0,0,0,0,0,0,0,0,0,0,0,0,0,0,0,0,0,0,0,0,0,0,0,0,0,0,0,0,0,null,"End Line"]
["",{"$f":"PL!A65","v":""},{"$f":"IF(PL!B65=\"\",\"\",PL!B65)","v":""},{"$f":"IF(PL!C65=\"\",\"\",PL!C65)","v":""},"2017-07-01","2017-12-31","2017-B","-",null,{"$f":"IF(A295=\"x\",PL!D65,0)","v":0},"",0,0,0,0,0,0,0,0,0,0,0,0,0,0,0,0,0,0,0,0,0,0,0,0,0,0,0,0,0,0,0,0,0,0,0,0,0,0,0,0,0,0,0,0,0,0,0,0,0,0,0,0,0,0,0,0,0,0,0,0,0,0,0,0,0,0,0,0,0,0,0,0,0,0,0,0,0,0,0,0,0,0,null,"End Line"]
["",{"$f":"PL!A66","v":""},{"$f":"IF(PL!B66=\"\",\"\",PL!B66)","v":""},{"$f":"IF(PL!C66=\"\",\"\",PL!C66)","v":""},"2018-01-01","2018-06-30","2018-A","-",null,{"$f":"IF(A296=\"x\",PL!D66,0)","v":0},"",0,0,0,0,0,0,0,0,0,0,0,0,0,0,0,0,0,0,0,0,0,0,0,0,0,0,0,0,0,0,0,0,0,0,0,0,0,0,0,0,0,0,0,0,0,0,0,0,0,0,0,0,0,0,0,0,0,0,0,0,0,0,0,0,0,0,0,0,0,0,0,0,0,0,0,0,0,0,0,0,0,0,null,"End Line"]
["",{"$f":"PL!A67","v":""},{"$f":"IF(PL!B67=\"\",\"\",PL!B67)","v":""},{"$f":"IF(PL!C67=\"\",\"\",PL!C67)","v":""},"2018-07-01","2018-12-31","2018-B","-",null,{"$f":"IF(A297=\"x\",PL!D67,0)","v":0},"",0,0,0,0,0,0,0,0,0,0,0,0,0,0,0,0,0,0,0,0,0,0,0,0,0,0,0,0,0,0,0,0,0,0,0,0,0,0,0,0,0,0,0,0,0,0,0,0,0,0,0,0,0,0,0,0,0,0,0,0,0,0,0,0,0,0,0,0,0,0,0,0,0,0,0,0,0,0,0,0,0,0,null,"End Line"]
["",{"$f":"PL!A68","v":""},{"$f":"IF(PL!B68=\"\",\"\",PL!B68)","v":""},{"$f":"IF(PL!C68=\"\",\"\",PL!C68)","v":""},"2019-01-01","2019-06-30","2019-A","-",null,{"$f":"IF(A298=\"x\",PL!D68,0)","v":0},"",0,0,0,0,0,0,0,0,0,0,0,0,0,0,0,0,0,0,0,0,0,0,0,0,0,0,0,0,0,0,0,0,0,0,0,0,0,0,0,0,0,0,0,0,0,0,0,0,0,0,0,0,0,0,0,0,0,0,0,0,0,0,0,0,0,0,0,0,0,0,0,0,0,0,0,0,0,0,0,0,0,0,null,"End Line"]
["",{"$f":"PL!A69","v":""},{"$f":"IF(PL!B69=\"\",\"\",PL!B69)","v":""},{"$f":"IF(PL!C69=\"\",\"\",PL!C69)","v":""},"2019-07-01","2019-12-31","2019-B","-",null,{"$f":"IF(A299=\"x\",PL!D69,0)","v":0},"",0,0,0,0,0,0,0,0,0,0,0,0,0,0,0,0,0,0,0,0,0,0,0,0,0,0,0,0,0,0,0,0,0,0,0,0,0,0,0,0,0,0,0,0,0,0,0,0,0,0,0,0,0,0,0,0,0,0,0,0,0,0,0,0,0,0,0,0,0,0,0,0,0,0,0,0,0,0,0,0,0,0,null,"End Line"]
["",{"$f":"PL!A70","v":""},{"$f":"IF(PL!B70=\"\",\"\",PL!B70)","v":""},{"$f":"IF(PL!C70=\"\",\"\",PL!C70)","v":""},"2020-01-01","2020-06-30","2020-A","-",null,{"$f":"IF(A300=\"x\",PL!D70,0)","v":0},"",0,0,0,0,0,0,0,0,0,0,0,0,0,0,0,0,0,0,0,0,0,0,0,0,0,0,0,0,0,0,0,0,0,0,0,0,0,0,0,0,0,0,0,0,0,0,0,0,0,0,0,0,0,0,0,0,0,0,0,0,0,0,0,0,0,0,0,0,0,0,0,0,0,0,0,0,0,0,0,0,0,0,null,"End Line"]
["",{"$f":"PL!A71","v":""},{"$f":"IF(PL!B71=\"\",\"\",PL!B71)","v":""},{"$f":"IF(PL!C71=\"\",\"\",PL!C71)","v":""},"2020-07-01","2020-12-31","2020-B","-",null,{"$f":"IF(A301=\"x\",PL!D71,0)","v":0},"",0,0,0,0,0,0,0,0,0,0,0,0,0,0,0,0,0,0,0,0,0,0,0,0,0,0,0,0,0,0,0,0,0,0,0,0,0,0,0,0,0,0,0,0,0,0,0,0,0,0,0,0,0,0,0,0,0,0,0,0,0,0,0,0,0,0,0,0,0,0,0,0,0,0,0,0,0,0,0,0,0,0,null,"End Line"]
["",{"$f":"PL!A72","v":""},{"$f":"IF(PL!B72=\"\",\"\",PL!B72)","v":""},{"$f":"IF(PL!C72=\"\",\"\",PL!C72)","v":""},"2021-01-01","2021-06-30","2021-A","-",null,{"$f":"IF(A302=\"x\",PL!D72,0)","v":0},"",0,0,0,0,0,0,0,0,0,0,0,0,0,0,0,0,0,0,0,0,0,0,0,0,0,0,0,0,0,0,0,0,0,0,0,0,0,0,0,0,0,0,0,0,0,0,0,0,0,0,0,0,0,0,0,0,0,0,0,0,0,0,0,0,0,0,0,0,0,0,0,0,0,0,0,0,0,0,0,0,0,0,null,"End Line"]
["",{"$f":"PL!A73","v":""},{"$f":"IF(PL!B73=\"\",\"\",PL!B73)","v":""},{"$f":"IF(PL!C73=\"\",\"\",PL!C73)","v":""},"2021-07-01","2021-12-31","2021-B","-",null,{"$f":"IF(A303=\"x\",PL!D73,0)","v":0},"",0,0,0,0,0,0,0,0,0,0,0,0,0,0,0,0,0,0,0,0,0,0,0,0,0,0,0,0,0,0,0,0,0,0,0,0,0,0,0,0,0,0,0,0,0,0,0,0,0,0,0,0,0,0,0,0,0,0,0,0,0,0,0,0,0,0,0,0,0,0,0,0,0,0,0,0,0,0,0,0,0,0,null,"End Line"]
["",{"$f":"PL!A74","v":""},{"$f":"IF(PL!B74=\"\",\"\",PL!B74)","v":""},{"$f":"IF(PL!C74=\"\",\"\",PL!C74)","v":""},"2022-01-01","2022-06-30","2022-A","-",null,{"$f":"IF(A304=\"x\",PL!D74,0)","v":0},"",0,0,0,0,0,0,0,0,0,0,0,0,0,0,0,0,0,0,0,0,0,0,0,0,0,0,0,0,0,0,0,0,0,0,0,0,0,0,0,0,0,0,0,0,0,0,0,0,0,0,0,0,0,0,0,0,0,0,0,0,0,0,0,0,0,0,0,0,0,0,0,0,0,0,0,0,0,0,0,0,0,0,null,"End Line"]
["",{"$f":"PL!A75","v":""},{"$f":"IF(PL!B75=\"\",\"\",PL!B75)","v":""},{"$f":"IF(PL!C75=\"\",\"\",PL!C75)","v":""},"2022-07-01","2022-12-31","2022-B","-",null,{"$f":"IF(A305=\"x\",PL!D75,0)","v":0},"",0,0,0,0,0,0,0,0,0,0,0,0,0,0,0,0,0,0,0,0,0,0,0,0,0,0,0,0,0,0,0,0,0,0,0,0,0,0,0,0,0,0,0,0,0,0,0,0,0,0,0,0,0,0,0,0,0,0,0,0,0,0,0,0,0,0,0,0,0,0,0,0,0,0,0,0,0,0,0,0,0,0,null,"End Line"]
["",{"$f":"PL!A76","v":""},{"$f":"IF(PL!B76=\"\",\"\",PL!B76)","v":""},{"$f":"IF(PL!C76=\"\",\"\",PL!C76)","v":""},"2023-01-01","2023-06-30","2023-A","-",null,{"$f":"IF(A306=\"x\",PL!D76,0)","v":0},"",0,0,0,0,0,0,0,0,0,0,0,0,0,0,0,0,0,0,0,0,0,0,0,0,0,0,0,0,0,0,0,0,0,0,0,0,0,0,0,0,0,0,0,0,0,0,0,0,0,0,0,0,0,0,0,0,0,0,0,0,0,0,0,0,0,0,0,0,0,0,0,0,0,0,0,0,0,0,0,0,0,0,null,"End Line"]
["",{"$f":"PL!A77","v":""},{"$f":"IF(PL!B77=\"\",\"\",PL!B77)","v":""},{"$f":"IF(PL!C77=\"\",\"\",PL!C77)","v":""},"2023-07-01","2023-08-31","2023-B","-",null,{"$f":"IF(A307=\"x\",PL!D77,0)","v":0},"",0,0,0,0,0,0,0,0,0,0,0,0,0,0,0,0,0,0,0,0,0,0,0,0,0,0,0,0,0,0,0,0,0,0,0,0,0,0,0,0,0,0,0,0,0,0,0,0,0,0,0,0,0,0,0,0,0,0,0,0,0,0,0,0,0,0,0,0,0,0,0,0,0,0,0,0,0,0,0,0,0,0,null,"End Line"]
["",{"$f":"PL!A78","v":""},{"$f":"IF(PL!B78=\"\",\"\",PL!B78)","v":""},{"$f":"IF(PL!C78=\"\",\"\",PL!C78)","v":""},"","","-","-",null,{"$f":"IF(A308=\"x\",PL!D78,0)","v":0},"",0,0,0,0,0,0,0,0,0,0,0,0,0,0,0,0,0,0,0,0,0,0,0,0,0,0,0,0,0,0,0,0,0,0,0,0,0,0,0,0,0,0,0,0,0,0,0,0,0,0,0,0,0,0,0,0,0,0,0,0,0,0,0,0,0,0,0,0,0,0,0,0,0,0,0,0,0,0,0,0,0,0,null,"End Line"]
["",{"$f":"PL!A79","v":""},{"$f":"IF(PL!B79=\"\",\"\",PL!B79)","v":""},{"$f":"IF(PL!C79=\"\",\"\",PL!C79)","v":""},"","","-","-",null,{"$f":"IF(A309=\"x\",PL!D79,0)","v":0},"",0,0,0,0,0,0,0,0,0,0,0,0,0,0,0,0,0,0,0,0,0,0,0,0,0,0,0,0,0,0,0,0,0,0,0,0,0,0,0,0,0,0,0,0,0,0,0,0,0,0,0,0,0,0,0,0,0,0,0,0,0,0,0,0,0,0,0,0,0,0,0,0,0,0,0,0,0,0,0,0,0,0,null,"End Line"]
["",{"$f":"PL!A80","v":""},{"$f":"IF(PL!B80=\"\",\"\",PL!B80)","v":""},{"$f":"IF(PL!C80=\"\",\"\",PL!C80)","v":""},"","","-","-",null,{"$f":"IF(A310=\"x\",PL!D80,0)","v":0},"",0,0,0,0,0,0,0,0,0,0,0,0,0,0,0,0,0,0,0,0,0,0,0,0,0,0,0,0,0,0,0,0,0,0,0,0,0,0,0,0,0,0,0,0,0,0,0,0,0,0,0,0,0,0,0,0,0,0,0,0,0,0,0,0,0,0,0,0,0,0,0,0,0,0,0,0,0,0,0,0,0,0,null,"End Line"]
["",{"$f":"PL!A81","v":""},{"$f":"IF(PL!B81=\"\",\"\",PL!B81)","v":""},{"$f":"IF(PL!C81=\"\",\"\",PL!C81)","v":""},"","","-","-",null,{"$f":"IF(A311=\"x\",PL!D81,0)","v":0},"",0,0,0,0,0,0,0,0,0,0,0,0,0,0,0,0,0,0,0,0,0,0,0,0,0,0,0,0,0,0,0,0,0,0,0,0,0,0,0,0,0,0,0,0,0,0,0,0,0,0,0,0,0,0,0,0,0,0,0,0,0,0,0,0,0,0,0,0,0,0,0,0,0,0,0,0,0,0,0,0,0,0,null,"End Line"]
["",{"$f":"PL!A82","v":""},{"$f":"IF(PL!B82=\"\",\"\",PL!B82)","v":""},{"$f":"IF(PL!C82=\"\",\"\",PL!C82)","v":""},"","","-","-",null,{"$f":"IF(A312=\"x\",PL!D82,0)","v":0},"",0,0,0,0,0,0,0,0,0,0,0,0,0,0,0,0,0,0,0,0,0,0,0,0,0,0,0,0,0,0,0,0,0,0,0,0,0,0,0,0,0,0,0,0,0,0,0,0,0,0,0,0,0,0,0,0,0,0,0,0,0,0,0,0,0,0,0,0,0,0,0,0,0,0,0,0,0,0,0,0,0,0,null,"End Line"]
["",{"$f":"PL!A83","v":""},{"$f":"IF(PL!B83=\"\",\"\",PL!B83)","v":""},{"$f":"IF(PL!C83=\"\",\"\",PL!C83)","v":""},"","","-","-",null,{"$f":"IF(A313=\"x\",PL!D83,0)","v":0},"",0,0,0,0,0,0,0,0,0,0,0,0,0,0,0,0,0,0,0,0,0,0,0,0,0,0,0,0,0,0,0,0,0,0,0,0,0,0,0,0,0,0,0,0,0,0,0,0,0,0,0,0,0,0,0,0,0,0,0,0,0,0,0,0,0,0,0,0,0,0,0,0,0,0,0,0,0,0,0,0,0,0,null,"End Line"]
["",{"$f":"PL!A84","v":""},{"$f":"IF(PL!B84=\"\",\"\",PL!B84)","v":""},{"$f":"IF(PL!C84=\"\",\"\",PL!C84)","v":""},"","","-","-",null,{"$f":"IF(A314=\"x\",PL!D84,0)","v":0},"",0,0,0,0,0,0,0,0,0,0,0,0,0,0,0,0,0,0,0,0,0,0,0,0,0,0,0,0,0,0,0,0,0,0,0,0,0,0,0,0,0,0,0,0,0,0,0,0,0,0,0,0,0,0,0,0,0,0,0,0,0,0,0,0,0,0,0,0,0,0,0,0,0,0,0,0,0,0,0,0,0,0,null,"End Line"]
["",{"$f":"PL!A85","v":""},{"$f":"IF(PL!B85=\"\",\"\",PL!B85)","v":""},{"$f":"IF(PL!C85=\"\",\"\",PL!C85)","v":""},"","","-","-",null,{"$f":"IF(A315=\"x\",PL!D85,0)","v":0},"",0,0,0,0,0,0,0,0,0,0,0,0,0,0,0,0,0,0,0,0,0,0,0,0,0,0,0,0,0,0,0,0,0,0,0,0,0,0,0,0,0,0,0,0,0,0,0,0,0,0,0,0,0,0,0,0,0,0,0,0,0,0,0,0,0,0,0,0,0,0,0,0,0,0,0,0,0,0,0,0,0,0,null,"End Line"]
[{"$f":"IF(AND(D316>=$D$11,D316<=$B$10),\"x\",\"\")","v":""},{"$f":"PL!A86","v":""},{"$f":"IF(PL!B86=\"\",\"\",PL!B86)","v":""},{"$f":"IF(PL!C86=\"\",\"\",PL!C86)","v":""},{"$f":"G76","v":""},{"$f":"H76","v":""},{"$f":"K76","v":"-"},{"$f":"VLOOKUP(D316,$E$252:$G$334,3)","v":"-"},null,{"$f":"IF(A316=\"x\",PL!D86,0)","v":0},{"$f":"IF(C316=\"\",\"\",H316)","v":""},{"$f":"IF(K316=$L$249,J316,0)","v":0},{"$f":"IF(K316=$M$249,J316,0)","v":0},0,{"$f":"IF(K316=$O$249,J316,0)","v":0},{"$f":"IF(K316=$P$249,J316,0)","v":0},{"$f":"IF(K316=$Q$249,J316,0)","v":0},{"$f":"IF(K316=$R$249,J316,0)","v":0},{"$f":"IF(K316=$S$249,J316,0)","v":0},{"$f":"IF(K316=$T$249,J316,0)","v":0},{"$f":"IF(K316=$U$249,J316,0)","v":0},{"$f":"IF(K316=$V$249,J316,0)","v":0},{"$f":"IF(K316=$W$249,J316,0)","v":0},{"$f":"IF(K316=$X$249,J316,0)","v":0},{"$f":"IF(K316=$Y$249,J316,0)","v":0},{"$f":"IF(K316=$Z$249,J316,0)","v":0},{"$f":"IF(K316=$AA$249,J316,0)","v":0},{"$f":"IF(K316=$AB$249,J316,0)","v":0},{"$f":"IF(K316=$AC$249,J316,0)","v":0},{"$f":"IF(K316=$AD$249,J316,0)","v":0},{"$f":"IF(K316=$AE$249,J316,0)","v":0},{"$f":"IF(K316=$AF$249,J316,0)","v":0},{"$f":"IF(K316=$AG$249,J316,0)","v":0},{"$f":"IF(K316=$AH$249,J316,0)","v":0},{"$f":"IF(K316=$AI$249,J316,0)","v":0},{"$f":"IF(K316=$AJ$249,J316,0)","v":0},{"$f":"IF(K316=$AK$249,J316,0)","v":0},{"$f":"IF(K316=$AL$249,J316,0)","v":0},{"$f":"IF(K316=$AM$249,J316,0)","v":0},{"$f":"IF(K316=$AN$249,J316,0)","v":0},{"$f":"IF(K316=$AO$249,J316,0)","v":0},{"$f":"IF(K316=$AP$249,J316,0)","v":0},{"$f":"IF(K316=$AQ$249,J316,0)","v":0},{"$f":"IF(K316=$AR$249,J316,0)","v":0},{"$f":"IF(K316=$AS$249,J316,0)","v":0},{"$f":"IF(K316=$AT$249,J316,0)","v":0},{"$f":"IF(K316=$AU$249,J316,0)","v":0},{"$f":"IF(K316=$AV$249,J316,0)","v":0},{"$f":"IF(K316=$AW$249,J316,0)","v":0},{"$f":"IF(K316=$AX$249,J316,0)","v":0},{"$f":"IF(K316=$AY$249,J316,0)","v":0},{"$f":"IF(K316=$AZ$249,J316,0)","v":0},{"$f":"IF(K316=$BA$249,J316,0)","v":0},{"$f":"IF(K316=$BB$249,J316,0)","v":0},{"$f":"IF(K316=$BC$249,J316,0)","v":0},{"$f":"IF(K316=$BD$249,J316,0)","v":0},{"$f":"IF(K316=$BE$249,J316,0)","v":0},{"$f":"IF(K316=$BF$249,J316,0)","v":0},{"$f":"IF(K316=$BG$249,J316,0)","v":0},{"$f":"IF(K316=$BH$249,J316,0)","v":0},{"$f":"IF(K316=$BI$249,J316,0)","v":0},{"$f":"IF(K316=$BJ$249,J316,0)","v":0},{"$f":"IF(K316=$BK$249,J316,0)","v":0},{"$f":"IF(K316=$BL$249,J316,0)","v":0},{"$f":"IF(K316=$BM$249,J316,0)","v":0},{"$f":"IF(K316=$BN$249,J316,0)","v":0},{"$f":"IF(K316=$BO$249,J316,0)","v":0},{"$f":"IF(K316=$BP$249,J316,0)","v":0},{"$f":"IF(K316=$BQ$249,J316,0)","v":0},{"$f":"IF(K316=$BR$249,J316,0)","v":0},{"$f":"IF(K316=$BS$249,J316,0)","v":0},{"$f":"IF(K316=$BT$249,J316,0)","v":0},{"$f":"IF(K316=$BU$249,J316,0)","v":0},{"$f":"IF(K316=$BV$249,J316,0)","v":0},{"$f":"IF(K316=$BW$249,J316,0)","v":0},{"$f":"IF(K316=$BX$249,J316,0)","v":0},{"$f":"IF(K316=$BY$249,J316,0)","v":0},{"$f":"IF(K316=$BZ$249,J316,0)","v":0},{"$f":"IF(K316=$CA$249,J316,0)","v":0},{"$f":"IF(K316=$CB$249,J316,0)","v":0},{"$f":"IF(K316=$CC$249,J316,0)","v":0},{"$f":"IF(K316=$CD$249,J316,0)","v":0},{"$f":"IF(K316=$CE$249,J316,0)","v":0},{"$f":"IF(K316=$CF$249,J316,0)","v":0},{"$f":"IF(K316=$CG$249,J316,0)","v":0},{"$f":"IF(K316=$CH$249,J316,0)","v":0},{"$f":"IF(K316=$CI$249,J316,0)","v":0},{"$f":"IF(K316=$CJ$249,J316,0)","v":0},{"$f":"IF(K316=$CK$249,J316,0)","v":0},{"$f":"IF(K316=$CL$249,J316,0)","v":0},{"$f":"IF(K316=$CM$249,J316,0)","v":0},{"$f":"IF(K316=$CN$249,J316,0)","v":0},{"$f":"IF(K316=$CO$249,J316,0)","v":0},null,"End Line"]
["",{"$f":"PL!A87","v":""},{"$f":"IF(PL!B87=\"\",\"\",PL!B87)","v":""},{"$f":"IF(PL!C87=\"\",\"\",PL!C87)","v":""},"","","-","-",null,{"$f":"IF(A317=\"x\",PL!D87,0)","v":0},"",0,0,{"$f":"IF(K317=$N$249,J317,0)","v":0},0,0,0,0,0,0,0,0,0,0,0,0,0,0,0,0,0,0,0,0,0,0,0,0,0,0,0,0,0,0,0,0,0,0,0,0,0,0,0,0,0,0,0,0,0,0,0,0,0,0,0,0,0,0,0,0,0,0,0,0,0,0,0,0,0,0,0,0,0,0,0,0,0,0,0,0,0,0,0,null,"End Line"]
["",{"$f":"PL!A88","v":""},{"$f":"IF(PL!B88=\"\",\"\",PL!B88)","v":""},{"$f":"IF(PL!C88=\"\",\"\",PL!C88)","v":""},"","","-","-",null,{"$f":"IF(A318=\"x\",PL!D88,0)","v":0},"",0,0,0,0,0,0,0,0,0,0,0,0,0,0,0,0,0,0,0,0,0,0,0,0,0,0,0,0,0,0,0,0,0,0,0,0,0,0,0,0,0,0,0,0,0,0,0,0,0,0,0,0,0,0,0,0,0,0,0,0,0,0,0,0,0,0,0,0,0,0,0,0,0,0,0,0,0,0,0,0,0,0,null,"End Line"]
["",{"$f":"PL!A89","v":""},{"$f":"IF(PL!B89=\"\",\"\",PL!B89)","v":""},{"$f":"IF(PL!C89=\"\",\"\",PL!C89)","v":""},"","","-","-",null,{"$f":"IF(A319=\"x\",PL!D89,0)","v":0},"",0,0,0,0,0,0,0,0,0,0,0,0,0,0,0,0,0,0,0,0,0,0,0,0,0,0,0,0,0,0,0,0,0,0,0,0,0,0,0,0,0,0,0,0,0,0,0,0,0,0,0,0,0,0,0,0,0,0,0,0,0,0,0,0,0,0,0,0,0,0,0,0,0,0,0,0,0,0,0,0,0,0,null,"End Line"]
["",{"$f":"PL!A90","v":""},{"$f":"IF(PL!B90=\"\",\"\",PL!B90)","v":""},{"$f":"IF(PL!C90=\"\",\"\",PL!C90)","v":""},"","","-","-",null,{"$f":"IF(A320=\"x\",PL!D90,0)","v":0},"",0,0,0,0,0,0,0,0,0,0,0,0,0,0,0,0,0,0,0,0,0,0,0,0,0,0,0,0,0,0,0,0,0,0,0,0,0,0,0,0,0,0,0,0,0,0,0,0,0,0,0,0,0,0,0,0,0,0,0,0,0,0,0,0,0,0,0,0,0,0,0,0,0,0,0,0,0,0,0,0,0,0,null,"End Line"]
["",{"$f":"PL!A91","v":""},{"$f":"IF(PL!B91=\"\",\"\",PL!B91)","v":""},{"$f":"IF(PL!C91=\"\",\"\",PL!C91)","v":""},"","","-","-",null,{"$f":"IF(A321=\"x\",PL!D91,0)","v":0},"",0,0,0,0,0,0,0,0,0,0,0,0,0,0,0,0,0,0,0,0,0,0,0,0,0,0,0,0,0,0,0,0,0,0,0,0,0,0,0,0,0,0,0,0,0,0,0,0,0,0,0,0,0,0,0,0,0,0,0,0,0,0,0,0,0,0,0,0,0,0,0,0,0,0,0,0,0,0,0,0,0,0,null,"End Line"]
["",{"$f":"PL!A92","v":""},{"$f":"IF(PL!B92=\"\",\"\",PL!B92)","v":""},{"$f":"IF(PL!C92=\"\",\"\",PL!C92)","v":""},"","","-","-",null,{"$f":"IF(A322=\"x\",PL!D92,0)","v":0},"",0,0,0,0,0,0,0,0,0,0,0,0,0,0,0,0,0,0,0,0,0,0,0,0,0,0,0,0,0,0,0,0,0,0,0,0,0,0,0,0,0,0,0,0,0,0,0,0,0,0,0,0,0,0,0,0,0,0,0,0,0,0,0,0,0,0,0,0,0,0,0,0,0,0,0,0,0,0,0,0,0,0,null,"End Line"]
["",{"$f":"PL!A93","v":""},{"$f":"IF(PL!B93=\"\",\"\",PL!B93)","v":""},{"$f":"IF(PL!C93=\"\",\"\",PL!C93)","v":""},"","","-","-",null,{"$f":"IF(A323=\"x\",PL!D93,0)","v":0},"",0,0,0,0,0,0,0,0,0,0,0,0,0,0,0,0,0,0,0,0,0,0,0,0,0,0,0,0,0,0,0,0,0,0,0,0,0,0,0,0,0,0,0,0,0,0,0,0,0,0,0,0,0,0,0,0,0,0,0,0,0,0,0,0,0,0,0,0,0,0,0,0,0,0,0,0,0,0,0,0,0,0,null,"End Line"]
["",{"$f":"PL!A94","v":""},{"$f":"IF(PL!B94=\"\",\"\",PL!B94)","v":""},{"$f":"IF(PL!C94=\"\",\"\",PL!C94)","v":""},"","","-","-",null,{"$f":"IF(A324=\"x\",PL!D94,0)","v":0},"",0,0,0,0,0,0,0,0,0,0,0,0,0,0,0,0,0,0,0,0,0,0,0,0,0,0,0,0,0,0,0,0,0,0,0,0,0,0,0,0,0,0,0,0,0,0,0,0,0,0,0,0,0,0,0,0,0,0,0,0,0,0,0,0,0,0,0,0,0,0,0,0,0,0,0,0,0,0,0,0,0,0,null,"End Line"]
["",{"$f":"PL!A95","v":""},{"$f":"IF(PL!B95=\"\",\"\",PL!B95)","v":""},{"$f":"IF(PL!C95=\"\",\"\",PL!C95)","v":""},"","","-","-",null,{"$f":"IF(A325=\"x\",PL!D95,0)","v":0},"",0,0,0,0,0,0,0,0,0,0,0,0,0,0,0,0,0,0,0,0,0,0,0,0,0,0,0,0,0,0,0,0,0,0,0,0,0,0,0,0,0,0,0,0,0,0,0,0,0,0,0,0,0,0,0,0,0,0,0,0,0,0,0,0,0,0,0,0,0,0,0,0,0,0,0,0,0,0,0,0,0,0,null,"End Line"]
["",{"$f":"PL!A96","v":""},{"$f":"IF(PL!B96=\"\",\"\",PL!B96)","v":""},{"$f":"IF(PL!C96=\"\",\"\",PL!C96)","v":""},"","","-","-",null,{"$f":"IF(A326=\"x\",PL!D96,0)","v":0},"",0,0,0,0,0,0,0,0,0,0,0,0,0,0,0,0,0,0,0,0,0,0,0,0,0,0,0,0,0,0,0,0,0,0,0,0,0,0,0,0,0,0,0,0,0,0,0,0,0,0,0,0,0,0,0,0,0,0,0,0,0,0,0,0,0,0,0,0,0,0,0,0,0,0,0,0,0,0,0,0,0,0,null,"End Line"]
["",{"$f":"PL!A97","v":""},{"$f":"IF(PL!B97=\"\",\"\",PL!B97)","v":""},{"$f":"IF(PL!C97=\"\",\"\",PL!C97)","v":""},"","","-","-",null,{"$f":"IF(A327=\"x\",PL!D97,0)","v":0},"",0,0,0,0,0,0,0,0,0,0,0,0,0,0,0,0,0,0,0,0,0,0,0,0,0,0,0,0,0,0,0,0,0,0,0,0,0,0,0,0,0,0,0,0,0,0,0,0,0,0,0,0,0,0,0,0,0,0,0,0,0,0,0,0,0,0,0,0,0,0,0,0,0,0,0,0,0,0,0,0,0,0,null,"End Line"]
["",{"$f":"PL!A98","v":""},{"$f":"IF(PL!B98=\"\",\"\",PL!B98)","v":""},{"$f":"IF(PL!C98=\"\",\"\",PL!C98)","v":""},"","","-","-",null,{"$f":"IF(A328=\"x\",PL!D98,0)","v":0},"",0,0,0,0,0,0,0,0,0,0,0,0,0,0,0,0,0,0,0,0,0,0,0,0,0,0,0,0,0,0,0,0,0,0,0,0,0,0,0,0,0,0,0,0,0,0,0,0,0,0,0,0,0,0,0,0,0,0,0,0,0,0,0,0,0,0,0,0,0,0,0,0,0,0,0,0,0,0,0,0,0,0,null,"End Line"]
["",{"$f":"PL!A99","v":""},{"$f":"IF(PL!B99=\"\",\"\",PL!B99)","v":""},{"$f":"IF(PL!C99=\"\",\"\",PL!C99)","v":""},"","","-","-",null,{"$f":"IF(A329=\"x\",PL!D99,0)","v":0},"",0,0,0,0,0,0,0,0,0,0,0,0,0,0,0,0,0,0,0,0,0,0,0,0,0,0,0,0,0,0,0,0,0,0,0,0,0,0,0,0,0,0,0,0,0,0,0,0,0,0,0,0,0,0,0,0,0,0,0,0,0,0,0,0,0,0,0,0,0,0,0,0,0,0,0,0,0,0,0,0,0,0,null,"End Line"]
["",{"$f":"PL!A100","v":""},{"$f":"IF(PL!B100=\"\",\"\",PL!B100)","v":""},{"$f":"IF(PL!C100=\"\",\"\",PL!C100)","v":""},"","","-","-",null,{"$f":"IF(A330=\"x\",PL!D100,0)","v":0},"",0,0,0,0,0,0,0,0,0,0,0,0,0,0,0,0,0,0,0,0,0,0,0,0,0,0,0,0,0,0,0,0,0,0,0,0,0,0,0,0,0,0,0,0,0,0,0,0,0,0,0,0,0,0,0,0,0,0,0,0,0,0,0,0,0,0,0,0,0,0,0,0,0,0,0,0,0,0,0,0,0,0,null,"End Line"]
["",{"$f":"PL!A101","v":""},{"$f":"IF(PL!B101=\"\",\"\",PL!B101)","v":""},{"$f":"IF(PL!C101=\"\",\"\",PL!C101)","v":""},"","","-","-",null,{"$f":"IF(A331=\"x\",PL!D101,0)","v":0},"",0,0,0,0,0,0,0,0,0,0,0,0,0,0,0,0,0,0,0,0,0,0,0,0,0,0,0,0,0,0,0,0,0,0,0,0,0,0,0,0,0,0,0,0,0,0,0,0,0,0,0,0,0,0,0,0,0,0,0,0,0,0,0,0,0,0,0,0,0,0,0,0,0,0,0,0,0,0,0,0,0,0,null,"End Line"]
["",{"$f":"PL!A102","v":""},{"$f":"IF(PL!B102=\"\",\"\",PL!B102)","v":""},{"$f":"IF(PL!C102=\"\",\"\",PL!C102)","v":""},"","","-","-",null,{"$f":"IF(A332=\"x\",PL!D102,0)","v":0},"",0,0,0,0,0,0,0,0,0,0,0,0,0,0,0,0,0,0,0,0,0,0,0,0,0,0,0,0,0,0,0,0,0,0,0,0,0,0,0,0,0,0,0,0,0,0,0,0,0,0,0,0,0,0,0,0,0,0,0,0,0,0,0,0,0,0,0,0,0,0,0,0,0,0,0,0,0,0,0,0,0,0,null,"End Line"]
["",{"$f":"PL!A103","v":""},{"$f":"IF(PL!B103=\"\",\"\",PL!B103)","v":""},{"$f":"IF(PL!C103=\"\",\"\",PL!C103)","v":""},"","","-","-",null,{"$f":"IF(A333=\"x\",PL!D103,0)","v":0},"",0,0,0,0,0,0,0,0,0,0,0,0,0,0,0,0,0,0,0,0,0,0,0,0,0,0,0,0,0,0,0,0,0,0,0,0,0,0,0,0,0,0,0,0,0,0,0,0,0,0,0,0,0,0,0,0,0,0,0,0,0,0,0,0,0,0,0,0,0,0,0,0,0,0,0,0,0,0,0,0,0,0,null,"End Line"]
["",{"$f":"PL!A104","v":""},{"$f":"IF(PL!B104=\"\",\"\",PL!B104)","v":""},{"$f":"IF(PL!C104=\"\",\"\",PL!C104)","v":""},"","","-","-",null,{"$f":"IF(A334=\"x\",PL!D104,0)","v":0},"",0,0,0,0,0,0,0,0,0,0,0,0,0,0,0,0,0,0,0,0,0,0,0,0,0,0,0,0,0,0,0,0,0,0,0,0,0,0,0,0,0,0,0,0,0,0,0,0,0,0,0,0,0,0,0,0,0,0,0,0,0,0,0,0,0,0,0,0,0,0,0,0,0,0,0,0,0,0,0,0,0,0,null,"End Line"]
["",{"$f":"PL!A105","v":""},{"$f":"IF(PL!B105=\"\",\"\",PL!B105)","v":""},{"$f":"IF(PL!C105=\"\",\"\",PL!C105)","v":""},"END LINE","END LINE","END LINE","-",null,{"$f":"IF(A335=\"x\",PL!D105,0)","v":0},"",0,0,0,0,0,0,0,0,0,0,0,0,0,0,0,0,0,0,0,0,0,0,0,0,0,0,0,0,0,0,0,0,0,0,0,0,0,0,0,0,0,0,0,0,0,0,0,0,0,0,0,0,0,0,0,0,0,0,0,0,0,0,0,0,0,0,0,0,0,0,0,0,0,0,0,0,0,0,0,0,0,0,null,"End Line"]
["",{"$f":"PL!A106","v":""},{"$f":"IF(PL!B106=\"\",\"\",PL!B106)","v":""},{"$f":"IF(PL!C106=\"\",\"\",PL!C106)","v":""},"00:00:00","00:00:00",0,{"$f":"VLOOKUP(D336,$E$252:$G$258,3)","v":{"$error":"#N/A"}},null,{"$f":"IF(A336=\"x\",PL!D106,0)","v":0},"",0,0,0,0,0,0,0,0,0,0,0,0,0,0,0,0,0,0,0,0,0,0,0,0,0,0,0,0,0,0,0,0,0,0,0,0,0,0,0,0,0,0,0,0,0,0,0,0,0,0,0,0,0,0,0,0,0,0,0,0,0,0,0,0,0,0,0,0,0,0,0,0,0,0,0,0,0,0,0,0,0,0,null,"End Line"]
["",{"$f":"PL!A107","v":""},{"$f":"IF(PL!B107=\"\",\"\",PL!B107)","v":""},{"$f":"IF(PL!C107=\"\",\"\",PL!C107)","v":""},"00:00:00","00:00:00",0,{"$error":"#N/A"},null,{"$f":"IF(A337=\"x\",PL!D107,0)","v":0},"",0,0,0,0,0,0,0,0,0,0,0,0,0,0,0,0,0,0,0,0,0,0,0,0,0,0,0,0,0,0,0,0,0,0,0,0,0,0,0,0,0,0,0,0,0,0,0,0,0,0,0,0,0,0,0,0,0,0,0,0,0,0,0,0,0,0,0,0,0,0,0,0,0,0,0,0,0,0,0,0,0,0,null,"End Line"]
["",{"$f":"PL!A108","v":""},{"$f":"IF(PL!B108=\"\",\"\",PL!B108)","v":""},{"$f":"IF(PL!C108=\"\",\"\",PL!C108)","v":""},"00:00:00","00:00:00",0,{"$error":"#N/A"},null,{"$f":"IF(A338=\"x\",PL!D108,0)","v":0},"",0,0,0,0,0,0,0,0,0,0,0,0,0,0,0,0,0,0,0,0,0,0,0,0,0,0,0,0,0,0,0,0,0,0,0,0,0,0,0,0,0,0,0,0,0,0,0,0,0,0,0,0,0,0,0,0,0,0,0,0,0,0,0,0,0,0,0,0,0,0,0,0,0,0,0,0,0,0,0,0,0,0,null,"End Line"]
["",{"$f":"PL!A109","v":""},{"$f":"IF(PL!B109=\"\",\"\",PL!B109)","v":""},{"$f":"IF(PL!C109=\"\",\"\",PL!C109)","v":""},"00:00:00","00:00:00",0,{"$error":"#N/A"},null,{"$f":"IF(A339=\"x\",PL!D109,0)","v":0},"",0,0,0,0,0,0,0,0,0,0,0,0,0,0,0,0,0,0,0,0,0,0,0,0,0,0,0,0,0,0,0,0,0,0,0,0,0,0,0,0,0,0,0,0,0,0,0,0,0,0,0,0,0,0,0,0,0,0,0,0,0,0,0,0,0,0,0,0,0,0,0,0,0,0,0,0,0,0,0,0,0,0,null,"End Line"]
["",{"$f":"PL!A110","v":""},{"$f":"IF(PL!B110=\"\",\"\",PL!B110)","v":""},{"$f":"IF(PL!C110=\"\",\"\",PL!C110)","v":""},"00:00:00","00:00:00",0,{"$error":"#N/A"},null,{"$f":"IF(A340=\"x\",PL!D110,0)","v":0},"",0,0,0,0,0,0,0,0,0,0,0,0,0,0,0,0,0,0,0,0,0,0,0,0,0,0,0,0,0,0,0,0,0,0,0,0,0,0,0,0,0,0,0,0,0,0,0,0,0,0,0,0,0,0,0,0,0,0,0,0,0,0,0,0,0,0,0,0,0,0,0,0,0,0,0,0,0,0,0,0,0,0,null,"End Line"]
["",{"$f":"PL!A111","v":""},{"$f":"IF(PL!B111=\"\",\"\",PL!B111)","v":""},{"$f":"IF(PL!C111=\"\",\"\",PL!C111)","v":""},"00:00:00","00:00:00",0,{"$error":"#N/A"},null,{"$f":"IF(A341=\"x\",PL!D111,0)","v":0},"",0,0,0,0,0,0,0,0,0,0,0,0,0,0,0,0,0,0,0,0,0,0,0,0,0,0,0,0,0,0,0,0,0,0,0,0,0,0,0,0,0,0,0,0,0,0,0,0,0,0,0,0,0,0,0,0,0,0,0,0,0,0,0,0,0,0,0,0,0,0,0,0,0,0,0,0,0,0,0,0,0,0,null,"End Line"]
["",{"$f":"PL!A112","v":""},{"$f":"IF(PL!B112=\"\",\"\",PL!B112)","v":""},{"$f":"IF(PL!C112=\"\",\"\",PL!C112)","v":""},"00:00:00","00:00:00",0,{"$error":"#N/A"},null,{"$f":"IF(A342=\"x\",PL!D112,0)","v":0},"",0,0,0,0,0,0,0,0,0,0,0,0,0,0,0,0,0,0,0,0,0,0,0,0,0,0,0,0,0,0,0,0,0,0,0,0,0,0,0,0,0,0,0,0,0,0,0,0,0,0,0,0,0,0,0,0,0,0,0,0,0,0,0,0,0,0,0,0,0,0,0,0,0,0,0,0,0,0,0,0,0,0,null,"End Line"]
["",{"$f":"PL!A113","v":""},{"$f":"IF(PL!B113=\"\",\"\",PL!B113)","v":""},{"$f":"IF(PL!C113=\"\",\"\",PL!C113)","v":""},"00:00:00","00:00:00",0,{"$error":"#N/A"},null,{"$f":"IF(A343=\"x\",PL!D113,0)","v":0},"",0,0,0,0,0,0,0,0,0,0,0,0,0,0,0,0,0,0,0,0,0,0,0,0,0,0,0,0,0,0,0,0,0,0,0,0,0,0,0,0,0,0,0,0,0,0,0,0,0,0,0,0,0,0,0,0,0,0,0,0,0,0,0,0,0,0,0,0,0,0,0,0,0,0,0,0,0,0,0,0,0,0,null,"End Line"]
["",{"$f":"PL!A114","v":""},{"$f":"IF(PL!B114=\"\",\"\",PL!B114)","v":""},{"$f":"IF(PL!C114=\"\",\"\",PL!C114)","v":""},"00:00:00","00:00:00",0,{"$error":"#N/A"},null,{"$f":"IF(A344=\"x\",PL!D114,0)","v":0},"",0,0,0,0,0,0,0,0,0,0,0,0,0,0,0,0,0,0,0,0,0,0,0,0,0,0,0,0,0,0,0,0,0,0,0,0,0,0,0,0,0,0,0,0,0,0,0,0,0,0,0,0,0,0,0,0,0,0,0,0,0,0,0,0,0,0,0,0,0,0,0,0,0,0,0,0,0,0,0,0,0,0,null,"End Line"]
["",{"$f":"PL!A115","v":""},{"$f":"IF(PL!B115=\"\",\"\",PL!B115)","v":""},{"$f":"IF(PL!C115=\"\",\"\",PL!C115)","v":""},"00:00:00","00:00:00",0,{"$error":"#N/A"},null,{"$f":"IF(A345=\"x\",PL!D115,0)","v":0},"",0,0,0,0,0,0,0,0,0,0,0,0,0,0,0,0,0,0,0,0,0,0,0,0,0,0,0,0,0,0,0,0,0,0,0,0,0,0,0,0,0,0,0,0,0,0,0,0,0,0,0,0,0,0,0,0,0,0,0,0,0,0,0,0,0,0,0,0,0,0,0,0,0,0,0,0,0,0,0,0,0,0,null,"End Line"]
["",{"$f":"PL!A116","v":""},{"$f":"IF(PL!B116=\"\",\"\",PL!B116)","v":""},{"$f":"IF(PL!C116=\"\",\"\",PL!C116)","v":""},"00:00:00","00:00:00",0,{"$error":"#N/A"},null,{"$f":"IF(A346=\"x\",PL!D116,0)","v":0},"",0,0,0,0,0,0,0,0,0,0,0,0,0,0,0,0,0,0,0,0,0,0,0,0,0,0,0,0,0,0,0,0,0,0,0,0,0,0,0,0,0,0,0,0,0,0,0,0,0,0,0,0,0,0,0,0,0,0,0,0,0,0,0,0,0,0,0,0,0,0,0,0,0,0,0,0,0,0,0,0,0,0,null,"End Line"]
["",{"$f":"PL!A117","v":""},{"$f":"IF(PL!B117=\"\",\"\",PL!B117)","v":""},{"$f":"IF(PL!C117=\"\",\"\",PL!C117)","v":""},"00:00:00","00:00:00",0,{"$error":"#N/A"},null,{"$f":"IF(A347=\"x\",PL!D117,0)","v":0},"",0,0,0,0,0,0,0,0,0,0,0,0,0,0,0,0,0,0,0,0,0,0,0,0,0,0,0,0,0,0,0,0,0,0,0,0,0,0,0,0,0,0,0,0,0,0,0,0,0,0,0,0,0,0,0,0,0,0,0,0,0,0,0,0,0,0,0,0,0,0,0,0,0,0,0,0,0,0,0,0,0,0,null,"End Line"]
["",{"$f":"PL!A118","v":""},{"$f":"IF(PL!B118=\"\",\"\",PL!B118)","v":""},{"$f":"IF(PL!C118=\"\",\"\",PL!C118)","v":""},{"$f":"G108","v":"00:00:00"},{"$f":"H108","v":"00:00:00"},{"$f":"K108","v":0},{"$error":"#N/A"},null,{"$f":"IF(A348=\"x\",PL!D118,0)","v":0},{"$f":"IF(C348=\"\",\"\",H348)","v":""},{"$f":"IF(K348=$L$249,J348,0)","v":0},{"$f":"IF(K348=$M$249,J348,0)","v":0},0,{"$f":"IF(K348=$O$249,J348,0)","v":0},{"$f":"IF(K348=$P$249,J348,0)","v":0},{"$f":"IF(K348=$Q$249,J348,0)","v":0},{"$f":"IF(K348=$R$249,J348,0)","v":0},{"$f":"IF(K348=$S$249,J348,0)","v":0},{"$f":"IF(K348=$T$249,J348,0)","v":0},{"$f":"IF(K348=$U$249,J348,0)","v":0},{"$f":"IF(K348=$V$249,J348,0)","v":0},{"$f":"IF(K348=$W$249,J348,0)","v":0},{"$f":"IF(K348=$X$249,J348,0)","v":0},{"$f":"IF(K348=$Y$249,J348,0)","v":0},{"$f":"IF(K348=$Z$249,J348,0)","v":0},{"$f":"IF(K348=$AA$249,J348,0)","v":0},{"$f":"IF(K348=$AB$249,J348,0)","v":0},{"$f":"IF(K348=$AC$249,J348,0)","v":0},{"$f":"IF(K348=$AD$249,J348,0)","v":0},{"$f":"IF(K348=$AE$249,J348,0)","v":0},{"$f":"IF(K348=$AF$249,J348,0)","v":0},{"$f":"IF(K348=$AG$249,J348,0)","v":0},{"$f":"IF(K348=$AH$249,J348,0)","v":0},{"$f":"IF(K348=$AI$249,J348,0)","v":0},{"$f":"IF(K348=$AJ$249,J348,0)","v":0},{"$f":"IF(K348=$AK$249,J348,0)","v":0},{"$f":"IF(K348=$AL$249,J348,0)","v":0},{"$f":"IF(K348=$AM$249,J348,0)","v":0},{"$f":"IF(K348=$AN$249,J348,0)","v":0},{"$f":"IF(K348=$AO$249,J348,0)","v":0},{"$f":"IF(K348=$AP$249,J348,0)","v":0},{"$f":"IF(K348=$AQ$249,J348,0)","v":0},{"$f":"IF(K348=$AR$249,J348,0)","v":0},{"$f":"IF(K348=$AS$249,J348,0)","v":0},{"$f":"IF(K348=$AT$249,J348,0)","v":0},{"$f":"IF(K348=$AU$249,J348,0)","v":0},{"$f":"IF(K348=$AV$249,J348,0)","v":0},{"$f":"IF(K348=$AW$249,J348,0)","v":0},{"$f":"IF(K348=$AX$249,J348,0)","v":0},{"$f":"IF(K348=$AY$249,J348,0)","v":0},{"$f":"IF(K348=$AZ$249,J348,0)","v":0},{"$f":"IF(K348=$BA$249,J348,0)","v":0},{"$f":"IF(K348=$BB$249,J348,0)","v":0},{"$f":"IF(K348=$BC$249,J348,0)","v":0},{"$f":"IF(K348=$BD$249,J348,0)","v":0},{"$f":"IF(K348=$BE$249,J348,0)","v":0},{"$f":"IF(K348=$BF$249,J348,0)","v":0},{"$f":"IF(K348=$BG$249,J348,0)","v":0},{"$f":"IF(K348=$BH$249,J348,0)","v":0},{"$f":"IF(K348=$BI$249,J348,0)","v":0},{"$f":"IF(K348=$BJ$249,J348,0)","v":0},{"$f":"IF(K348=$BK$249,J348,0)","v":0},{"$f":"IF(K348=$BL$249,J348,0)","v":0},{"$f":"IF(K348=$BM$249,J348,0)","v":0},{"$f":"IF(K348=$BN$249,J348,0)","v":0},{"$f":"IF(K348=$BO$249,J348,0)","v":0},{"$f":"IF(K348=$BP$249,J348,0)","v":0},{"$f":"IF(K348=$BQ$249,J348,0)","v":0},{"$f":"IF(K348=$BR$249,J348,0)","v":0},{"$f":"IF(K348=$BS$249,J348,0)","v":0},{"$f":"IF(K348=$BT$249,J348,0)","v":0},{"$f":"IF(K348=$BU$249,J348,0)","v":0},{"$f":"IF(K348=$BV$249,J348,0)","v":0},{"$f":"IF(K348=$BW$249,J348,0)","v":0},{"$f":"IF(K348=$BX$249,J348,0)","v":0},{"$f":"IF(K348=$BY$249,J348,0)","v":0},{"$f":"IF(K348=$BZ$249,J348,0)","v":0},{"$f":"IF(K348=$CA$249,J348,0)","v":0},{"$f":"IF(K348=$CB$249,J348,0)","v":0},{"$f":"IF(K348=$CC$249,J348,0)","v":0},{"$f":"IF(K348=$CD$249,J348,0)","v":0},{"$f":"IF(K348=$CE$249,J348,0)","v":0},{"$f":"IF(K348=$CF$249,J348,0)","v":0},{"$f":"IF(K348=$CG$249,J348,0)","v":0},{"$f":"IF(K348=$CH$249,J348,0)","v":0},{"$f":"IF(K348=$CI$249,J348,0)","v":0},{"$f":"IF(K348=$CJ$249,J348,0)","v":0},{"$f":"IF(K348=$CK$249,J348,0)","v":0},{"$f":"IF(K348=$CL$249,J348,0)","v":0},{"$f":"IF(K348=$CM$249,J348,0)","v":0},{"$f":"IF(K348=$CN$249,J348,0)","v":0},{"$f":"IF(K348=$CO$249,J348,0)","v":0},null,"End Line"]
["",{"$f":"PL!A119","v":""},{"$f":"IF(PL!B119=\"\",\"\",PL!B119)","v":""},{"$f":"IF(PL!C119=\"\",\"\",PL!C119)","v":""},"00:00:00","00:00:00",0,{"$error":"#N/A"},null,{"$f":"IF(A349=\"x\",PL!D119,0)","v":0},"",0,0,0,0,0,0,0,0,0,0,0,0,0,0,0,0,0,0,0,0,0,0,0,0,0,0,0,0,0,0,0,0,0,0,0,0,0,0,0,0,0,0,0,0,0,0,0,0,0,0,0,0,0,0,0,0,0,0,0,0,0,0,0,0,0,0,0,0,0,0,0,0,0,0,0,0,0,0,0,0,0,0,null,"End Line"]
["",{"$f":"PL!A120","v":""},{"$f":"IF(PL!B120=\"\",\"\",PL!B120)","v":""},{"$f":"IF(PL!C120=\"\",\"\",PL!C120)","v":""},"00:00:00","00:00:00",0,{"$error":"#N/A"},null,{"$f":"IF(A350=\"x\",PL!D120,0)","v":0},"",0,0,0,0,0,0,0,0,0,0,0,0,0,0,0,0,0,0,0,0,0,0,0,0,0,0,0,0,0,0,0,0,0,0,0,0,0,0,0,0,0,0,0,0,0,0,0,0,0,0,0,0,0,0,0,0,0,0,0,0,0,0,0,0,0,0,0,0,0,0,0,0,0,0,0,0,0,0,0,0,0,0,null,"End Line"]
["",{"$f":"PL!A121","v":""},{"$f":"IF(PL!B121=\"\",\"\",PL!B121)","v":""},{"$f":"IF(PL!C121=\"\",\"\",PL!C121)","v":""},"00:00:00","00:00:00",0,{"$error":"#N/A"},null,{"$f":"IF(A351=\"x\",PL!D121,0)","v":0},"",0,0,0,0,0,0,0,0,0,0,0,0,0,0,0,0,0,0,0,0,0,0,0,0,0,0,0,0,0,0,0,0,0,0,0,0,0,0,0,0,0,0,0,0,0,0,0,0,0,0,0,0,0,0,0,0,0,0,0,0,0,0,0,0,0,0,0,0,0,0,0,0,0,0,0,0,0,0,0,0,0,0,null,"End Line"]
["",{"$f":"PL!A122","v":""},{"$f":"IF(PL!B122=\"\",\"\",PL!B122)","v":""},{"$f":"IF(PL!C122=\"\",\"\",PL!C122)","v":""},"00:00:00","00:00:00",0,{"$error":"#N/A"},null,{"$f":"IF(A352=\"x\",PL!D122,0)","v":0},"",0,0,0,0,0,0,0,0,0,0,0,0,0,0,0,0,0,0,0,0,0,0,0,0,0,0,0,0,0,0,0,0,0,0,0,0,0,0,0,0,0,0,0,0,0,0,0,0,0,0,0,0,0,0,0,0,0,0,0,0,0,0,0,0,0,0,0,0,0,0,0,0,0,0,0,0,0,0,0,0,0,0,null,"End Line"]
["",{"$f":"PL!A123","v":""},{"$f":"IF(PL!B123=\"\",\"\",PL!B123)","v":""},{"$f":"IF(PL!C123=\"\",\"\",PL!C123)","v":""},"00:00:00","00:00:00",0,{"$error":"#N/A"},null,{"$f":"IF(A353=\"x\",PL!D123,0)","v":0},"",0,0,0,0,0,0,0,0,0,0,0,0,0,0,0,0,0,0,0,0,0,0,0,0,0,0,0,0,0,0,0,0,0,0,0,0,0,0,0,0,0,0,0,0,0,0,0,0,0,0,0,0,0,0,0,0,0,0,0,0,0,0,0,0,0,0,0,0,0,0,0,0,0,0,0,0,0,0,0,0,0,0,null,"End Line"]
["",{"$f":"PL!A124","v":""},{"$f":"IF(PL!B124=\"\",\"\",PL!B124)","v":""},{"$f":"IF(PL!C124=\"\",\"\",PL!C124)","v":""},"00:00:00","00:00:00",0,{"$error":"#N/A"},null,{"$f":"IF(A354=\"x\",PL!D124,0)","v":0},"",0,0,0,0,0,0,0,0,0,0,0,0,0,0,0,0,0,0,0,0,0,0,0,0,0,0,0,0,0,0,0,0,0,0,0,0,0,0,0,0,0,0,0,0,0,0,0,0,0,0,0,0,0,0,0,0,0,0,0,0,0,0,0,0,0,0,0,0,0,0,0,0,0,0,0,0,0,0,0,0,0,0,null,"End Line"]
["",{"$f":"PL!A125","v":""},{"$f":"IF(PL!B125=\"\",\"\",PL!B125)","v":""},{"$f":"IF(PL!C125=\"\",\"\",PL!C125)","v":""},"00:00:00","00:00:00",0,{"$error":"#N/A"},null,{"$f":"IF(A355=\"x\",PL!D125,0)","v":0},"",0,0,0,0,0,0,0,0,0,0,0,0,0,0,0,0,0,0,0,0,0,0,0,0,0,0,0,0,0,0,0,0,0,0,0,0,0,0,0,0,0,0,0,0,0,0,0,0,0,0,0,0,0,0,0,0,0,0,0,0,0,0,0,0,0,0,0,0,0,0,0,0,0,0,0,0,0,0,0,0,0,0,null,"End Line"]
["",{"$f":"PL!A126","v":""},{"$f":"IF(PL!B126=\"\",\"\",PL!B126)","v":""},{"$f":"IF(PL!C126=\"\",\"\",PL!C126)","v":""},"00:00:00","00:00:00",0,{"$error":"#N/A"},null,{"$f":"IF(A356=\"x\",PL!D126,0)","v":0},"",0,0,0,0,0,0,0,0,0,0,0,0,0,0,0,0,0,0,0,0,0,0,0,0,0,0,0,0,0,0,0,0,0,0,0,0,0,0,0,0,0,0,0,0,0,0,0,0,0,0,0,0,0,0,0,0,0,0,0,0,0,0,0,0,0,0,0,0,0,0,0,0,0,0,0,0,0,0,0,0,0,0,null,"End Line"]
["",{"$f":"PL!A127","v":""},{"$f":"IF(PL!B127=\"\",\"\",PL!B127)","v":""},{"$f":"IF(PL!C127=\"\",\"\",PL!C127)","v":""},"00:00:00","00:00:00",0,{"$error":"#N/A"},null,{"$f":"IF(A357=\"x\",PL!D127,0)","v":0},"",0,0,0,0,0,0,0,0,0,0,0,0,0,0,0,0,0,0,0,0,0,0,0,0,0,0,0,0,0,0,0,0,0,0,0,0,0,0,0,0,0,0,0,0,0,0,0,0,0,0,0,0,0,0,0,0,0,0,0,0,0,0,0,0,0,0,0,0,0,0,0,0,0,0,0,0,0,0,0,0,0,0,null,"End Line"]
["",{"$f":"PL!A128","v":""},{"$f":"IF(PL!B128=\"\",\"\",PL!B128)","v":""},{"$f":"IF(PL!C128=\"\",\"\",PL!C128)","v":""},"00:00:00","00:00:00",0,{"$error":"#N/A"},null,{"$f":"IF(A358=\"x\",PL!D128,0)","v":0},"",0,0,0,0,0,0,0,0,0,0,0,0,0,0,0,0,0,0,0,0,0,0,0,0,0,0,0,0,0,0,0,0,0,0,0,0,0,0,0,0,0,0,0,0,0,0,0,0,0,0,0,0,0,0,0,0,0,0,0,0,0,0,0,0,0,0,0,0,0,0,0,0,0,0,0,0,0,0,0,0,0,0,null,"End Line"]
["",{"$f":"PL!A129","v":""},{"$f":"IF(PL!B129=\"\",\"\",PL!B129)","v":""},{"$f":"IF(PL!C129=\"\",\"\",PL!C129)","v":""},"00:00:00","00:00:00",0,{"$error":"#N/A"},null,{"$f":"IF(A359=\"x\",PL!D129,0)","v":0},"",0,0,0,0,0,0,0,0,0,0,0,0,0,0,0,0,0,0,0,0,0,0,0,0,0,0,0,0,0,0,0,0,0,0,0,0,0,0,0,0,0,0,0,0,0,0,0,0,0,0,0,0,0,0,0,0,0,0,0,0,0,0,0,0,0,0,0,0,0,0,0,0,0,0,0,0,0,0,0,0,0,0,null,"End Line"]
["",{"$f":"PL!A130","v":""},{"$f":"IF(PL!B130=\"\",\"\",PL!B130)","v":""},{"$f":"IF(PL!C130=\"\",\"\",PL!C130)","v":""},"00:00:00","00:00:00",0,{"$error":"#N/A"},null,{"$f":"IF(A360=\"x\",PL!D130,0)","v":0},"",0,0,0,0,0,0,0,0,0,0,0,0,0,0,0,0,0,0,0,0,0,0,0,0,0,0,0,0,0,0,0,0,0,0,0,0,0,0,0,0,0,0,0,0,0,0,0,0,0,0,0,0,0,0,0,0,0,0,0,0,0,0,0,0,0,0,0,0,0,0,0,0,0,0,0,0,0,0,0,0,0,0,null,"End Line"]
["",{"$f":"PL!A131","v":""},{"$f":"IF(PL!B131=\"\",\"\",PL!B131)","v":""},{"$f":"IF(PL!C131=\"\",\"\",PL!C131)","v":""},"00:00:00","00:00:00",0,{"$error":"#N/A"},null,{"$f":"IF(A361=\"x\",PL!D131,0)","v":0},"",0,0,0,0,0,0,0,0,0,0,0,0,0,0,0,0,0,0,0,0,0,0,0,0,0,0,0,0,0,0,0,0,0,0,0,0,0,0,0,0,0,0,0,0,0,0,0,0,0,0,0,0,0,0,0,0,0,0,0,0,0,0,0,0,0,0,0,0,0,0,0,0,0,0,0,0,0,0,0,0,0,0,null,"End Line"]
["",{"$f":"PL!A132","v":""},{"$f":"IF(PL!B132=\"\",\"\",PL!B132)","v":""},{"$f":"IF(PL!C132=\"\",\"\",PL!C132)","v":""},"00:00:00","00:00:00",0,{"$error":"#N/A"},null,{"$f":"IF(A362=\"x\",PL!D132,0)","v":0},"",0,0,0,0,0,0,0,0,0,0,0,0,0,0,0,0,0,0,0,0,0,0,0,0,0,0,0,0,0,0,0,0,0,0,0,0,0,0,0,0,0,0,0,0,0,0,0,0,0,0,0,0,0,0,0,0,0,0,0,0,0,0,0,0,0,0,0,0,0,0,0,0,0,0,0,0,0,0,0,0,0,0,null,"End Line"]
["",{"$f":"PL!A133","v":""},{"$f":"IF(PL!B133=\"\",\"\",PL!B133)","v":""},{"$f":"IF(PL!C133=\"\",\"\",PL!C133)","v":""},"00:00:00","00:00:00",0,{"$error":"#N/A"},null,{"$f":"IF(A363=\"x\",PL!D133,0)","v":0},"",0,0,0,0,0,0,0,0,0,0,0,0,0,0,0,0,0,0,0,0,0,0,0,0,0,0,0,0,0,0,0,0,0,0,0,0,0,0,0,0,0,0,0,0,0,0,0,0,0,0,0,0,0,0,0,0,0,0,0,0,0,0,0,0,0,0,0,0,0,0,0,0,0,0,0,0,0,0,0,0,0,0,null,"End Line"]
["",{"$f":"PL!A134","v":""},{"$f":"IF(PL!B134=\"\",\"\",PL!B134)","v":""},{"$f":"IF(PL!C134=\"\",\"\",PL!C134)","v":""},"00:00:00","00:00:00",0,{"$error":"#N/A"},null,{"$f":"IF(A364=\"x\",PL!D134,0)","v":0},"",0,0,0,0,0,0,0,0,0,0,0,0,0,0,0,0,0,0,0,0,0,0,0,0,0,0,0,0,0,0,0,0,0,0,0,0,0,0,0,0,0,0,0,0,0,0,0,0,0,0,0,0,0,0,0,0,0,0,0,0,0,0,0,0,0,0,0,0,0,0,0,0,0,0,0,0,0,0,0,0,0,0,null,"End Line"]
["",{"$f":"PL!A135","v":""},{"$f":"IF(PL!B135=\"\",\"\",PL!B135)","v":""},{"$f":"IF(PL!C135=\"\",\"\",PL!C135)","v":""},"00:00:00","00:00:00",0,{"$error":"#N/A"},null,{"$f":"IF(A365=\"x\",PL!D135,0)","v":0},"",0,0,0,0,0,0,0,0,0,0,0,0,0,0,0,0,0,0,0,0,0,0,0,0,0,0,0,0,0,0,0,0,0,0,0,0,0,0,0,0,0,0,0,0,0,0,0,0,0,0,0,0,0,0,0,0,0,0,0,0,0,0,0,0,0,0,0,0,0,0,0,0,0,0,0,0,0,0,0,0,0,0,null,"End Line"]
["",{"$f":"PL!A136","v":""},{"$f":"IF(PL!B136=\"\",\"\",PL!B136)","v":""},{"$f":"IF(PL!C136=\"\",\"\",PL!C136)","v":""},"00:00:00","00:00:00",0,{"$error":"#N/A"},null,{"$f":"IF(A366=\"x\",PL!D136,0)","v":0},"",0,0,0,0,0,0,0,0,0,0,0,0,0,0,0,0,0,0,0,0,0,0,0,0,0,0,0,0,0,0,0,0,0,0,0,0,0,0,0,0,0,0,0,0,0,0,0,0,0,0,0,0,0,0,0,0,0,0,0,0,0,0,0,0,0,0,0,0,0,0,0,0,0,0,0,0,0,0,0,0,0,0,null,"End Line"]
["",{"$f":"PL!A137","v":""},{"$f":"IF(PL!B137=\"\",\"\",PL!B137)","v":""},{"$f":"IF(PL!C137=\"\",\"\",PL!C137)","v":""},"00:00:00","00:00:00",0,{"$error":"#N/A"},null,{"$f":"IF(A367=\"x\",PL!D137,0)","v":0},"",0,0,0,0,0,0,0,0,0,0,0,0,0,0,0,0,0,0,0,0,0,0,0,0,0,0,0,0,0,0,0,0,0,0,0,0,0,0,0,0,0,0,0,0,0,0,0,0,0,0,0,0,0,0,0,0,0,0,0,0,0,0,0,0,0,0,0,0,0,0,0,0,0,0,0,0,0,0,0,0,0,0,null,"End Line"]
["",{"$f":"PL!A138","v":""},{"$f":"IF(PL!B138=\"\",\"\",PL!B138)","v":""},{"$f":"IF(PL!C138=\"\",\"\",PL!C138)","v":""},"00:00:00","00:00:00",0,{"$f":"VLOOKUP(D368,$E$252:$G$258,3)","v":{"$error":"#N/A"}},null,{"$f":"IF(A368=\"x\",PL!D138,0)","v":0},"",0,0,0,0,0,0,0,0,0,0,0,0,0,0,0,0,0,0,0,0,0,0,0,0,0,0,0,0,0,0,0,0,0,0,0,0,0,0,0,0,0,0,0,0,0,0,0,0,0,0,0,0,0,0,0,0,0,0,0,0,0,0,0,0,0,0,0,0,0,0,0,0,0,0,0,0,0,0,0,0,0,0,null,"End Line"]
["",{"$f":"PL!A139","v":""},{"$f":"IF(PL!B139=\"\",\"\",PL!B139)","v":""},{"$f":"IF(PL!C139=\"\",\"\",PL!C139)","v":""},"00:00:00","00:00:00",0,{"$error":"#N/A"},null,{"$f":"IF(A369=\"x\",PL!D139,0)","v":0},"",0,0,0,0,0,0,0,0,0,0,0,0,0,0,0,0,0,0,0,0,0,0,0,0,0,0,0,0,0,0,0,0,0,0,0,0,0,0,0,0,0,0,0,0,0,0,0,0,0,0,0,0,0,0,0,0,0,0,0,0,0,0,0,0,0,0,0,0,0,0,0,0,0,0,0,0,0,0,0,0,0,0,null,"End Line"]
["",{"$f":"PL!A140","v":""},{"$f":"IF(PL!B140=\"\",\"\",PL!B140)","v":""},{"$f":"IF(PL!C140=\"\",\"\",PL!C140)","v":""},"00:00:00","00:00:00",0,{"$error":"#N/A"},null,{"$f":"IF(A370=\"x\",PL!D140,0)","v":0},"",0,0,0,0,0,0,0,0,0,0,0,0,0,0,0,0,0,0,0,0,0,0,0,0,0,0,0,0,0,0,0,0,0,0,0,0,0,0,0,0,0,0,0,0,0,0,0,0,0,0,0,0,0,0,0,0,0,0,0,0,0,0,0,0,0,0,0,0,0,0,0,0,0,0,0,0,0,0,0,0,0,0,null,"End Line"]
["",{"$f":"PL!A141","v":""},{"$f":"IF(PL!B141=\"\",\"\",PL!B141)","v":""},{"$f":"IF(PL!C141=\"\",\"\",PL!C141)","v":""},"00:00:00","00:00:00",0,{"$error":"#N/A"},null,{"$f":"IF(A371=\"x\",PL!D141,0)","v":0},"",0,0,0,0,0,0,0,0,0,0,0,0,0,0,0,0,0,0,0,0,0,0,0,0,0,0,0,0,0,0,0,0,0,0,0,0,0,0,0,0,0,0,0,0,0,0,0,0,0,0,0,0,0,0,0,0,0,0,0,0,0,0,0,0,0,0,0,0,0,0,0,0,0,0,0,0,0,0,0,0,0,0,null,"End Line"]
["",{"$f":"PL!A142","v":""},{"$f":"IF(PL!B142=\"\",\"\",PL!B142)","v":""},{"$f":"IF(PL!C142=\"\",\"\",PL!C142)","v":""},"00:00:00","00:00:00",0,{"$error":"#N/A"},null,{"$f":"IF(A372=\"x\",PL!D142,0)","v":0},"",0,0,0,0,0,0,0,0,0,0,0,0,0,0,0,0,0,0,0,0,0,0,0,0,0,0,0,0,0,0,0,0,0,0,0,0,0,0,0,0,0,0,0,0,0,0,0,0,0,0,0,0,0,0,0,0,0,0,0,0,0,0,0,0,0,0,0,0,0,0,0,0,0,0,0,0,0,0,0,0,0,0,null,"End Line"]
["",{"$f":"PL!A143","v":""},{"$f":"IF(PL!B143=\"\",\"\",PL!B143)","v":""},{"$f":"IF(PL!C143=\"\",\"\",PL!C143)","v":""},"00:00:00","00:00:00",0,{"$error":"#N/A"},null,{"$f":"IF(A373=\"x\",PL!D143,0)","v":0},"",0,0,0,0,0,0,0,0,0,0,0,0,0,0,0,0,0,0,0,0,0,0,0,0,0,0,0,0,0,0,0,0,0,0,0,0,0,0,0,0,0,0,0,0,0,0,0,0,0,0,0,0,0,0,0,0,0,0,0,0,0,0,0,0,0,0,0,0,0,0,0,0,0,0,0,0,0,0,0,0,0,0,null,"End Line"]
["",{"$f":"PL!A144","v":""},{"$f":"IF(PL!B144=\"\",\"\",PL!B144)","v":""},{"$f":"IF(PL!C144=\"\",\"\",PL!C144)","v":""},"00:00:00","00:00:00",0,{"$error":"#N/A"},null,{"$f":"IF(A374=\"x\",PL!D144,0)","v":0},"",0,0,0,0,0,0,0,0,0,0,0,0,0,0,0,0,0,0,0,0,0,0,0,0,0,0,0,0,0,0,0,0,0,0,0,0,0,0,0,0,0,0,0,0,0,0,0,0,0,0,0,0,0,0,0,0,0,0,0,0,0,0,0,0,0,0,0,0,0,0,0,0,0,0,0,0,0,0,0,0,0,0,null,"End Line"]
["",{"$f":"PL!A145","v":""},{"$f":"IF(PL!B145=\"\",\"\",PL!B145)","v":""},{"$f":"IF(PL!C145=\"\",\"\",PL!C145)","v":""},"00:00:00","00:00:00",0,{"$error":"#N/A"},null,{"$f":"IF(A375=\"x\",PL!D145,0)","v":0},"",0,0,0,0,0,0,0,0,0,0,0,0,0,0,0,0,0,0,0,0,0,0,0,0,0,0,0,0,0,0,0,0,0,0,0,0,0,0,0,0,0,0,0,0,0,0,0,0,0,0,0,0,0,0,0,0,0,0,0,0,0,0,0,0,0,0,0,0,0,0,0,0,0,0,0,0,0,0,0,0,0,0,null,"End Line"]
["",{"$f":"PL!A146","v":""},{"$f":"IF(PL!B146=\"\",\"\",PL!B146)","v":""},{"$f":"IF(PL!C146=\"\",\"\",PL!C146)","v":""},"00:00:00","00:00:00",0,{"$error":"#N/A"},null,{"$f":"IF(A376=\"x\",PL!D146,0)","v":0},"",0,0,0,0,0,0,0,0,0,0,0,0,0,0,0,0,0,0,0,0,0,0,0,0,0,0,0,0,0,0,0,0,0,0,0,0,0,0,0,0,0,0,0,0,0,0,0,0,0,0,0,0,0,0,0,0,0,0,0,0,0,0,0,0,0,0,0,0,0,0,0,0,0,0,0,0,0,0,0,0,0,0,null,"End Line"]
["",{"$f":"PL!A147","v":""},{"$f":"IF(PL!B147=\"\",\"\",PL!B147)","v":""},{"$f":"IF(PL!C147=\"\",\"\",PL!C147)","v":""},"00:00:00","00:00:00",0,{"$error":"#N/A"},null,{"$f":"IF(A377=\"x\",PL!D147,0)","v":0},"",0,0,0,0,0,0,0,0,0,0,0,0,0,0,0,0,0,0,0,0,0,0,0,0,0,0,0,0,0,0,0,0,0,0,0,0,0,0,0,0,0,0,0,0,0,0,0,0,0,0,0,0,0,0,0,0,0,0,0,0,0,0,0,0,0,0,0,0,0,0,0,0,0,0,0,0,0,0,0,0,0,0,null,"End Line"]
["",{"$f":"PL!A148","v":""},{"$f":"IF(PL!B148=\"\",\"\",PL!B148)","v":""},{"$f":"IF(PL!C148=\"\",\"\",PL!C148)","v":""},"00:00:00","00:00:00",0,{"$error":"#N/A"},null,{"$f":"IF(A378=\"x\",PL!D148,0)","v":0},"",0,0,0,0,0,0,0,0,0,0,0,0,0,0,0,0,0,0,0,0,0,0,0,0,0,0,0,0,0,0,0,0,0,0,0,0,0,0,0,0,0,0,0,0,0,0,0,0,0,0,0,0,0,0,0,0,0,0,0,0,0,0,0,0,0,0,0,0,0,0,0,0,0,0,0,0,0,0,0,0,0,0,null,"End Line"]
["",{"$f":"PL!A149","v":""},{"$f":"IF(PL!B149=\"\",\"\",PL!B149)","v":""},{"$f":"IF(PL!C149=\"\",\"\",PL!C149)","v":""},"00:00:00","00:00:00",0,{"$error":"#N/A"},null,{"$f":"IF(A379=\"x\",PL!D149,0)","v":0},"",0,0,0,0,0,0,0,0,0,0,0,0,0,0,0,0,0,0,0,0,0,0,0,0,0,0,0,0,0,0,0,0,0,0,0,0,0,0,0,0,0,0,0,0,0,0,0,0,0,0,0,0,0,0,0,0,0,0,0,0,0,0,0,0,0,0,0,0,0,0,0,0,0,0,0,0,0,0,0,0,0,0,null,"End Line"]
[{"$f":"IF(AND(D380>=$D$11,D380<=$B$10),\"x\",\"\")","v":""},{"$f":"PL!A150","v":""},{"$f":"IF(PL!B150=\"\",\"\",PL!B150)","v":""},{"$f":"IF(PL!C150=\"\",\"\",PL!C150)","v":""},{"$f":"G140","v":"00:00:00"},{"$f":"H140","v":"00:00:00"},{"$f":"K140","v":0},{"$error":"#N/A"},null,{"$f":"IF(A380=\"x\",PL!D150,0)","v":0},{"$f":"IF(C380=\"\",\"\",H380)","v":""},{"$f":"IF(K380=$L$249,J380,0)","v":0},{"$f":"IF(K380=$M$249,J380,0)","v":0},0,{"$f":"IF(K380=$O$249,J380,0)","v":0},{"$f":"IF(K380=$P$249,J380,0)","v":0},{"$f":"IF(K380=$Q$249,J380,0)","v":0},{"$f":"IF(K380=$R$249,J380,0)","v":0},{"$f":"IF(K380=$S$249,J380,0)","v":0},{"$f":"IF(K380=$T$249,J380,0)","v":0},{"$f":"IF(K380=$U$249,J380,0)","v":0},{"$f":"IF(K380=$V$249,J380,0)","v":0},{"$f":"IF(K380=$W$249,J380,0)","v":0},{"$f":"IF(K380=$X$249,J380,0)","v":0},{"$f":"IF(K380=$Y$249,J380,0)","v":0},{"$f":"IF(K380=$Z$249,J380,0)","v":0},{"$f":"IF(K380=$AA$249,J380,0)","v":0},{"$f":"IF(K380=$AB$249,J380,0)","v":0},{"$f":"IF(K380=$AC$249,J380,0)","v":0},{"$f":"IF(K380=$AD$249,J380,0)","v":0},{"$f":"IF(K380=$AE$249,J380,0)","v":0},{"$f":"IF(K380=$AF$249,J380,0)","v":0},{"$f":"IF(K380=$AG$249,J380,0)","v":0},{"$f":"IF(K380=$AH$249,J380,0)","v":0},{"$f":"IF(K380=$AI$249,J380,0)","v":0},{"$f":"IF(K380=$AJ$249,J380,0)","v":0},{"$f":"IF(K380=$AK$249,J380,0)","v":0},{"$f":"IF(K380=$AL$249,J380,0)","v":0},{"$f":"IF(K380=$AM$249,J380,0)","v":0},{"$f":"IF(K380=$AN$249,J380,0)","v":0},{"$f":"IF(K380=$AO$249,J380,0)","v":0},{"$f":"IF(K380=$AP$249,J380,0)","v":0},{"$f":"IF(K380=$AQ$249,J380,0)","v":0},{"$f":"IF(K380=$AR$249,J380,0)","v":0},{"$f":"IF(K380=$AS$249,J380,0)","v":0},{"$f":"IF(K380=$AT$249,J380,0)","v":0},{"$f":"IF(K380=$AU$249,J380,0)","v":0},{"$f":"IF(K380=$AV$249,J380,0)","v":0},{"$f":"IF(K380=$AW$249,J380,0)","v":0},{"$f":"IF(K380=$AX$249,J380,0)","v":0},{"$f":"IF(K380=$AY$249,J380,0)","v":0},{"$f":"IF(K380=$AZ$249,J380,0)","v":0},{"$f":"IF(K380=$BA$249,J380,0)","v":0},{"$f":"IF(K380=$BB$249,J380,0)","v":0},{"$f":"IF(K380=$BC$249,J380,0)","v":0},{"$f":"IF(K380=$BD$249,J380,0)","v":0},{"$f":"IF(K380=$BE$249,J380,0)","v":0},{"$f":"IF(K380=$BF$249,J380,0)","v":0},{"$f":"IF(K380=$BG$249,J380,0)","v":0},{"$f":"IF(K380=$BH$249,J380,0)","v":0},{"$f":"IF(K380=$BI$249,J380,0)","v":0},{"$f":"IF(K380=$BJ$249,J380,0)","v":0},{"$f":"IF(K380=$BK$249,J380,0)","v":0},{"$f":"IF(K380=$BL$249,J380,0)","v":0},{"$f":"IF(K380=$BM$249,J380,0)","v":0},{"$f":"IF(K380=$BN$249,J380,0)","v":0},{"$f":"IF(K380=$BO$249,J380,0)","v":0},{"$f":"IF(K380=$BP$249,J380,0)","v":0},{"$f":"IF(K380=$BQ$249,J380,0)","v":0},{"$f":"IF(K380=$BR$249,J380,0)","v":0},{"$f":"IF(K380=$BS$249,J380,0)","v":0},{"$f":"IF(K380=$BT$249,J380,0)","v":0},{"$f":"IF(K380=$BU$249,J380,0)","v":0},{"$f":"IF(K380=$BV$249,J380,0)","v":0},{"$f":"IF(K380=$BW$249,J380,0)","v":0},{"$f":"IF(K380=$BX$249,J380,0)","v":0},{"$f":"IF(K380=$BY$249,J380,0)","v":0},{"$f":"IF(K380=$BZ$249,J380,0)","v":0},{"$f":"IF(K380=$CA$249,J380,0)","v":0},{"$f":"IF(K380=$CB$249,J380,0)","v":0},{"$f":"IF(K380=$CC$249,J380,0)","v":0},{"$f":"IF(K380=$CD$249,J380,0)","v":0},{"$f":"IF(K380=$CE$249,J380,0)","v":0},{"$f":"IF(K380=$CF$249,J380,0)","v":0},{"$f":"IF(K380=$CG$249,J380,0)","v":0},{"$f":"IF(K380=$CH$249,J380,0)","v":0},{"$f":"IF(K380=$CI$249,J380,0)","v":0},{"$f":"IF(K380=$CJ$249,J380,0)","v":0},{"$f":"IF(K380=$CK$249,J380,0)","v":0},{"$f":"IF(K380=$CL$249,J380,0)","v":0},{"$f":"IF(K380=$CM$249,J380,0)","v":0},{"$f":"IF(K380=$CN$249,J380,0)","v":0},{"$f":"IF(K380=$CO$249,J380,0)","v":0},null,"End Line"]
["",{"$f":"PL!A151","v":""},{"$f":"IF(PL!B151=\"\",\"\",PL!B151)","v":""},{"$f":"IF(PL!C151=\"\",\"\",PL!C151)","v":""},"00:00:00","00:00:00",0,{"$error":"#N/A"},null,{"$f":"IF(A381=\"x\",PL!D151,0)","v":0},"",0,0,{"$f":"IF(K381=$N$249,J381,0)","v":0},0,0,0,0,0,0,0,0,0,0,0,0,0,0,0,0,0,0,0,0,0,0,0,0,0,0,0,0,0,0,0,0,0,0,0,0,0,0,0,0,0,0,0,0,0,0,0,0,0,0,0,0,0,0,0,0,0,0,0,0,0,0,0,0,0,0,0,0,0,0,0,0,0,0,0,0,0,0,0,null,"End Line"]
["",{"$f":"PL!A152","v":""},{"$f":"IF(PL!B152=\"\",\"\",PL!B152)","v":""},{"$f":"IF(PL!C152=\"\",\"\",PL!C152)","v":""},"00:00:00","00:00:00",0,{"$error":"#N/A"},null,{"$f":"IF(A382=\"x\",PL!D152,0)","v":0},"",0,0,0,0,0,0,0,0,0,0,0,0,0,0,0,0,0,0,0,0,0,0,0,0,0,0,0,0,0,0,0,0,0,0,0,0,0,0,0,0,0,0,0,0,0,0,0,0,0,0,0,0,0,0,0,0,0,0,0,0,0,0,0,0,0,0,0,0,0,0,0,0,0,0,0,0,0,0,0,0,0,0,null,"End Line"]
["",{"$f":"PL!A153","v":""},{"$f":"IF(PL!B153=\"\",\"\",PL!B153)","v":""},{"$f":"IF(PL!C153=\"\",\"\",PL!C153)","v":""},"00:00:00","00:00:00",0,{"$error":"#N/A"},null,{"$f":"IF(A383=\"x\",PL!D153,0)","v":0},"",0,0,0,0,0,0,0,0,0,0,0,0,0,0,0,0,0,0,0,0,0,0,0,0,0,0,0,0,0,0,0,0,0,0,0,0,0,0,0,0,0,0,0,0,0,0,0,0,0,0,0,0,0,0,0,0,0,0,0,0,0,0,0,0,0,0,0,0,0,0,0,0,0,0,0,0,0,0,0,0,0,0,null,"End Line"]
["",{"$f":"PL!A154","v":""},{"$f":"IF(PL!B154=\"\",\"\",PL!B154)","v":""},{"$f":"IF(PL!C154=\"\",\"\",PL!C154)","v":""},"00:00:00","00:00:00",0,{"$error":"#N/A"},null,{"$f":"IF(A384=\"x\",PL!D154,0)","v":0},"",0,0,0,0,0,0,0,0,0,0,0,0,0,0,0,0,0,0,0,0,0,0,0,0,0,0,0,0,0,0,0,0,0,0,0,0,0,0,0,0,0,0,0,0,0,0,0,0,0,0,0,0,0,0,0,0,0,0,0,0,0,0,0,0,0,0,0,0,0,0,0,0,0,0,0,0,0,0,0,0,0,0,null,"End Line"]
["",{"$f":"PL!A155","v":""},{"$f":"IF(PL!B155=\"\",\"\",PL!B155)","v":""},{"$f":"IF(PL!C155=\"\",\"\",PL!C155)","v":""},"00:00:00","00:00:00",0,{"$error":"#N/A"},null,{"$f":"IF(A385=\"x\",PL!D155,0)","v":0},"",0,0,0,0,0,0,0,0,0,0,0,0,0,0,0,0,0,0,0,0,0,0,0,0,0,0,0,0,0,0,0,0,0,0,0,0,0,0,0,0,0,0,0,0,0,0,0,0,0,0,0,0,0,0,0,0,0,0,0,0,0,0,0,0,0,0,0,0,0,0,0,0,0,0,0,0,0,0,0,0,0,0,null,"End Line"]
["",{"$f":"PL!A156","v":""},{"$f":"IF(PL!B156=\"\",\"\",PL!B156)","v":""},{"$f":"IF(PL!C156=\"\",\"\",PL!C156)","v":""},"00:00:00","00:00:00",0,{"$error":"#N/A"},null,{"$f":"IF(A386=\"x\",PL!D156,0)","v":0},"",0,0,0,0,0,0,0,0,0,0,0,0,0,0,0,0,0,0,0,0,0,0,0,0,0,0,0,0,0,0,0,0,0,0,0,0,0,0,0,0,0,0,0,0,0,0,0,0,0,0,0,0,0,0,0,0,0,0,0,0,0,0,0,0,0,0,0,0,0,0,0,0,0,0,0,0,0,0,0,0,0,0,null,"End Line"]
["",{"$f":"PL!A157","v":""},{"$f":"IF(PL!B157=\"\",\"\",PL!B157)","v":""},{"$f":"IF(PL!C157=\"\",\"\",PL!C157)","v":""},"00:00:00","00:00:00",0,{"$error":"#N/A"},null,{"$f":"IF(A387=\"x\",PL!D157,0)","v":0},"",0,0,0,0,0,0,0,0,0,0,0,0,0,0,0,0,0,0,0,0,0,0,0,0,0,0,0,0,0,0,0,0,0,0,0,0,0,0,0,0,0,0,0,0,0,0,0,0,0,0,0,0,0,0,0,0,0,0,0,0,0,0,0,0,0,0,0,0,0,0,0,0,0,0,0,0,0,0,0,0,0,0,null,"End Line"]
["",{"$f":"PL!A158","v":""},{"$f":"IF(PL!B158=\"\",\"\",PL!B158)","v":""},{"$f":"IF(PL!C158=\"\",\"\",PL!C158)","v":""},"00:00:00","00:00:00",0,{"$error":"#N/A"},null,{"$f":"IF(A388=\"x\",PL!D158,0)","v":0},"",0,0,0,0,0,0,0,0,0,0,0,0,0,0,0,0,0,0,0,0,0,0,0,0,0,0,0,0,0,0,0,0,0,0,0,0,0,0,0,0,0,0,0,0,0,0,0,0,0,0,0,0,0,0,0,0,0,0,0,0,0,0,0,0,0,0,0,0,0,0,0,0,0,0,0,0,0,0,0,0,0,0,null,"End Line"]
["",{"$f":"PL!A159","v":""},{"$f":"IF(PL!B159=\"\",\"\",PL!B159)","v":""},{"$f":"IF(PL!C159=\"\",\"\",PL!C159)","v":""},"00:00:00","00:00:00",0,{"$error":"#N/A"},null,{"$f":"IF(A389=\"x\",PL!D159,0)","v":0},"",0,0,0,0,0,0,0,0,0,0,0,0,0,0,0,0,0,0,0,0,0,0,0,0,0,0,0,0,0,0,0,0,0,0,0,0,0,0,0,0,0,0,0,0,0,0,0,0,0,0,0,0,0,0,0,0,0,0,0,0,0,0,0,0,0,0,0,0,0,0,0,0,0,0,0,0,0,0,0,0,0,0,null,"End Line"]
["",{"$f":"PL!A160","v":""},{"$f":"IF(PL!B160=\"\",\"\",PL!B160)","v":""},{"$f":"IF(PL!C160=\"\",\"\",PL!C160)","v":""},"00:00:00","00:00:00",0,{"$error":"#N/A"},null,{"$f":"IF(A390=\"x\",PL!D160,0)","v":0},"",0,0,0,0,0,0,0,0,0,0,0,0,0,0,0,0,0,0,0,0,0,0,0,0,0,0,0,0,0,0,0,0,0,0,0,0,0,0,0,0,0,0,0,0,0,0,0,0,0,0,0,0,0,0,0,0,0,0,0,0,0,0,0,0,0,0,0,0,0,0,0,0,0,0,0,0,0,0,0,0,0,0,null,"End Line"]
["",{"$f":"PL!A161","v":""},{"$f":"IF(PL!B161=\"\",\"\",PL!B161)","v":""},{"$f":"IF(PL!C161=\"\",\"\",PL!C161)","v":""},"00:00:00","00:00:00",0,{"$error":"#N/A"},null,{"$f":"IF(A391=\"x\",PL!D161,0)","v":0},"",0,0,0,0,0,0,0,0,0,0,0,0,0,0,0,0,0,0,0,0,0,0,0,0,0,0,0,0,0,0,0,0,0,0,0,0,0,0,0,0,0,0,0,0,0,0,0,0,0,0,0,0,0,0,0,0,0,0,0,0,0,0,0,0,0,0,0,0,0,0,0,0,0,0,0,0,0,0,0,0,0,0,null,"End Line"]
["",{"$f":"PL!A162","v":""},{"$f":"IF(PL!B162=\"\",\"\",PL!B162)","v":""},{"$f":"IF(PL!C162=\"\",\"\",PL!C162)","v":""},"00:00:00","00:00:00",0,{"$error":"#N/A"},null,{"$f":"IF(A392=\"x\",PL!D162,0)","v":0},"",0,0,0,0,0,0,0,0,0,0,0,0,0,0,0,0,0,0,0,0,0,0,0,0,0,0,0,0,0,0,0,0,0,0,0,0,0,0,0,0,0,0,0,0,0,0,0,0,0,0,0,0,0,0,0,0,0,0,0,0,0,0,0,0,0,0,0,0,0,0,0,0,0,0,0,0,0,0,0,0,0,0,null,"End Line"]
["",{"$f":"PL!A163","v":""},{"$f":"IF(PL!B163=\"\",\"\",PL!B163)","v":""},{"$f":"IF(PL!C163=\"\",\"\",PL!C163)","v":""},"00:00:00","00:00:00",0,{"$error":"#N/A"},null,{"$f":"IF(A393=\"x\",PL!D163,0)","v":0},"",0,0,0,0,0,0,0,0,0,0,0,0,0,0,0,0,0,0,0,0,0,0,0,0,0,0,0,0,0,0,0,0,0,0,0,0,0,0,0,0,0,0,0,0,0,0,0,0,0,0,0,0,0,0,0,0,0,0,0,0,0,0,0,0,0,0,0,0,0,0,0,0,0,0,0,0,0,0,0,0,0,0,null,"End Line"]
["",{"$f":"PL!A164","v":""},{"$f":"IF(PL!B164=\"\",\"\",PL!B164)","v":""},{"$f":"IF(PL!C164=\"\",\"\",PL!C164)","v":""},"00:00:00","00:00:00",0,{"$error":"#N/A"},null,{"$f":"IF(A394=\"x\",PL!D164,0)","v":0},"",0,0,0,0,0,0,0,0,0,0,0,0,0,0,0,0,0,0,0,0,0,0,0,0,0,0,0,0,0,0,0,0,0,0,0,0,0,0,0,0,0,0,0,0,0,0,0,0,0,0,0,0,0,0,0,0,0,0,0,0,0,0,0,0,0,0,0,0,0,0,0,0,0,0,0,0,0,0,0,0,0,0,null,"End Line"]
["",{"$f":"PL!A165","v":""},{"$f":"IF(PL!B165=\"\",\"\",PL!B165)","v":""},{"$f":"IF(PL!C165=\"\",\"\",PL!C165)","v":""},"00:00:00","00:00:00",0,{"$error":"#N/A"},null,{"$f":"IF(A395=\"x\",PL!D165,0)","v":0},"",0,0,0,0,0,0,0,0,0,0,0,0,0,0,0,0,0,0,0,0,0,0,0,0,0,0,0,0,0,0,0,0,0,0,0,0,0,0,0,0,0,0,0,0,0,0,0,0,0,0,0,0,0,0,0,0,0,0,0,0,0,0,0,0,0,0,0,0,0,0,0,0,0,0,0,0,0,0,0,0,0,0,null,"End Line"]
["",{"$f":"PL!A166","v":""},{"$f":"IF(PL!B166=\"\",\"\",PL!B166)","v":""},{"$f":"IF(PL!C166=\"\",\"\",PL!C166)","v":""},"00:00:00","00:00:00",0,{"$error":"#N/A"},null,{"$f":"IF(A396=\"x\",PL!D166,0)","v":0},"",0,0,0,0,0,0,0,0,0,0,0,0,0,0,0,0,0,0,0,0,0,0,0,0,0,0,0,0,0,0,0,0,0,0,0,0,0,0,0,0,0,0,0,0,0,0,0,0,0,0,0,0,0,0,0,0,0,0,0,0,0,0,0,0,0,0,0,0,0,0,0,0,0,0,0,0,0,0,0,0,0,0,null,"End Line"]
["",{"$f":"PL!A167","v":""},{"$f":"IF(PL!B167=\"\",\"\",PL!B167)","v":""},{"$f":"IF(PL!C167=\"\",\"\",PL!C167)","v":""},"00:00:00","00:00:00",0,{"$error":"#N/A"},null,{"$f":"IF(A397=\"x\",PL!D167,0)","v":0},"",0,0,0,0,0,0,0,0,0,0,0,0,0,0,0,0,0,0,0,0,0,0,0,0,0,0,0,0,0,0,0,0,0,0,0,0,0,0,0,0,0,0,0,0,0,0,0,0,0,0,0,0,0,0,0,0,0,0,0,0,0,0,0,0,0,0,0,0,0,0,0,0,0,0,0,0,0,0,0,0,0,0,null,"End Line"]
["",{"$f":"PL!A168","v":""},{"$f":"IF(PL!B168=\"\",\"\",PL!B168)","v":""},{"$f":"IF(PL!C168=\"\",\"\",PL!C168)","v":""},"00:00:00","00:00:00",0,{"$error":"#N/A"},null,{"$f":"IF(A398=\"x\",PL!D168,0)","v":0},"",0,0,0,0,0,0,0,0,0,0,0,0,0,0,0,0,0,0,0,0,0,0,0,0,0,0,0,0,0,0,0,0,0,0,0,0,0,0,0,0,0,0,0,0,0,0,0,0,0,0,0,0,0,0,0,0,0,0,0,0,0,0,0,0,0,0,0,0,0,0,0,0,0,0,0,0,0,0,0,0,0,0,null,"End Line"]
["",{"$f":"PL!A169","v":""},{"$f":"IF(PL!B169=\"\",\"\",PL!B169)","v":""},{"$f":"IF(PL!C169=\"\",\"\",PL!C169)","v":""},"00:00:00","00:00:00",0,{"$error":"#N/A"},null,{"$f":"IF(A399=\"x\",PL!D169,0)","v":0},"",0,0,0,0,0,0,0,0,0,0,0,0,0,0,0,0,0,0,0,0,0,0,0,0,0,0,0,0,0,0,0,0,0,0,0,0,0,0,0,0,0,0,0,0,0,0,0,0,0,0,0,0,0,0,0,0,0,0,0,0,0,0,0,0,0,0,0,0,0,0,0,0,0,0,0,0,0,0,0,0,0,0,null,"End Line"]
["",{"$f":"PL!A170","v":""},{"$f":"IF(PL!B170=\"\",\"\",PL!B170)","v":""},{"$f":"IF(PL!C170=\"\",\"\",PL!C170)","v":""},"00:00:00","00:00:00",0,{"$f":"VLOOKUP(D400,$E$252:$G$258,3)","v":{"$error":"#N/A"}},null,{"$f":"IF(A400=\"x\",PL!D170,0)","v":0},"",0,0,0,0,0,0,0,0,0,0,0,0,0,0,0,0,0,0,0,0,0,0,0,0,0,0,0,0,0,0,0,0,0,0,0,0,0,0,0,0,0,0,0,0,0,0,0,0,0,0,0,0,0,0,0,0,0,0,0,0,0,0,0,0,0,0,0,0,0,0,0,0,0,0,0,0,0,0,0,0,0,0,null,"End Line"]
["",{"$f":"PL!A171","v":""},{"$f":"IF(PL!B171=\"\",\"\",PL!B171)","v":""},{"$f":"IF(PL!C171=\"\",\"\",PL!C171)","v":""},"00:00:00","00:00:00",0,{"$error":"#N/A"},null,{"$f":"IF(A401=\"x\",PL!D171,0)","v":0},"",0,0,0,0,0,0,0,0,0,0,0,0,0,0,0,0,0,0,0,0,0,0,0,0,0,0,0,0,0,0,0,0,0,0,0,0,0,0,0,0,0,0,0,0,0,0,0,0,0,0,0,0,0,0,0,0,0,0,0,0,0,0,0,0,0,0,0,0,0,0,0,0,0,0,0,0,0,0,0,0,0,0,null,"End Line"]
["",{"$f":"PL!A172","v":""},{"$f":"IF(PL!B172=\"\",\"\",PL!B172)","v":""},{"$f":"IF(PL!C172=\"\",\"\",PL!C172)","v":""},"00:00:00","00:00:00",0,{"$error":"#N/A"},null,{"$f":"IF(A402=\"x\",PL!D172,0)","v":0},"",0,0,0,0,0,0,0,0,0,0,0,0,0,0,0,0,0,0,0,0,0,0,0,0,0,0,0,0,0,0,0,0,0,0,0,0,0,0,0,0,0,0,0,0,0,0,0,0,0,0,0,0,0,0,0,0,0,0,0,0,0,0,0,0,0,0,0,0,0,0,0,0,0,0,0,0,0,0,0,0,0,0,null,"End Line"]
["",{"$f":"PL!A173","v":""},{"$f":"IF(PL!B173=\"\",\"\",PL!B173)","v":""},{"$f":"IF(PL!C173=\"\",\"\",PL!C173)","v":""},"00:00:00","00:00:00",0,{"$error":"#N/A"},null,{"$f":"IF(A403=\"x\",PL!D173,0)","v":0},"",0,0,0,0,0,0,0,0,0,0,0,0,0,0,0,0,0,0,0,0,0,0,0,0,0,0,0,0,0,0,0,0,0,0,0,0,0,0,0,0,0,0,0,0,0,0,0,0,0,0,0,0,0,0,0,0,0,0,0,0,0,0,0,0,0,0,0,0,0,0,0,0,0,0,0,0,0,0,0,0,0,0,null,"End Line"]
["",{"$f":"PL!A174","v":""},{"$f":"IF(PL!B174=\"\",\"\",PL!B174)","v":""},{"$f":"IF(PL!C174=\"\",\"\",PL!C174)","v":""},"00:00:00","00:00:00",0,{"$error":"#N/A"},null,{"$f":"IF(A404=\"x\",PL!D174,0)","v":0},"",0,0,0,0,0,0,0,0,0,0,0,0,0,0,0,0,0,0,0,0,0,0,0,0,0,0,0,0,0,0,0,0,0,0,0,0,0,0,0,0,0,0,0,0,0,0,0,0,0,0,0,0,0,0,0,0,0,0,0,0,0,0,0,0,0,0,0,0,0,0,0,0,0,0,0,0,0,0,0,0,0,0,null,"End Line"]
["",{"$f":"PL!A175","v":""},{"$f":"IF(PL!B175=\"\",\"\",PL!B175)","v":""},{"$f":"IF(PL!C175=\"\",\"\",PL!C175)","v":""},"00:00:00","00:00:00",0,{"$error":"#N/A"},null,{"$f":"IF(A405=\"x\",PL!D175,0)","v":0},"",0,0,0,0,0,0,0,0,0,0,0,0,0,0,0,0,0,0,0,0,0,0,0,0,0,0,0,0,0,0,0,0,0,0,0,0,0,0,0,0,0,0,0,0,0,0,0,0,0,0,0,0,0,0,0,0,0,0,0,0,0,0,0,0,0,0,0,0,0,0,0,0,0,0,0,0,0,0,0,0,0,0,null,"End Line"]
["",{"$f":"PL!A176","v":""},{"$f":"IF(PL!B176=\"\",\"\",PL!B176)","v":""},{"$f":"IF(PL!C176=\"\",\"\",PL!C176)","v":""},"00:00:00","00:00:00",0,{"$error":"#N/A"},null,{"$f":"IF(A406=\"x\",PL!D176,0)","v":0},"",0,0,0,0,0,0,0,0,0,0,0,0,0,0,0,0,0,0,0,0,0,0,0,0,0,0,0,0,0,0,0,0,0,0,0,0,0,0,0,0,0,0,0,0,0,0,0,0,0,0,0,0,0,0,0,0,0,0,0,0,0,0,0,0,0,0,0,0,0,0,0,0,0,0,0,0,0,0,0,0,0,0,null,"End Line"]
["",{"$f":"PL!A177","v":""},{"$f":"IF(PL!B177=\"\",\"\",PL!B177)","v":""},{"$f":"IF(PL!C177=\"\",\"\",PL!C177)","v":""},"00:00:00","00:00:00",0,{"$error":"#N/A"},null,{"$f":"IF(A407=\"x\",PL!D177,0)","v":0},"",0,0,0,0,0,0,0,0,0,0,0,0,0,0,0,0,0,0,0,0,0,0,0,0,0,0,0,0,0,0,0,0,0,0,0,0,0,0,0,0,0,0,0,0,0,0,0,0,0,0,0,0,0,0,0,0,0,0,0,0,0,0,0,0,0,0,0,0,0,0,0,0,0,0,0,0,0,0,0,0,0,0,null,"End Line"]
["",{"$f":"PL!A178","v":""},{"$f":"IF(PL!B178=\"\",\"\",PL!B178)","v":""},{"$f":"IF(PL!C178=\"\",\"\",PL!C178)","v":""},"00:00:00","00:00:00",0,{"$error":"#N/A"},null,{"$f":"IF(A408=\"x\",PL!D178,0)","v":0},"",0,0,0,0,0,0,0,0,0,0,0,0,0,0,0,0,0,0,0,0,0,0,0,0,0,0,0,0,0,0,0,0,0,0,0,0,0,0,0,0,0,0,0,0,0,0,0,0,0,0,0,0,0,0,0,0,0,0,0,0,0,0,0,0,0,0,0,0,0,0,0,0,0,0,0,0,0,0,0,0,0,0,null,"End Line"]
["",{"$f":"PL!A179","v":""},{"$f":"IF(PL!B179=\"\",\"\",PL!B179)","v":""},{"$f":"IF(PL!C179=\"\",\"\",PL!C179)","v":""},"00:00:00","00:00:00",0,{"$error":"#N/A"},null,{"$f":"IF(A409=\"x\",PL!D179,0)","v":0},"",0,0,0,0,0,0,0,0,0,0,0,0,0,0,0,0,0,0,0,0,0,0,0,0,0,0,0,0,0,0,0,0,0,0,0,0,0,0,0,0,0,0,0,0,0,0,0,0,0,0,0,0,0,0,0,0,0,0,0,0,0,0,0,0,0,0,0,0,0,0,0,0,0,0,0,0,0,0,0,0,0,0,null,"End Line"]
["",{"$f":"PL!A180","v":""},{"$f":"IF(PL!B180=\"\",\"\",PL!B180)","v":""},{"$f":"IF(PL!C180=\"\",\"\",PL!C180)","v":""},"00:00:00","00:00:00",0,{"$error":"#N/A"},null,{"$f":"IF(A410=\"x\",PL!D180,0)","v":0},"",0,0,0,0,0,0,0,0,0,0,0,0,0,0,0,0,0,0,0,0,0,0,0,0,0,0,0,0,0,0,0,0,0,0,0,0,0,0,0,0,0,0,0,0,0,0,0,0,0,0,0,0,0,0,0,0,0,0,0,0,0,0,0,0,0,0,0,0,0,0,0,0,0,0,0,0,0,0,0,0,0,0,null,"End Line"]
["",{"$f":"PL!A181","v":""},{"$f":"IF(PL!B181=\"\",\"\",PL!B181)","v":""},{"$f":"IF(PL!C181=\"\",\"\",PL!C181)","v":""},"00:00:00","00:00:00",0,{"$error":"#N/A"},null,{"$f":"IF(A411=\"x\",PL!D181,0)","v":0},"",0,0,0,0,0,0,0,0,0,0,0,0,0,0,0,0,0,0,0,0,0,0,0,0,0,0,0,0,0,0,0,0,0,0,0,0,0,0,0,0,0,0,0,0,0,0,0,0,0,0,0,0,0,0,0,0,0,0,0,0,0,0,0,0,0,0,0,0,0,0,0,0,0,0,0,0,0,0,0,0,0,0,null,"End Line"]
["",{"$f":"PL!A182","v":""},{"$f":"IF(PL!B182=\"\",\"\",PL!B182)","v":""},{"$f":"IF(PL!C182=\"\",\"\",PL!C182)","v":""},{"$f":"G172","v":"00:00:00"},{"$f":"H172","v":"00:00:00"},{"$f":"K172","v":0},{"$error":"#N/A"},null,{"$f":"IF(A412=\"x\",PL!D182,0)","v":0},{"$f":"IF(C412=\"\",\"\",H412)","v":""},{"$f":"IF(K412=$L$249,J412,0)","v":0},{"$f":"IF(K412=$M$249,J412,0)","v":0},0,{"$f":"IF(K412=$O$249,J412,0)","v":0},{"$f":"IF(K412=$P$249,J412,0)","v":0},{"$f":"IF(K412=$Q$249,J412,0)","v":0},{"$f":"IF(K412=$R$249,J412,0)","v":0},{"$f":"IF(K412=$S$249,J412,0)","v":0},{"$f":"IF(K412=$T$249,J412,0)","v":0},{"$f":"IF(K412=$U$249,J412,0)","v":0},{"$f":"IF(K412=$V$249,J412,0)","v":0},{"$f":"IF(K412=$W$249,J412,0)","v":0},{"$f":"IF(K412=$X$249,J412,0)","v":0},{"$f":"IF(K412=$Y$249,J412,0)","v":0},{"$f":"IF(K412=$Z$249,J412,0)","v":0},{"$f":"IF(K412=$AA$249,J412,0)","v":0},{"$f":"IF(K412=$AB$249,J412,0)","v":0},{"$f":"IF(K412=$AC$249,J412,0)","v":0},{"$f":"IF(K412=$AD$249,J412,0)","v":0},{"$f":"IF(K412=$AE$249,J412,0)","v":0},{"$f":"IF(K412=$AF$249,J412,0)","v":0},{"$f":"IF(K412=$AG$249,J412,0)","v":0},{"$f":"IF(K412=$AH$249,J412,0)","v":0},{"$f":"IF(K412=$AI$249,J412,0)","v":0},{"$f":"IF(K412=$AJ$249,J412,0)","v":0},{"$f":"IF(K412=$AK$249,J412,0)","v":0},{"$f":"IF(K412=$AL$249,J412,0)","v":0},{"$f":"IF(K412=$AM$249,J412,0)","v":0},{"$f":"IF(K412=$AN$249,J412,0)","v":0},{"$f":"IF(K412=$AO$249,J412,0)","v":0},{"$f":"IF(K412=$AP$249,J412,0)","v":0},{"$f":"IF(K412=$AQ$249,J412,0)","v":0},{"$f":"IF(K412=$AR$249,J412,0)","v":0},{"$f":"IF(K412=$AS$249,J412,0)","v":0},{"$f":"IF(K412=$AT$249,J412,0)","v":0},{"$f":"IF(K412=$AU$249,J412,0)","v":0},{"$f":"IF(K412=$AV$249,J412,0)","v":0},{"$f":"IF(K412=$AW$249,J412,0)","v":0},{"$f":"IF(K412=$AX$249,J412,0)","v":0},{"$f":"IF(K412=$AY$249,J412,0)","v":0},{"$f":"IF(K412=$AZ$249,J412,0)","v":0},{"$f":"IF(K412=$BA$249,J412,0)","v":0},{"$f":"IF(K412=$BB$249,J412,0)","v":0},{"$f":"IF(K412=$BC$249,J412,0)","v":0},{"$f":"IF(K412=$BD$249,J412,0)","v":0},{"$f":"IF(K412=$BE$249,J412,0)","v":0},{"$f":"IF(K412=$BF$249,J412,0)","v":0},{"$f":"IF(K412=$BG$249,J412,0)","v":0},{"$f":"IF(K412=$BH$249,J412,0)","v":0},{"$f":"IF(K412=$BI$249,J412,0)","v":0},{"$f":"IF(K412=$BJ$249,J412,0)","v":0},{"$f":"IF(K412=$BK$249,J412,0)","v":0},{"$f":"IF(K412=$BL$249,J412,0)","v":0},{"$f":"IF(K412=$BM$249,J412,0)","v":0},{"$f":"IF(K412=$BN$249,J412,0)","v":0},{"$f":"IF(K412=$BO$249,J412,0)","v":0},{"$f":"IF(K412=$BP$249,J412,0)","v":0},{"$f":"IF(K412=$BQ$249,J412,0)","v":0},{"$f":"IF(K412=$BR$249,J412,0)","v":0},{"$f":"IF(K412=$BS$249,J412,0)","v":0},{"$f":"IF(K412=$BT$249,J412,0)","v":0},{"$f":"IF(K412=$BU$249,J412,0)","v":0},{"$f":"IF(K412=$BV$249,J412,0)","v":0},{"$f":"IF(K412=$BW$249,J412,0)","v":0},{"$f":"IF(K412=$BX$249,J412,0)","v":0},{"$f":"IF(K412=$BY$249,J412,0)","v":0},{"$f":"IF(K412=$BZ$249,J412,0)","v":0},{"$f":"IF(K412=$CA$249,J412,0)","v":0},{"$f":"IF(K412=$CB$249,J412,0)","v":0},{"$f":"IF(K412=$CC$249,J412,0)","v":0},{"$f":"IF(K412=$CD$249,J412,0)","v":0},{"$f":"IF(K412=$CE$249,J412,0)","v":0},{"$f":"IF(K412=$CF$249,J412,0)","v":0},{"$f":"IF(K412=$CG$249,J412,0)","v":0},{"$f":"IF(K412=$CH$249,J412,0)","v":0},{"$f":"IF(K412=$CI$249,J412,0)","v":0},{"$f":"IF(K412=$CJ$249,J412,0)","v":0},{"$f":"IF(K412=$CK$249,J412,0)","v":0},{"$f":"IF(K412=$CL$249,J412,0)","v":0},{"$f":"IF(K412=$CM$249,J412,0)","v":0},{"$f":"IF(K412=$CN$249,J412,0)","v":0},{"$f":"IF(K412=$CO$249,J412,0)","v":0},null,"End Line"]
["",{"$f":"PL!A183","v":""},{"$f":"IF(PL!B183=\"\",\"\",PL!B183)","v":""},{"$f":"IF(PL!C183=\"\",\"\",PL!C183)","v":""},"00:00:00","00:00:00",0,{"$error":"#N/A"},null,{"$f":"IF(A413=\"x\",PL!D183,0)","v":0},"",0,0,0,0,0,0,0,0,0,0,0,0,0,0,0,0,0,0,0,0,0,0,0,0,0,0,0,0,0,0,0,0,0,0,0,0,0,0,0,0,0,0,0,0,0,0,0,0,0,0,0,0,0,0,0,0,0,0,0,0,0,0,0,0,0,0,0,0,0,0,0,0,0,0,0,0,0,0,0,0,0,0,null,"End Line"]
["",{"$f":"PL!A184","v":""},{"$f":"IF(PL!B184=\"\",\"\",PL!B184)","v":""},{"$f":"IF(PL!C184=\"\",\"\",PL!C184)","v":""},"00:00:00","00:00:00",0,{"$error":"#N/A"},null,{"$f":"IF(A414=\"x\",PL!D184,0)","v":0},"",0,0,0,0,0,0,0,0,0,0,0,0,0,0,0,0,0,0,0,0,0,0,0,0,0,0,0,0,0,0,0,0,0,0,0,0,0,0,0,0,0,0,0,0,0,0,0,0,0,0,0,0,0,0,0,0,0,0,0,0,0,0,0,0,0,0,0,0,0,0,0,0,0,0,0,0,0,0,0,0,0,0,null,"End Line"]
["",{"$f":"PL!A185","v":""},{"$f":"IF(PL!B185=\"\",\"\",PL!B185)","v":""},{"$f":"IF(PL!C185=\"\",\"\",PL!C185)","v":""},"00:00:00","00:00:00",0,{"$error":"#N/A"},null,{"$f":"IF(A415=\"x\",PL!D185,0)","v":0},"",0,0,0,0,0,0,0,0,0,0,0,0,0,0,0,0,0,0,0,0,0,0,0,0,0,0,0,0,0,0,0,0,0,0,0,0,0,0,0,0,0,0,0,0,0,0,0,0,0,0,0,0,0,0,0,0,0,0,0,0,0,0,0,0,0,0,0,0,0,0,0,0,0,0,0,0,0,0,0,0,0,0,null,"End Line"]
["",{"$f":"PL!A186","v":""},{"$f":"IF(PL!B186=\"\",\"\",PL!B186)","v":""},{"$f":"IF(PL!C186=\"\",\"\",PL!C186)","v":""},"00:00:00","00:00:00",0,{"$error":"#N/A"},null,{"$f":"IF(A416=\"x\",PL!D186,0)","v":0},"",0,0,0,0,0,0,0,0,0,0,0,0,0,0,0,0,0,0,0,0,0,0,0,0,0,0,0,0,0,0,0,0,0,0,0,0,0,0,0,0,0,0,0,0,0,0,0,0,0,0,0,0,0,0,0,0,0,0,0,0,0,0,0,0,0,0,0,0,0,0,0,0,0,0,0,0,0,0,0,0,0,0,null,"End Line"]
["",{"$f":"PL!A187","v":""},{"$f":"IF(PL!B187=\"\",\"\",PL!B187)","v":""},{"$f":"IF(PL!C187=\"\",\"\",PL!C187)","v":""},"00:00:00","00:00:00",0,{"$error":"#N/A"},null,{"$f":"IF(A417=\"x\",PL!D187,0)","v":0},"",0,0,0,0,0,0,0,0,0,0,0,0,0,0,0,0,0,0,0,0,0,0,0,0,0,0,0,0,0,0,0,0,0,0,0,0,0,0,0,0,0,0,0,0,0,0,0,0,0,0,0,0,0,0,0,0,0,0,0,0,0,0,0,0,0,0,0,0,0,0,0,0,0,0,0,0,0,0,0,0,0,0,null,"End Line"]
["",{"$f":"PL!A188","v":""},{"$f":"IF(PL!B188=\"\",\"\",PL!B188)","v":""},{"$f":"IF(PL!C188=\"\",\"\",PL!C188)","v":""},"00:00:00","00:00:00",0,{"$error":"#N/A"},null,{"$f":"IF(A418=\"x\",PL!D188,0)","v":0},"",0,0,0,0,0,0,0,0,0,0,0,0,0,0,0,0,0,0,0,0,0,0,0,0,0,0,0,0,0,0,0,0,0,0,0,0,0,0,0,0,0,0,0,0,0,0,0,0,0,0,0,0,0,0,0,0,0,0,0,0,0,0,0,0,0,0,0,0,0,0,0,0,0,0,0,0,0,0,0,0,0,0,null,"End Line"]
["",{"$f":"PL!A189","v":""},{"$f":"IF(PL!B189=\"\",\"\",PL!B189)","v":""},{"$f":"IF(PL!C189=\"\",\"\",PL!C189)","v":""},"00:00:00","00:00:00",0,{"$error":"#N/A"},null,{"$f":"IF(A419=\"x\",PL!D189,0)","v":0},"",0,0,0,0,0,0,0,0,0,0,0,0,0,0,0,0,0,0,0,0,0,0,0,0,0,0,0,0,0,0,0,0,0,0,0,0,0,0,0,0,0,0,0,0,0,0,0,0,0,0,0,0,0,0,0,0,0,0,0,0,0,0,0,0,0,0,0,0,0,0,0,0,0,0,0,0,0,0,0,0,0,0,null,"End Line"]
["",{"$f":"PL!A190","v":""},{"$f":"IF(PL!B190=\"\",\"\",PL!B190)","v":""},{"$f":"IF(PL!C190=\"\",\"\",PL!C190)","v":""},"00:00:00","00:00:00",0,{"$error":"#N/A"},null,{"$f":"IF(A420=\"x\",PL!D190,0)","v":0},"",0,0,0,0,0,0,0,0,0,0,0,0,0,0,0,0,0,0,0,0,0,0,0,0,0,0,0,0,0,0,0,0,0,0,0,0,0,0,0,0,0,0,0,0,0,0,0,0,0,0,0,0,0,0,0,0,0,0,0,0,0,0,0,0,0,0,0,0,0,0,0,0,0,0,0,0,0,0,0,0,0,0,null,"End Line"]
["",{"$f":"PL!A191","v":""},{"$f":"IF(PL!B191=\"\",\"\",PL!B191)","v":""},{"$f":"IF(PL!C191=\"\",\"\",PL!C191)","v":""},"00:00:00","00:00:00",0,{"$error":"#N/A"},null,{"$f":"IF(A421=\"x\",PL!D191,0)","v":0},"",0,0,0,0,0,0,0,0,0,0,0,0,0,0,0,0,0,0,0,0,0,0,0,0,0,0,0,0,0,0,0,0,0,0,0,0,0,0,0,0,0,0,0,0,0,0,0,0,0,0,0,0,0,0,0,0,0,0,0,0,0,0,0,0,0,0,0,0,0,0,0,0,0,0,0,0,0,0,0,0,0,0,null,"End Line"]
["",{"$f":"PL!A192","v":""},{"$f":"IF(PL!B192=\"\",\"\",PL!B192)","v":""},{"$f":"IF(PL!C192=\"\",\"\",PL!C192)","v":""},"00:00:00","00:00:00",0,{"$error":"#N/A"},null,{"$f":"IF(A422=\"x\",PL!D192,0)","v":0},"",0,0,0,0,0,0,0,0,0,0,0,0,0,0,0,0,0,0,0,0,0,0,0,0,0,0,0,0,0,0,0,0,0,0,0,0,0,0,0,0,0,0,0,0,0,0,0,0,0,0,0,0,0,0,0,0,0,0,0,0,0,0,0,0,0,0,0,0,0,0,0,0,0,0,0,0,0,0,0,0,0,0,null,"End Line"]
["",{"$f":"PL!A193","v":""},{"$f":"IF(PL!B193=\"\",\"\",PL!B193)","v":""},{"$f":"IF(PL!C193=\"\",\"\",PL!C193)","v":""},"00:00:00","00:00:00",0,{"$error":"#N/A"},null,{"$f":"IF(A423=\"x\",PL!D193,0)","v":0},"",0,0,0,0,0,0,0,0,0,0,0,0,0,0,0,0,0,0,0,0,0,0,0,0,0,0,0,0,0,0,0,0,0,0,0,0,0,0,0,0,0,0,0,0,0,0,0,0,0,0,0,0,0,0,0,0,0,0,0,0,0,0,0,0,0,0,0,0,0,0,0,0,0,0,0,0,0,0,0,0,0,0,null,"End Line"]
["",{"$f":"PL!A194","v":""},{"$f":"IF(PL!B194=\"\",\"\",PL!B194)","v":""},{"$f":"IF(PL!C194=\"\",\"\",PL!C194)","v":""},"00:00:00","00:00:00",0,{"$error":"#N/A"},null,{"$f":"IF(A424=\"x\",PL!D194,0)","v":0},"",0,0,0,0,0,0,0,0,0,0,0,0,0,0,0,0,0,0,0,0,0,0,0,0,0,0,0,0,0,0,0,0,0,0,0,0,0,0,0,0,0,0,0,0,0,0,0,0,0,0,0,0,0,0,0,0,0,0,0,0,0,0,0,0,0,0,0,0,0,0,0,0,0,0,0,0,0,0,0,0,0,0,null,"End Line"]
["",{"$f":"PL!A195","v":""},{"$f":"IF(PL!B195=\"\",\"\",PL!B195)","v":""},{"$f":"IF(PL!C195=\"\",\"\",PL!C195)","v":""},"00:00:00","00:00:00",0,{"$error":"#N/A"},null,{"$f":"IF(A425=\"x\",PL!D195,0)","v":0},"",0,0,0,0,0,0,0,0,0,0,0,0,0,0,0,0,0,0,0,0,0,0,0,0,0,0,0,0,0,0,0,0,0,0,0,0,0,0,0,0,0,0,0,0,0,0,0,0,0,0,0,0,0,0,0,0,0,0,0,0,0,0,0,0,0,0,0,0,0,0,0,0,0,0,0,0,0,0,0,0,0,0,null,"End Line"]
["",{"$f":"PL!A196","v":""},{"$f":"IF(PL!B196=\"\",\"\",PL!B196)","v":""},{"$f":"IF(PL!C196=\"\",\"\",PL!C196)","v":""},"00:00:00","00:00:00",0,{"$error":"#N/A"},null,{"$f":"IF(A426=\"x\",PL!D196,0)","v":0},"",0,0,0,0,0,0,0,0,0,0,0,0,0,0,0,0,0,0,0,0,0,0,0,0,0,0,0,0,0,0,0,0,0,0,0,0,0,0,0,0,0,0,0,0,0,0,0,0,0,0,0,0,0,0,0,0,0,0,0,0,0,0,0,0,0,0,0,0,0,0,0,0,0,0,0,0,0,0,0,0,0,0,null,"End Line"]
["",{"$f":"PL!A197","v":""},{"$f":"IF(PL!B197=\"\",\"\",PL!B197)","v":""},{"$f":"IF(PL!C197=\"\",\"\",PL!C197)","v":""},"00:00:00","00:00:00",0,{"$error":"#N/A"},null,{"$f":"IF(A427=\"x\",PL!D197,0)","v":0},"",0,0,0,0,0,0,0,0,0,0,0,0,0,0,0,0,0,0,0,0,0,0,0,0,0,0,0,0,0,0,0,0,0,0,0,0,0,0,0,0,0,0,0,0,0,0,0,0,0,0,0,0,0,0,0,0,0,0,0,0,0,0,0,0,0,0,0,0,0,0,0,0,0,0,0,0,0,0,0,0,0,0,null,"End Line"]
["",{"$f":"PL!A198","v":""},{"$f":"IF(PL!B198=\"\",\"\",PL!B198)","v":""},{"$f":"IF(PL!C198=\"\",\"\",PL!C198)","v":""},"00:00:00","00:00:00",0,{"$error":"#N/A"},null,{"$f":"IF(A428=\"x\",PL!D198,0)","v":0},"",0,0,0,0,0,0,0,0,0,0,0,0,0,0,0,0,0,0,0,0,0,0,0,0,0,0,0,0,0,0,0,0,0,0,0,0,0,0,0,0,0,0,0,0,0,0,0,0,0,0,0,0,0,0,0,0,0,0,0,0,0,0,0,0,0,0,0,0,0,0,0,0,0,0,0,0,0,0,0,0,0,0,null,"End Line"]
["",{"$f":"PL!A199","v":""},{"$f":"IF(PL!B199=\"\",\"\",PL!B199)","v":""},{"$f":"IF(PL!C199=\"\",\"\",PL!C199)","v":""},"00:00:00","00:00:00",0,{"$error":"#N/A"},null,{"$f":"IF(A429=\"x\",PL!D199,0)","v":0},"",0,0,0,0,0,0,0,0,0,0,0,0,0,0,0,0,0,0,0,0,0,0,0,0,0,0,0,0,0,0,0,0,0,0,0,0,0,0,0,0,0,0,0,0,0,0,0,0,0,0,0,0,0,0,0,0,0,0,0,0,0,0,0,0,0,0,0,0,0,0,0,0,0,0,0,0,0,0,0,0,0,0,null,"End Line"]
["",{"$f":"PL!A200","v":""},{"$f":"IF(PL!B200=\"\",\"\",PL!B200)","v":""},{"$f":"IF(PL!C200=\"\",\"\",PL!C200)","v":""},"00:00:00","00:00:00",0,{"$error":"#N/A"},null,{"$f":"IF(A430=\"x\",PL!D200,0)","v":0},"",0,0,0,0,0,0,0,0,0,0,0,0,0,0,0,0,0,0,0,0,0,0,0,0,0,0,0,0,0,0,0,0,0,0,0,0,0,0,0,0,0,0,0,0,0,0,0,0,0,0,0,0,0,0,0,0,0,0,0,0,0,0,0,0,0,0,0,0,0,0,0,0,0,0,0,0,0,0,0,0,0,0,null,"End Line"]
["",{"$f":"PL!A201","v":""},{"$f":"IF(PL!B201=\"\",\"\",PL!B201)","v":""},{"$f":"IF(PL!C201=\"\",\"\",PL!C201)","v":""},"00:00:00","00:00:00",0,{"$error":"#N/A"},null,{"$f":"IF(A431=\"x\",PL!D201,0)","v":0},"",0,0,0,0,0,0,0,0,0,0,0,0,0,0,0,0,0,0,0,0,0,0,0,0,0,0,0,0,0,0,0,0,0,0,0,0,0,0,0,0,0,0,0,0,0,0,0,0,0,0,0,0,0,0,0,0,0,0,0,0,0,0,0,0,0,0,0,0,0,0,0,0,0,0,0,0,0,0,0,0,0,0,null,"End Line"]
["",{"$f":"PL!A202","v":""},{"$f":"IF(PL!B202=\"\",\"\",PL!B202)","v":""},{"$f":"IF(PL!C202=\"\",\"\",PL!C202)","v":""},"00:00:00","00:00:00",0,{"$f":"VLOOKUP(D432,$E$252:$G$258,3)","v":{"$error":"#N/A"}},null,{"$f":"IF(A432=\"x\",PL!D202,0)","v":0},"",0,0,0,0,0,0,0,0,0,0,0,0,0,0,0,0,0,0,0,0,0,0,0,0,0,0,0,0,0,0,0,0,0,0,0,0,0,0,0,0,0,0,0,0,0,0,0,0,0,0,0,0,0,0,0,0,0,0,0,0,0,0,0,0,0,0,0,0,0,0,0,0,0,0,0,0,0,0,0,0,0,0,null,"End Line"]
["",{"$f":"PL!A203","v":""},{"$f":"IF(PL!B203=\"\",\"\",PL!B203)","v":""},{"$f":"IF(PL!C203=\"\",\"\",PL!C203)","v":""},"00:00:00","00:00:00",0,{"$error":"#N/A"},null,{"$f":"IF(A433=\"x\",PL!D203,0)","v":0},"",0,0,0,0,0,0,0,0,0,0,0,0,0,0,0,0,0,0,0,0,0,0,0,0,0,0,0,0,0,0,0,0,0,0,0,0,0,0,0,0,0,0,0,0,0,0,0,0,0,0,0,0,0,0,0,0,0,0,0,0,0,0,0,0,0,0,0,0,0,0,0,0,0,0,0,0,0,0,0,0,0,0,null,"End Line"]
["",{"$f":"PL!A204","v":""},{"$f":"IF(PL!B204=\"\",\"\",PL!B204)","v":""},{"$f":"IF(PL!C204=\"\",\"\",PL!C204)","v":""},"00:00:00","00:00:00",0,{"$error":"#N/A"},null,{"$f":"IF(A434=\"x\",PL!D204,0)","v":0},"",0,0,0,0,0,0,0,0,0,0,0,0,0,0,0,0,0,0,0,0,0,0,0,0,0,0,0,0,0,0,0,0,0,0,0,0,0,0,0,0,0,0,0,0,0,0,0,0,0,0,0,0,0,0,0,0,0,0,0,0,0,0,0,0,0,0,0,0,0,0,0,0,0,0,0,0,0,0,0,0,0,0,null,"End Line"]
["",{"$f":"PL!A205","v":""},{"$f":"IF(PL!B205=\"\",\"\",PL!B205)","v":""},{"$f":"IF(PL!C205=\"\",\"\",PL!C205)","v":""},"00:00:00","00:00:00",0,{"$error":"#N/A"},null,{"$f":"IF(A435=\"x\",PL!D205,0)","v":0},"",0,0,0,0,0,0,0,0,0,0,0,0,0,0,0,0,0,0,0,0,0,0,0,0,0,0,0,0,0,0,0,0,0,0,0,0,0,0,0,0,0,0,0,0,0,0,0,0,0,0,0,0,0,0,0,0,0,0,0,0,0,0,0,0,0,0,0,0,0,0,0,0,0,0,0,0,0,0,0,0,0,0,null,"End Line"]
["",{"$f":"PL!A206","v":""},{"$f":"IF(PL!B206=\"\",\"\",PL!B206)","v":""},{"$f":"IF(PL!C206=\"\",\"\",PL!C206)","v":""},"00:00:00","00:00:00",0,{"$error":"#N/A"},null,{"$f":"IF(A436=\"x\",PL!D206,0)","v":0},"",0,0,0,0,0,0,0,0,0,0,0,0,0,0,0,0,0,0,0,0,0,0,0,0,0,0,0,0,0,0,0,0,0,0,0,0,0,0,0,0,0,0,0,0,0,0,0,0,0,0,0,0,0,0,0,0,0,0,0,0,0,0,0,0,0,0,0,0,0,0,0,0,0,0,0,0,0,0,0,0,0,0,null,"End Line"]
["",{"$f":"PL!A207","v":""},{"$f":"IF(PL!B207=\"\",\"\",PL!B207)","v":""},{"$f":"IF(PL!C207=\"\",\"\",PL!C207)","v":""},"00:00:00","00:00:00",0,{"$error":"#N/A"},null,{"$f":"IF(A437=\"x\",PL!D207,0)","v":0},"",0,0,0,0,0,0,0,0,0,0,0,0,0,0,0,0,0,0,0,0,0,0,0,0,0,0,0,0,0,0,0,0,0,0,0,0,0,0,0,0,0,0,0,0,0,0,0,0,0,0,0,0,0,0,0,0,0,0,0,0,0,0,0,0,0,0,0,0,0,0,0,0,0,0,0,0,0,0,0,0,0,0,null,"End Line"]
["",{"$f":"PL!A208","v":""},{"$f":"IF(PL!B208=\"\",\"\",PL!B208)","v":""},{"$f":"IF(PL!C208=\"\",\"\",PL!C208)","v":""},"00:00:00","00:00:00",0,{"$error":"#N/A"},null,{"$f":"IF(A438=\"x\",PL!D208,0)","v":0},"",0,0,0,0,0,0,0,0,0,0,0,0,0,0,0,0,0,0,0,0,0,0,0,0,0,0,0,0,0,0,0,0,0,0,0,0,0,0,0,0,0,0,0,0,0,0,0,0,0,0,0,0,0,0,0,0,0,0,0,0,0,0,0,0,0,0,0,0,0,0,0,0,0,0,0,0,0,0,0,0,0,0,null,"End Line"]
["",{"$f":"PL!A209","v":""},{"$f":"IF(PL!B209=\"\",\"\",PL!B209)","v":""},{"$f":"IF(PL!C209=\"\",\"\",PL!C209)","v":""},"00:00:00","00:00:00",0,{"$error":"#N/A"},null,{"$f":"IF(A439=\"x\",PL!D209,0)","v":0},"",0,0,0,0,0,0,0,0,0,0,0,0,0,0,0,0,0,0,0,0,0,0,0,0,0,0,0,0,0,0,0,0,0,0,0,0,0,0,0,0,0,0,0,0,0,0,0,0,0,0,0,0,0,0,0,0,0,0,0,0,0,0,0,0,0,0,0,0,0,0,0,0,0,0,0,0,0,0,0,0,0,0,null,"End Line"]
["",{"$f":"PL!A210","v":""},{"$f":"IF(PL!B210=\"\",\"\",PL!B210)","v":""},{"$f":"IF(PL!C210=\"\",\"\",PL!C210)","v":""},"00:00:00","00:00:00",0,{"$error":"#N/A"},null,{"$f":"IF(A440=\"x\",PL!D210,0)","v":0},"",0,0,0,0,0,0,0,0,0,0,0,0,0,0,0,0,0,0,0,0,0,0,0,0,0,0,0,0,0,0,0,0,0,0,0,0,0,0,0,0,0,0,0,0,0,0,0,0,0,0,0,0,0,0,0,0,0,0,0,0,0,0,0,0,0,0,0,0,0,0,0,0,0,0,0,0,0,0,0,0,0,0,null,"End Line"]
["",{"$f":"PL!A211","v":""},{"$f":"IF(PL!B211=\"\",\"\",PL!B211)","v":""},{"$f":"IF(PL!C211=\"\",\"\",PL!C211)","v":""},"00:00:00","00:00:00",0,{"$error":"#N/A"},null,{"$f":"IF(A441=\"x\",PL!D211,0)","v":0},"",0,0,0,0,0,0,0,0,0,0,0,0,0,0,0,0,0,0,0,0,0,0,0,0,0,0,0,0,0,0,0,0,0,0,0,0,0,0,0,0,0,0,0,0,0,0,0,0,0,0,0,0,0,0,0,0,0,0,0,0,0,0,0,0,0,0,0,0,0,0,0,0,0,0,0,0,0,0,0,0,0,0,null,"End Line"]
["",{"$f":"PL!A212","v":""},{"$f":"IF(PL!B212=\"\",\"\",PL!B212)","v":""},{"$f":"IF(PL!C212=\"\",\"\",PL!C212)","v":""},"00:00:00","00:00:00",0,{"$error":"#N/A"},null,{"$f":"IF(A442=\"x\",PL!D212,0)","v":0},"",0,0,0,0,0,0,0,0,0,0,0,0,0,0,0,0,0,0,0,0,0,0,0,0,0,0,0,0,0,0,0,0,0,0,0,0,0,0,0,0,0,0,0,0,0,0,0,0,0,0,0,0,0,0,0,0,0,0,0,0,0,0,0,0,0,0,0,0,0,0,0,0,0,0,0,0,0,0,0,0,0,0,null,"End Line"]
["",{"$f":"PL!A213","v":""},{"$f":"IF(PL!B213=\"\",\"\",PL!B213)","v":""},{"$f":"IF(PL!C213=\"\",\"\",PL!C213)","v":""},"00:00:00","00:00:00",0,{"$error":"#N/A"},null,{"$f":"IF(A443=\"x\",PL!D213,0)","v":0},"",0,0,0,0,0,0,0,0,0,0,0,0,0,0,0,0,0,0,0,0,0,0,0,0,0,0,0,0,0,0,0,0,0,0,0,0,0,0,0,0,0,0,0,0,0,0,0,0,0,0,0,0,0,0,0,0,0,0,0,0,0,0,0,0,0,0,0,0,0,0,0,0,0,0,0,0,0,0,0,0,0,0,null,"End Line"]
[{"$f":"IF(AND(D444>=$D$11,D444<=$B$10),\"x\",\"\")","v":""},{"$f":"PL!A214","v":""},{"$f":"IF(PL!B214=\"\",\"\",PL!B214)","v":""},{"$f":"IF(PL!C214=\"\",\"\",PL!C214)","v":""},{"$f":"G204","v":"00:00:00"},{"$f":"H204","v":"00:00:00"},{"$f":"K204","v":0},{"$error":"#N/A"},null,{"$f":"IF(A444=\"x\",PL!D214,0)","v":0},{"$f":"IF(C444=\"\",\"\",H444)","v":""},{"$f":"IF(K444=$L$249,J444,0)","v":0},{"$f":"IF(K444=$M$249,J444,0)","v":0},0,{"$f":"IF(K444=$O$249,J444,0)","v":0},{"$f":"IF(K444=$P$249,J444,0)","v":0},{"$f":"IF(K444=$Q$249,J444,0)","v":0},{"$f":"IF(K444=$R$249,J444,0)","v":0},{"$f":"IF(K444=$S$249,J444,0)","v":0},{"$f":"IF(K444=$T$249,J444,0)","v":0},{"$f":"IF(K444=$U$249,J444,0)","v":0},{"$f":"IF(K444=$V$249,J444,0)","v":0},{"$f":"IF(K444=$W$249,J444,0)","v":0},{"$f":"IF(K444=$X$249,J444,0)","v":0},{"$f":"IF(K444=$Y$249,J444,0)","v":0},{"$f":"IF(K444=$Z$249,J444,0)","v":0},{"$f":"IF(K444=$AA$249,J444,0)","v":0},{"$f":"IF(K444=$AB$249,J444,0)","v":0},{"$f":"IF(K444=$AC$249,J444,0)","v":0},{"$f":"IF(K444=$AD$249,J444,0)","v":0},{"$f":"IF(K444=$AE$249,J444,0)","v":0},{"$f":"IF(K444=$AF$249,J444,0)","v":0},{"$f":"IF(K444=$AG$249,J444,0)","v":0},{"$f":"IF(K444=$AH$249,J444,0)","v":0},{"$f":"IF(K444=$AI$249,J444,0)","v":0},{"$f":"IF(K444=$AJ$249,J444,0)","v":0},{"$f":"IF(K444=$AK$249,J444,0)","v":0},{"$f":"IF(K444=$AL$249,J444,0)","v":0},{"$f":"IF(K444=$AM$249,J444,0)","v":0},{"$f":"IF(K444=$AN$249,J444,0)","v":0},{"$f":"IF(K444=$AO$249,J444,0)","v":0},{"$f":"IF(K444=$AP$249,J444,0)","v":0},{"$f":"IF(K444=$AQ$249,J444,0)","v":0},{"$f":"IF(K444=$AR$249,J444,0)","v":0},{"$f":"IF(K444=$AS$249,J444,0)","v":0},{"$f":"IF(K444=$AT$249,J444,0)","v":0},{"$f":"IF(K444=$AU$249,J444,0)","v":0},{"$f":"IF(K444=$AV$249,J444,0)","v":0},{"$f":"IF(K444=$AW$249,J444,0)","v":0},{"$f":"IF(K444=$AX$249,J444,0)","v":0},{"$f":"IF(K444=$AY$249,J444,0)","v":0},{"$f":"IF(K444=$AZ$249,J444,0)","v":0},{"$f":"IF(K444=$BA$249,J444,0)","v":0},{"$f":"IF(K444=$BB$249,J444,0)","v":0},{"$f":"IF(K444=$BC$249,J444,0)","v":0},{"$f":"IF(K444=$BD$249,J444,0)","v":0},{"$f":"IF(K444=$BE$249,J444,0)","v":0},{"$f":"IF(K444=$BF$249,J444,0)","v":0},{"$f":"IF(K444=$BG$249,J444,0)","v":0},{"$f":"IF(K444=$BH$249,J444,0)","v":0},{"$f":"IF(K444=$BI$249,J444,0)","v":0},{"$f":"IF(K444=$BJ$249,J444,0)","v":0},{"$f":"IF(K444=$BK$249,J444,0)","v":0},{"$f":"IF(K444=$BL$249,J444,0)","v":0},{"$f":"IF(K444=$BM$249,J444,0)","v":0},{"$f":"IF(K444=$BN$249,J444,0)","v":0},{"$f":"IF(K444=$BO$249,J444,0)","v":0},{"$f":"IF(K444=$BP$249,J444,0)","v":0},{"$f":"IF(K444=$BQ$249,J444,0)","v":0},{"$f":"IF(K444=$BR$249,J444,0)","v":0},{"$f":"IF(K444=$BS$249,J444,0)","v":0},{"$f":"IF(K444=$BT$249,J444,0)","v":0},{"$f":"IF(K444=$BU$249,J444,0)","v":0},{"$f":"IF(K444=$BV$249,J444,0)","v":0},{"$f":"IF(K444=$BW$249,J444,0)","v":0},{"$f":"IF(K444=$BX$249,J444,0)","v":0},{"$f":"IF(K444=$BY$249,J444,0)","v":0},{"$f":"IF(K444=$BZ$249,J444,0)","v":0},{"$f":"IF(K444=$CA$249,J444,0)","v":0},{"$f":"IF(K444=$CB$249,J444,0)","v":0},{"$f":"IF(K444=$CC$249,J444,0)","v":0},{"$f":"IF(K444=$CD$249,J444,0)","v":0},{"$f":"IF(K444=$CE$249,J444,0)","v":0},{"$f":"IF(K444=$CF$249,J444,0)","v":0},{"$f":"IF(K444=$CG$249,J444,0)","v":0},{"$f":"IF(K444=$CH$249,J444,0)","v":0},{"$f":"IF(K444=$CI$249,J444,0)","v":0},{"$f":"IF(K444=$CJ$249,J444,0)","v":0},{"$f":"IF(K444=$CK$249,J444,0)","v":0},{"$f":"IF(K444=$CL$249,J444,0)","v":0},{"$f":"IF(K444=$CM$249,J444,0)","v":0},{"$f":"IF(K444=$CN$249,J444,0)","v":0},{"$f":"IF(K444=$CO$249,J444,0)","v":0},null,"End Line"]
["",{"$f":"PL!A215","v":""},{"$f":"IF(PL!B215=\"\",\"\",PL!B215)","v":""},{"$f":"IF(PL!C215=\"\",\"\",PL!C215)","v":""},"00:00:00","00:00:00",0,{"$error":"#N/A"},null,{"$f":"IF(A445=\"x\",PL!D215,0)","v":0},"",0,0,{"$f":"IF(K445=$N$249,J445,0)","v":0},0,0,0,0,0,0,0,0,0,0,0,0,0,0,0,0,0,0,0,0,0,0,0,0,0,0,0,0,0,0,0,0,0,0,0,0,0,0,0,0,0,0,0,0,0,0,0,0,0,0,0,0,0,0,0,0,0,0,0,0,0,0,0,0,0,0,0,0,0,0,0,0,0,0,0,0,0,0,0,null,"End Line"]
["",{"$f":"PL!A216","v":""},{"$f":"IF(PL!B216=\"\",\"\",PL!B216)","v":""},{"$f":"IF(PL!C216=\"\",\"\",PL!C216)","v":""},"00:00:00","00:00:00",0,{"$error":"#N/A"},null,{"$f":"IF(A446=\"x\",PL!D216,0)","v":0},"",0,0,0,0,0,0,0,0,0,0,0,0,0,0,0,0,0,0,0,0,0,0,0,0,0,0,0,0,0,0,0,0,0,0,0,0,0,0,0,0,0,0,0,0,0,0,0,0,0,0,0,0,0,0,0,0,0,0,0,0,0,0,0,0,0,0,0,0,0,0,0,0,0,0,0,0,0,0,0,0,0,0,null,"End Line"]
["",{"$f":"PL!A217","v":""},{"$f":"IF(PL!B217=\"\",\"\",PL!B217)","v":""},{"$f":"IF(PL!C217=\"\",\"\",PL!C217)","v":""},"00:00:00","00:00:00",0,{"$error":"#N/A"},null,{"$f":"IF(A447=\"x\",PL!D217,0)","v":0},"",0,0,0,0,0,0,0,0,0,0,0,0,0,0,0,0,0,0,0,0,0,0,0,0,0,0,0,0,0,0,0,0,0,0,0,0,0,0,0,0,0,0,0,0,0,0,0,0,0,0,0,0,0,0,0,0,0,0,0,0,0,0,0,0,0,0,0,0,0,0,0,0,0,0,0,0,0,0,0,0,0,0,null,"End Line"]
["",{"$f":"PL!A218","v":""},{"$f":"IF(PL!B218=\"\",\"\",PL!B218)","v":""},{"$f":"IF(PL!C218=\"\",\"\",PL!C218)","v":""},"00:00:00","00:00:00",0,{"$error":"#N/A"},null,{"$f":"IF(A448=\"x\",PL!D218,0)","v":0},"",0,0,0,0,0,0,0,0,0,0,0,0,0,0,0,0,0,0,0,0,0,0,0,0,0,0,0,0,0,0,0,0,0,0,0,0,0,0,0,0,0,0,0,0,0,0,0,0,0,0,0,0,0,0,0,0,0,0,0,0,0,0,0,0,0,0,0,0,0,0,0,0,0,0,0,0,0,0,0,0,0,0,null,"End Line"]
["",{"$f":"PL!A219","v":""},{"$f":"IF(PL!B219=\"\",\"\",PL!B219)","v":""},{"$f":"IF(PL!C219=\"\",\"\",PL!C219)","v":""},"00:00:00","00:00:00",0,{"$error":"#N/A"},null,{"$f":"IF(A449=\"x\",PL!D219,0)","v":0},"",0,0,0,0,0,0,0,0,0,0,0,0,0,0,0,0,0,0,0,0,0,0,0,0,0,0,0,0,0,0,0,0,0,0,0,0,0,0,0,0,0,0,0,0,0,0,0,0,0,0,0,0,0,0,0,0,0,0,0,0,0,0,0,0,0,0,0,0,0,0,0,0,0,0,0,0,0,0,0,0,0,0,null,"End Line"]
["",{"$f":"PL!A220","v":""},{"$f":"IF(PL!B220=\"\",\"\",PL!B220)","v":""},{"$f":"IF(PL!C220=\"\",\"\",PL!C220)","v":""},"00:00:00","00:00:00",0,{"$error":"#N/A"},null,{"$f":"IF(A450=\"x\",PL!D220,0)","v":0},"",0,0,0,0,0,0,0,0,0,0,0,0,0,0,0,0,0,0,0,0,0,0,0,0,0,0,0,0,0,0,0,0,0,0,0,0,0,0,0,0,0,0,0,0,0,0,0,0,0,0,0,0,0,0,0,0,0,0,0,0,0,0,0,0,0,0,0,0,0,0,0,0,0,0,0,0,0,0,0,0,0,0,null,"End Line"]
["",{"$f":"PL!A221","v":""},{"$f":"IF(PL!B221=\"\",\"\",PL!B221)","v":""},{"$f":"IF(PL!C221=\"\",\"\",PL!C221)","v":""},"00:00:00","00:00:00",0,{"$error":"#N/A"},null,{"$f":"IF(A451=\"x\",PL!D221,0)","v":0},"",0,0,0,0,0,0,0,0,0,0,0,0,0,0,0,0,0,0,0,0,0,0,0,0,0,0,0,0,0,0,0,0,0,0,0,0,0,0,0,0,0,0,0,0,0,0,0,0,0,0,0,0,0,0,0,0,0,0,0,0,0,0,0,0,0,0,0,0,0,0,0,0,0,0,0,0,0,0,0,0,0,0,null,"End Line"]
["End_line","End_line","End_line","End_line",null,null,null,null,null,"End_line","Total Leave",{"$f":"SUM(L252:L451)","v":0},0,0,0,0,0,0,0,0,0,0,0,0,0,0,0,0,0,0,0,0,0,0,0,0,0,0,0,0,0,0,0,{"$f":"SUM(AR252:AR451)","v":0},0,0,0,0,0,0,0,0,0,0,0,0,0,0,0,0,0,0,0,0,0,0,0,0,0,0,0,0,0,0,0,{"$f":"SUM(BX252:BX451)","v":0},0,0,0,0,0,0,0,0,0,0,0,0,0,0,0,0,0,null,"End Line"]
[null,null,null,null,null,null,null,null,null,null,"Base Year",{"$f":"L248","v":"1996-A"},"1996-B","1997-A","1997-B","1998-A","1998-B","1999-A","1999-B","2000-A","2000-B","2001-A","2001-B","2002-A","2002-B","2003-A","2003-B","2004-A","2004-B","2005-A","2005-B","2006-A","2006-B","2007-A","2007-B","2008-A","2008-B","2009-A","2009-B","2010-A","2010-B","2011-A","2011-B",{"$f":"AR248","v":"2012-A"},"2012-B","2013-A","2013-B","2014-A","2014-B","2015-A","2015-B","2016-A","2016-B","2017-A","2017-B","2018-A","2018-B","2019-A","2019-B","2020-A","2020-B","2021-A","2021-B","2022-A","2022-B","2023-A","2023-B","2023-B","2023-B","2023-B","2023-B","2023-B","2023-B","2023-B","2023-B",{"$f":"BX248","v":"2023-B"},"2023-B","2023-B","2023-B","2023-B","2023-B","2023-B","2023-B","2023-B","2023-B","2023-B","2023-B","2023-B","2023-B","2023-B","2023-B","2023-B","2023-B",null,"End Line"]
[]
[]
[]
[]
[null,null,"Condition","A"]
[null,null,"PL_Limit_Deptt","Permanent","Temporary","Permanent","Temporary","Name of Department",null,null,null,{"$f":"PL!B9","v":"Others Deptt"},"Balance(A)","Condition"]
[null,null,"Judicial Deptt.",{"$f":"1/33","v":3.0303030303030304E-2},{"$f":"1/66","v":1.5151515151515152E-2},{"$f":"($L$463*D460)","v":5.5151515151515156},{"$f":"($L$463*E460)","v":2.7575757575757578},"Employee Status ",null,null,null,{"$f":"PL!C9","v":"Temporary"}]
[null,null,"R.A.C Deptt",{"$f":"1/8","v":0.125},{"$f":"1/16","v":6.25E-2},{"$f":"($L$463*D461)","v":22.75},{"$f":"($L$463*E461)","v":11.375},"Start Period",null,null,null,{"$f":"PL!D9","v":"1976-01-01"}]
[null,null,"Vacation Deptt",3,0,{"$f":"($L$463*D462)/365","v":1.4958904109589042},{"$f":"($L$463*E462)/365","v":0},"End Period",null,null,null,{"$f":"PL!E9","v":"1976-06-30"}]
[null,null,"Others Deptt",{"$f":"1/11","v":9.0909090909090912E-2},{"$f":"1/22","v":4.5454545454545456E-2},{"$f":"($L$463*D463)","v":16.545454545454547},{"$f":"($L$463*E463)","v":8.2727272727272734},"Days Gap",null,null,null,{"$f":"L462-L461+1","v":182}]
[null,null,null,"PL as per deptt. Status",null,{"$f":"INDEX($F$460:$F$463,MATCH($L$459,$C$460:$C$463,0))","v":16.545454545454547},{"$f":"INDEX($G$460:$G$463,MATCH($L$459,$C$460:$C$463,0))","v":8.2727272727272734}]
[null,null,null,"PL as per employee status",null,{"$f":"IF($L$460=\"Permanent\",F464,G464)","v":8.2727272727272734}]
[null,null,"Condition","B"]
[null,null,"PL_Limit_Deptt","Permanent","Temporary","Permanent","Temporary","Name of Department",null,null,null,{"$f":"PL!B10","v":"Others Deptt"}]
[null,null,"Judicial Deptt.",{"$f":"1/33","v":3.0303030303030304E-2},{"$f":"1/66","v":1.5151515151515152E-2},{"$f":"($L$471*D468)","v":3.0303030303030304E-2},{"$f":"($L$471*E468)","v":1.5151515151515152E-2},"Employee Status ",null,null,null,{"$f":"PL!C10","v":"Temporary"}]
[null,null,"R.A.C Deptt",{"$f":"1/8","v":0.125},{"$f":"1/16","v":6.25E-2},{"$f":"($L$471*D469)","v":0.125},{"$f":"($L$471*E469)","v":6.25E-2},"Start Period",null,null,null,{"$f":"PL!D10","v":"1976-01-01"}]
[null,null,"Vacation Deptt",3,0,{"$f":"($L$471*D470)/365","v":8.21917808219178E-3},{"$f":"($L$471*E470)/365","v":0},"End Period",null,null,null,{"$f":"PL!E10","v":"1976-01-01"}]
[null,null,"Others Deptt",{"$f":"1/11","v":9.0909090909090912E-2},{"$f":"1/22","v":4.5454545454545456E-2},{"$f":"($L$471*D471)","v":9.0909090909090912E-2},{"$f":"($L$471*E471)","v":4.5454545454545456E-2},"Days Gap",null,null,null,{"$f":"L470-L469+1","v":1}]
[null,null,null,"PL as per deptt. Status",null,{"$f":"INDEX($F$468:$F$471,MATCH($L$467,$C$460:$C$463,0))","v":9.0909090909090912E-2},{"$f":"INDEX($G$468:$G$471,MATCH($L$467,$C$460:$C$463,0))","v":4.5454545454545456E-2}]
[null,null,null,"PL as per employee status",null,{"$f":"IF($L$468=\"Permanent\",F472,G472)","v":4.5454545454545456E-2}]

{"sheet":"Leave Report","index":4,"n_rows":100,"n_cols":16,"rows_kept":100,"cut":false,"hidden":false,"merged":[[0,5,1,8],[4,2,4,3],[3,2,3,3],[87,0,87,1],[3,4,3,5],[3,7,3,8],[3,0,3,1],[4,4,4,11],[0,0,0,1],[2,0,2,2],[2,3,2,11],[88,0,88,11],[89,0,89,3],[90,0,90,2],[91,0,91,2],[92,0,92,2],[89,4,89,7],[89,8,89,11],[90,4,90,6],[91,4,91,6],[92,4,92,6],[90,8,90,11],[95,0,95,11],[96,2,98,3],[96,1,98,1],[96,0,98,0],[91,8,93,11],[94,8,94,11],[93,0,93,2],[94,0,94,2],[94,4,94,6],[93,4,93,6],[99,2,99,3],[96,4,98,4],[96,5,98,6],[99,5,99,6],[96,7,98,11],[99,7,99,11]]}
["Home",null,null,null,null,"Back to PL Calculation"]
[]
["Name of Employee & Designation",null,null,{"$f":"CONCATENATE(PL!C5,\", \",PL!G5)","v":"ABCD, AAO"}]
["Calculation period",null,"Max. leave in month",null,"Opening Balance",null,{"$f":"'Leave Table'!R10","v":0},"Max. Limit",null,null,null,300]
[{"$f":"'Leave Table'!D11","v":"1996-02-20"},{"$f":"'Leave Table'!B10","v":"2023-08-31"},{"$f":"PL!H15","v":"2.5  Days "},null,"Leave treatment in period",null,null,null,null,null,null,null,null,"Opening Balance",null,300]
["Start_Period","End_Period","Days Gap","Earned Leave in period","Leave Balance Year","Leave Taken in Year","Surrender Leave","Joining Time","Leave Adjut.","Closing Balance (A)","Maxi Leave Limit","Closing\n Balance ",null,"Start_Period","End_Period","Days Gap"]
[{"$f":"IF('Leave Table'!F12=\"YES\",'Leave Table'!G12,\"\")","v":"1996-02-20"},{"$f":"IF('Leave Table'!F12=\"YES\",'Leave Table'!H12,\"\")","v":"1996-06-30"},{"$f":"IF('Leave Table'!F12=\"YES\",'Leave Table'!L12,\"\")","v":132},{"$f":"IF('Leave Table'!F12=\"YES\",'Leave Table'!N12,\"\")","v":10},{"$f":"IF('Leave Table'!F12=\"YES\",'Leave Table'!O12,\"\")","v":"1996-A"},{"$f":"IF('Leave Table'!F12=\"YES\",'Leave Table'!P12,\"\")","v":0},{"$f":"IF('Leave Table'!F12=\"YES\",'Leave Table'!Q12,\"\")","v":0},{"$f":"IF('Leave Table'!F12=\"YES\",'Leave Table'!R12,\"\")","v":0},{"$f":"IF('Leave Table'!F12=\"YES\",'Leave Table'!S12,\"\")","v":0},{"$f":"IF('Leave Table'!F12=\"YES\",'Leave Table'!T12,\"\")","v":10},{"$f":"IF('Leave Table'!F12=\"YES\",'Leave Table'!U12,\"\")","v":240},{"$f":"IF('Leave Table'!F12=\"YES\",'Leave Table'!V12,\"\")","v":10},null,"2016-04-01","2016-04-15",{"$f":"IF(O7>0,1+O7-N7,\"\")","v":15}]
[{"$f":"IF('Leave Table'!F13=\"YES\",'Leave Table'!G13,\"\")","v":"1996-07-01"},{"$f":"IF('Leave Table'!F13=\"YES\",'Leave Table'!H13,\"\")","v":"1996-12-31"},{"$f":"IF('Leave Table'!F13=\"YES\",'Leave Table'!L13,\"\")","v":184},{"$f":"IF('Leave Table'!F13=\"YES\",'Leave Table'!N13,\"\")","v":15},{"$f":"IF('Leave Table'!F13=\"YES\",'Leave Table'!O13,\"\")","v":"1996-B"},{"$f":"IF('Leave Table'!F13=\"YES\",'Leave Table'!P13,\"\")","v":0},{"$f":"IF('Leave Table'!F13=\"YES\",'Leave Table'!Q13,\"\")","v":0},{"$f":"IF('Leave Table'!F13=\"YES\",'Leave Table'!R13,\"\")","v":0},{"$f":"IF('Leave Table'!F13=\"YES\",'Leave Table'!S13,\"\")","v":0},{"$f":"IF('Leave Table'!F13=\"YES\",'Leave Table'!T13,\"\")","v":25},{"$f":"IF('Leave Table'!F13=\"YES\",'Leave Table'!U13,\"\")","v":240},{"$f":"IF('Leave Table'!F13=\"YES\",'Leave Table'!V13,\"\")","v":25}]
[{"$f":"IF('Leave Table'!F14=\"YES\",'Leave Table'!G14,\"\")","v":"1997-01-01"},{"$f":"IF('Leave Table'!F14=\"YES\",'Leave Table'!H14,\"\")","v":"1997-06-30"},{"$f":"IF('Leave Table'!F14=\"YES\",'Leave Table'!L14,\"\")","v":181},{"$f":"IF('Leave Table'!F14=\"YES\",'Leave Table'!N14,\"\")","v":15},{"$f":"IF('Leave Table'!F14=\"YES\",'Leave Table'!O14,\"\")","v":"1997-A"},{"$f":"IF('Leave Table'!F14=\"YES\",'Leave Table'!P14,\"\")","v":0},{"$f":"IF('Leave Table'!F14=\"YES\",'Leave Table'!Q14,\"\")","v":0},{"$f":"IF('Leave Table'!F14=\"YES\",'Leave Table'!R14,\"\")","v":0},{"$f":"IF('Leave Table'!F14=\"YES\",'Leave Table'!S14,\"\")","v":0},{"$f":"IF('Leave Table'!F14=\"YES\",'Leave Table'!T14,\"\")","v":40},{"$f":"IF('Leave Table'!F14=\"YES\",'Leave Table'!U14,\"\")","v":240},{"$f":"IF('Leave Table'!F14=\"YES\",'Leave Table'!V14,\"\")","v":40}]
[{"$f":"IF('Leave Table'!F15=\"YES\",'Leave Table'!G15,\"\")","v":"1997-07-01"},{"$f":"IF('Leave Table'!F15=\"YES\",'Leave Table'!H15,\"\")","v":"1997-12-31"},{"$f":"IF('Leave Table'!F15=\"YES\",'Leave Table'!L15,\"\")","v":184},{"$f":"IF('Leave Table'!F15=\"YES\",'Leave Table'!N15,\"\")","v":15},{"$f":"IF('Leave Table'!F15=\"YES\",'Leave Table'!O15,\"\")","v":"1997-B"},{"$f":"IF('Leave Table'!F15=\"YES\",'Leave Table'!P15,\"\")","v":0},{"$f":"IF('Leave Table'!F15=\"YES\",'Leave Table'!Q15,\"\")","v":0},{"$f":"IF('Leave Table'!F15=\"YES\",'Leave Table'!R15,\"\")","v":0},{"$f":"IF('Leave Table'!F15=\"YES\",'Leave Table'!S15,\"\")","v":0},{"$f":"IF('Leave Table'!F15=\"YES\",'Leave Table'!T15,\"\")","v":55},{"$f":"IF('Leave Table'!F15=\"YES\",'Leave Table'!U15,\"\")","v":240},{"$f":"IF('Leave Table'!F15=\"YES\",'Leave Table'!V15,\"\")","v":55}]
[{"$f":"IF('Leave Table'!F16=\"YES\",'Leave Table'!G16,\"\")","v":"1998-01-01"},{"$f":"IF('Leave Table'!F16=\"YES\",'Leave Table'!H16,\"\")","v":"1998-06-30"},{"$f":"IF('Leave Table'!F16=\"YES\",'Leave Table'!L16,\"\")","v":181},{"$f":"IF('Leave Table'!F16=\"YES\",'Leave Table'!N16,\"\")","v":15},{"$f":"IF('Leave Table'!F16=\"YES\",'Leave Table'!O16,\"\")","v":"1998-A"},{"$f":"IF('Leave Table'!F16=\"YES\",'Leave Table'!P16,\"\")","v":0},{"$f":"IF('Leave Table'!F16=\"YES\",'Leave Table'!Q16,\"\")","v":0},{"$f":"IF('Leave Table'!F16=\"YES\",'Leave Table'!R16,\"\")","v":0},{"$f":"IF('Leave Table'!F16=\"YES\",'Leave Table'!S16,\"\")","v":0},{"$f":"IF('Leave Table'!F16=\"YES\",'Leave Table'!T16,\"\")","v":70},{"$f":"IF('Leave Table'!F16=\"YES\",'Leave Table'!U16,\"\")","v":300},{"$f":"IF('Leave Table'!F16=\"YES\",'Leave Table'!V16,\"\")","v":70}]
[{"$f":"IF('Leave Table'!F17=\"YES\",'Leave Table'!G17,\"\")","v":"1998-07-01"},{"$f":"IF('Leave Table'!F17=\"YES\",'Leave Table'!H17,\"\")","v":"1998-12-31"},{"$f":"IF('Leave Table'!F17=\"YES\",'Leave Table'!L17,\"\")","v":184},{"$f":"IF('Leave Table'!F17=\"YES\",'Leave Table'!N17,\"\")","v":15},{"$f":"IF('Leave Table'!F17=\"YES\",'Leave Table'!O17,\"\")","v":"1998-B"},{"$f":"IF('Leave Table'!F17=\"YES\",'Leave Table'!P17,\"\")","v":0},{"$f":"IF('Leave Table'!F17=\"YES\",'Leave Table'!Q17,\"\")","v":0},{"$f":"IF('Leave Table'!F17=\"YES\",'Leave Table'!R17,\"\")","v":0},{"$f":"IF('Leave Table'!F17=\"YES\",'Leave Table'!S17,\"\")","v":0},{"$f":"IF('Leave Table'!F17=\"YES\",'Leave Table'!T17,\"\")","v":85},{"$f":"IF('Leave Table'!F17=\"YES\",'Leave Table'!U17,\"\")","v":300},{"$f":"IF('Leave Table'!F17=\"YES\",'Leave Table'!V17,\"\")","v":85}]
[{"$f":"IF('Leave Table'!F18=\"YES\",'Leave Table'!G18,\"\")","v":"1999-01-01"},{"$f":"IF('Leave Table'!F18=\"YES\",'Leave Table'!H18,\"\")","v":"1999-06-30"},{"$f":"IF('Leave Table'!F18=\"YES\",'Leave Table'!L18,\"\")","v":181},{"$f":"IF('Leave Table'!F18=\"YES\",'Leave Table'!N18,\"\")","v":15},{"$f":"IF('Leave Table'!F18=\"YES\",'Leave Table'!O18,\"\")","v":"1999-A"},{"$f":"IF('Leave Table'!F18=\"YES\",'Leave Table'!P18,\"\")","v":0},{"$f":"IF('Leave Table'!F18=\"YES\",'Leave Table'!Q18,\"\")","v":0},{"$f":"IF('Leave Table'!F18=\"YES\",'Leave Table'!R18,\"\")","v":0},{"$f":"IF('Leave Table'!F18=\"YES\",'Leave Table'!S18,\"\")","v":0},{"$f":"IF('Leave Table'!F18=\"YES\",'Leave Table'!T18,\"\")","v":100},{"$f":"IF('Leave Table'!F18=\"YES\",'Leave Table'!U18,\"\")","v":300},{"$f":"IF('Leave Table'!F18=\"YES\",'Leave Table'!V18,\"\")","v":100}]
[{"$f":"IF('Leave Table'!F19=\"YES\",'Leave Table'!G19,\"\")","v":"1999-07-01"},{"$f":"IF('Leave Table'!F19=\"YES\",'Leave Table'!H19,\"\")","v":"1999-12-31"},{"$f":"IF('Leave Table'!F19=\"YES\",'Leave Table'!L19,\"\")","v":184},{"$f":"IF('Leave Table'!F19=\"YES\",'Leave Table'!N19,\"\")","v":15},{"$f":"IF('Leave Table'!F19=\"YES\",'Leave Table'!O19,\"\")","v":"1999-B"},{"$f":"IF('Leave Table'!F19=\"YES\",'Leave Table'!P19,\"\")","v":0},{"$f":"IF('Leave Table'!F19=\"YES\",'Leave Table'!Q19,\"\")","v":0},{"$f":"IF('Leave Table'!F19=\"YES\",'Leave Table'!R19,\"\")","v":0},{"$f":"IF('Leave Table'!F19=\"YES\",'Leave Table'!S19,\"\")","v":0},{"$f":"IF('Leave Table'!F19=\"YES\",'Leave Table'!T19,\"\")","v":115},{"$f":"IF('Leave Table'!F19=\"YES\",'Leave Table'!U19,\"\")","v":300},{"$f":"IF('Leave Table'!F19=\"YES\",'Leave Table'!V19,\"\")","v":115}]
[{"$f":"IF('Leave Table'!F20=\"YES\",'Leave Table'!G20,\"\")","v":"2000-01-01"},{"$f":"IF('Leave Table'!F20=\"YES\",'Leave Table'!H20,\"\")","v":"2000-06-30"},{"$f":"IF('Leave Table'!F20=\"YES\",'Leave Table'!L20,\"\")","v":182},{"$f":"IF('Leave Table'!F20=\"YES\",'Leave Table'!N20,\"\")","v":15},{"$f":"IF('Leave Table'!F20=\"YES\",'Leave Table'!O20,\"\")","v":"2000-A"},{"$f":"IF('Leave Table'!F20=\"YES\",'Leave Table'!P20,\"\")","v":0},{"$f":"IF('Leave Table'!F20=\"YES\",'Leave Table'!Q20,\"\")","v":0},{"$f":"IF('Leave Table'!F20=\"YES\",'Leave Table'!R20,\"\")","v":0},{"$f":"IF('Leave Table'!F20=\"YES\",'Leave Table'!S20,\"\")","v":0},{"$f":"IF('Leave Table'!F20=\"YES\",'Leave Table'!T20,\"\")","v":130},{"$f":"IF('Leave Table'!F20=\"YES\",'Leave Table'!U20,\"\")","v":300},{"$f":"IF('Leave Table'!F20=\"YES\",'Leave Table'!V20,\"\")","v":130}]
[{"$f":"IF('Leave Table'!F21=\"YES\",'Leave Table'!G21,\"\")","v":"2000-07-01"},{"$f":"IF('Leave Table'!F21=\"YES\",'Leave Table'!H21,\"\")","v":"2000-12-31"},{"$f":"IF('Leave Table'!F21=\"YES\",'Leave Table'!L21,\"\")","v":184},{"$f":"IF('Leave Table'!F21=\"YES\",'Leave Table'!N21,\"\")","v":15},{"$f":"IF('Leave Table'!F21=\"YES\",'Leave Table'!O21,\"\")","v":"2000-B"},{"$f":"IF('Leave Table'!F21=\"YES\",'Leave Table'!P21,\"\")","v":0},{"$f":"IF('Leave Table'!F21=\"YES\",'Leave Table'!Q21,\"\")","v":0},{"$f":"IF('Leave Table'!F21=\"YES\",'Leave Table'!R21,\"\")","v":0},{"$f":"IF('Leave Table'!F21=\"YES\",'Leave Table'!S21,\"\")","v":0},{"$f":"IF('Leave Table'!F21=\"YES\",'Leave Table'!T21,\"\")","v":145},{"$f":"IF('Leave Table'!F21=\"YES\",'Leave Table'!U21,\"\")","v":300},{"$f":"IF('Leave Table'!F21=\"YES\",'Leave Table'!V21,\"\")","v":145}]
[{"$f":"IF('Leave Table'!F22=\"YES\",'Leave Table'!G22,\"\")","v":"2001-01-01"},{"$f":"IF('Leave Table'!F22=\"YES\",'Leave Table'!H22,\"\")","v":"2001-06-30"},{"$f":"IF('Leave Table'!F22=\"YES\",'Leave Table'!L22,\"\")","v":181},{"$f":"IF('Leave Table'!F22=\"YES\",'Leave Table'!N22,\"\")","v":15},{"$f":"IF('Leave Table'!F22=\"YES\",'Leave Table'!O22,\"\")","v":"2001-A"},{"$f":"IF('Leave Table'!F22=\"YES\",'Leave Table'!P22,\"\")","v":0},{"$f":"IF('Leave Table'!F22=\"YES\",'Leave Table'!Q22,\"\")","v":0},{"$f":"IF('Leave Table'!F22=\"YES\",'Leave Table'!R22,\"\")","v":0},{"$f":"IF('Leave Table'!F22=\"YES\",'Leave Table'!S22,\"\")","v":0},{"$f":"IF('Leave Table'!F22=\"YES\",'Leave Table'!T22,\"\")","v":160},{"$f":"IF('Leave Table'!F22=\"YES\",'Leave Table'!U22,\"\")","v":300},{"$f":"IF('Leave Table'!F22=\"YES\",'Leave Table'!V22,\"\")","v":160}]
[{"$f":"IF('Leave Table'!F23=\"YES\",'Leave Table'!G23,\"\")","v":"2001-07-01"},{"$f":"IF('Leave Table'!F23=\"YES\",'Leave Table'!H23,\"\")","v":"2001-12-31"},{"$f":"IF('Leave Table'!F23=\"YES\",'Leave Table'!L23,\"\")","v":184},{"$f":"IF('Leave Table'!F23=\"YES\",'Leave Table'!N23,\"\")","v":15},{"$f":"IF('Leave Table'!F23=\"YES\",'Leave Table'!O23,\"\")","v":"2001-B"},{"$f":"IF('Leave Table'!F23=\"YES\",'Leave Table'!P23,\"\")","v":0},{"$f":"IF('Leave Table'!F23=\"YES\",'Leave Table'!Q23,\"\")","v":0},{"$f":"IF('Leave Table'!F23=\"YES\",'Leave Table'!R23,\"\")","v":0},{"$f":"IF('Leave Table'!F23=\"YES\",'Leave Table'!S23,\"\")","v":0},{"$f":"IF('Leave Table'!F23=\"YES\",'Leave Table'!T23,\"\")","v":175},{"$f":"IF('Leave Table'!F23=\"YES\",'Leave Table'!U23,\"\")","v":300},{"$f":"IF('Leave Table'!F23=\"YES\",'Leave Table'!V23,\"\")","v":175}]
[{"$f":"IF('Leave Table'!F24=\"YES\",'Leave Table'!G24,\"\")","v":"2002-01-01"},{"$f":"IF('Leave Table'!F24=\"YES\",'Leave Table'!H24,\"\")","v":"2002-06-30"},{"$f":"IF('Leave Table'!F24=\"YES\",'Leave Table'!L24,\"\")","v":181},{"$f":"IF('Leave Table'!F24=\"YES\",'Leave Table'!N24,\"\")","v":15},{"$f":"IF('Leave Table'!F24=\"YES\",'Leave Table'!O24,\"\")","v":"2002-A"},{"$f":"IF('Leave Table'!F24=\"YES\",'Leave Table'!P24,\"\")","v":0},{"$f":"IF('Leave Table'!F24=\"YES\",'Leave Table'!Q24,\"\")","v":0},{"$f":"IF('Leave Table'!F24=\"YES\",'Leave Table'!R24,\"\")","v":0},{"$f":"IF('Leave Table'!F24=\"YES\",'Leave Table'!S24,\"\")","v":0},{"$f":"IF('Leave Table'!F24=\"YES\",'Leave Table'!T24,\"\")","v":190},{"$f":"IF('Leave Table'!F24=\"YES\",'Leave Table'!U24,\"\")","v":300},{"$f":"IF('Leave Table'!F24=\"YES\",'Leave Table'!V24,\"\")","v":190}]
[{"$f":"IF('Leave Table'!F25=\"YES\",'Leave Table'!G25,\"\")","v":"2002-07-01"},{"$f":"IF('Leave Table'!F25=\"YES\",'Leave Table'!H25,\"\")","v":"2002-12-31"},{"$f":"IF('Leave Table'!F25=\"YES\",'Leave Table'!L25,\"\")","v":184},{"$f":"IF('Leave Table'!F25=\"YES\",'Leave Table'!N25,\"\")","v":15},{"$f":"IF('Leave Table'!F25=\"YES\",'Leave Table'!O25,\"\")","v":"2002-B"},{"$f":"IF('Leave Table'!F25=\"YES\",'Leave Table'!P25,\"\")","v":0},{"$f":"IF('Leave Table'!F25=\"YES\",'Leave Table'!Q25,\"\")","v":0},{"$f":"IF('Leave Table'!F25=\"YES\",'Leave Table'!R25,\"\")","v":0},{"$f":"IF('Leave Table'!F25=\"YES\",'Leave Table'!S25,\"\")","v":0},{"$f":"IF('Leave Table'!F25=\"YES\",'Leave Table'!T25,\"\")","v":205},{"$f":"IF('Leave Table'!F25=\"YES\",'Leave Table'!U25,\"\")","v":300},{"$f":"IF('Leave Table'!F25=\"YES\",'Leave Table'!V25,\"\")","v":205}]
[{"$f":"IF('Leave Table'!F26=\"YES\",'Leave Table'!G26,\"\")","v":"2003-01-01"},{"$f":"IF('Leave Table'!F26=\"YES\",'Leave Table'!H26,\"\")","v":"2003-06-30"},{"$f":"IF('Leave Table'!F26=\"YES\",'Leave Table'!L26,\"\")","v":181},{"$f":"IF('Leave Table'!F26=\"YES\",'Leave Table'!N26,\"\")","v":15},{"$f":"IF('Leave Table'!F26=\"YES\",'Leave Table'!O26,\"\")","v":"2003-A"},{"$f":"IF('Leave Table'!F26=\"YES\",'Leave Table'!P26,\"\")","v":0},{"$f":"IF('Leave Table'!F26=\"YES\",'Leave Table'!Q26,\"\")","v":0},{"$f":"IF('Leave Table'!F26=\"YES\",'Leave Table'!R26,\"\")","v":0},{"$f":"IF('Leave Table'!F26=\"YES\",'Leave Table'!S26,\"\")","v":0},{"$f":"IF('Leave Table'!F26=\"YES\",'Leave Table'!T26,\"\")","v":220},{"$f":"IF('Leave Table'!F26=\"YES\",'Leave Table'!U26,\"\")","v":300},{"$f":"IF('Leave Table'!F26=\"YES\",'Leave Table'!V26,\"\")","v":220}]
[{"$f":"IF('Leave Table'!F27=\"YES\",'Leave Table'!G27,\"\")","v":"2003-07-01"},{"$f":"IF('Leave Table'!F27=\"YES\",'Leave Table'!H27,\"\")","v":"2003-12-31"},{"$f":"IF('Leave Table'!F27=\"YES\",'Leave Table'!L27,\"\")","v":184},{"$f":"IF('Leave Table'!F27=\"YES\",'Leave Table'!N27,\"\")","v":15},{"$f":"IF('Leave Table'!F27=\"YES\",'Leave Table'!O27,\"\")","v":"2003-B"},{"$f":"IF('Leave Table'!F27=\"YES\",'Leave Table'!P27,\"\")","v":0},{"$f":"IF('Leave Table'!F27=\"YES\",'Leave Table'!Q27,\"\")","v":0},{"$f":"IF('Leave Table'!F27=\"YES\",'Leave Table'!R27,\"\")","v":0},{"$f":"IF('Leave Table'!F27=\"YES\",'Leave Table'!S27,\"\")","v":0},{"$f":"IF('Leave Table'!F27=\"YES\",'Leave Table'!T27,\"\")","v":235},{"$f":"IF('Leave Table'!F27=\"YES\",'Leave Table'!U27,\"\")","v":300},{"$f":"IF('Leave Table'!F27=\"YES\",'Leave Table'!V27,\"\")","v":235}]
[{"$f":"IF('Leave Table'!F28=\"YES\",'Leave Table'!G28,\"\")","v":"2004-01-01"},{"$f":"IF('Leave Table'!F28=\"YES\",'Leave Table'!H28,\"\")","v":"2004-06-30"},{"$f":"IF('Leave Table'!F28=\"YES\",'Leave Table'!L28,\"\")","v":182},{"$f":"IF('Leave Table'!F28=\"YES\",'Leave Table'!N28,\"\")","v":15},{"$f":"IF('Leave Table'!F28=\"YES\",'Leave Table'!O28,\"\")","v":"2004-A"},{"$f":"IF('Leave Table'!F28=\"YES\",'Leave Table'!P28,\"\")","v":0},{"$f":"IF('Leave Table'!F28=\"YES\",'Leave Table'!Q28,\"\")","v":0},{"$f":"IF('Leave Table'!F28=\"YES\",'Leave Table'!R28,\"\")","v":0},{"$f":"IF('Leave Table'!F28=\"YES\",'Leave Table'!S28,\"\")","v":0},{"$f":"IF('Leave Table'!F28=\"YES\",'Leave Table'!T28,\"\")","v":250},{"$f":"IF('Leave Table'!F28=\"YES\",'Leave Table'!U28,\"\")","v":300},{"$f":"IF('Leave Table'!F28=\"YES\",'Leave Table'!V28,\"\")","v":250}]
[{"$f":"IF('Leave Table'!F29=\"YES\",'Leave Table'!G29,\"\")","v":"2004-07-01"},{"$f":"IF('Leave Table'!F29=\"YES\",'Leave Table'!H29,\"\")","v":"2004-12-31"},{"$f":"IF('Leave Table'!F29=\"YES\",'Leave Table'!L29,\"\")","v":184},{"$f":"IF('Leave Table'!F29=\"YES\",'Leave Table'!N29,\"\")","v":15},{"$f":"IF('Leave Table'!F29=\"YES\",'Leave Table'!O29,\"\")","v":"2004-B"},{"$f":"IF('Leave Table'!F29=\"YES\",'Leave Table'!P29,\"\")","v":0},{"$f":"IF('Leave Table'!F29=\"YES\",'Leave Table'!Q29,\"\")","v":0},{"$f":"IF('Leave Table'!F29=\"YES\",'Leave Table'!R29,\"\")","v":0},{"$f":"IF('Leave Table'!F29=\"YES\",'Leave Table'!S29,\"\")","v":0},{"$f":"IF('Leave Table'!F29=\"YES\",'Leave Table'!T29,\"\")","v":265},{"$f":"IF('Leave Table'!F29=\"YES\",'Leave Table'!U29,\"\")","v":300},{"$f":"IF('Leave Table'!F29=\"YES\",'Leave Table'!V29,\"\")","v":265}]
[{"$f":"IF('Leave Table'!F30=\"YES\",'Leave Table'!G30,\"\")","v":"2005-01-01"},{"$f":"IF('Leave Table'!F30=\"YES\",'Leave Table'!H30,\"\")","v":"2005-06-30"},{"$f":"IF('Leave Table'!F30=\"YES\",'Leave Table'!L30,\"\")","v":181},{"$f":"IF('Leave Table'!F30=\"YES\",'Leave Table'!N30,\"\")","v":15},{"$f":"IF('Leave Table'!F30=\"YES\",'Leave Table'!O30,\"\")","v":"2005-A"},{"$f":"IF('Leave Table'!F30=\"YES\",'Leave Table'!P30,\"\")","v":0},{"$f":"IF('Leave Table'!F30=\"YES\",'Leave Table'!Q30,\"\")","v":0},{"$f":"IF('Leave Table'!F30=\"YES\",'Leave Table'!R30,\"\")","v":0},{"$f":"IF('Leave Table'!F30=\"YES\",'Leave Table'!S30,\"\")","v":0},{"$f":"IF('Leave Table'!F30=\"YES\",'Leave Table'!T30,\"\")","v":280},{"$f":"IF('Leave Table'!F30=\"YES\",'Leave Table'!U30,\"\")","v":300},{"$f":"IF('Leave Table'!F30=\"YES\",'Leave Table'!V30,\"\")","v":280}]
[{"$f":"IF('Leave Table'!F31=\"YES\",'Leave Table'!G31,\"\")","v":"2005-07-01"},{"$f":"IF('Leave Table'!F31=\"YES\",'Leave Table'!H31,\"\")","v":"2005-12-31"},{"$f":"IF('Leave Table'!F31=\"YES\",'Leave Table'!L31,\"\")","v":184},{"$f":"IF('Leave Table'!F31=\"YES\",'Leave Table'!N31,\"\")","v":15},{"$f":"IF('Leave Table'!F31=\"YES\",'Leave Table'!O31,\"\")","v":"2005-B"},{"$f":"IF('Leave Table'!F31=\"YES\",'Leave Table'!P31,\"\")","v":0},{"$f":"IF('Leave Table'!F31=\"YES\",'Leave Table'!Q31,\"\")","v":0},{"$f":"IF('Leave Table'!F31=\"YES\",'Leave Table'!R31,\"\")","v":0},{"$f":"IF('Leave Table'!F31=\"YES\",'Leave Table'!S31,\"\")","v":0},{"$f":"IF('Leave Table'!F31=\"YES\",'Leave Table'!T31,\"\")","v":295},{"$f":"IF('Leave Table'!F31=\"YES\",'Leave Table'!U31,\"\")","v":300},{"$f":"IF('Leave Table'!F31=\"YES\",'Leave Table'!V31,\"\")","v":295},null,null,{"$f":"IF(L26>0,\"YES\",\"\")","v":"YES"}]
[{"$f":"IF('Leave Table'!F32=\"YES\",'Leave Table'!G32,\"\")","v":"2006-01-01"},{"$f":"IF('Leave Table'!F32=\"YES\",'Leave Table'!H32,\"\")","v":"2006-06-30"},{"$f":"IF('Leave Table'!F32=\"YES\",'Leave Table'!L32,\"\")","v":181},{"$f":"IF('Leave Table'!F32=\"YES\",'Leave Table'!N32,\"\")","v":15},{"$f":"IF('Leave Table'!F32=\"YES\",'Leave Table'!O32,\"\")","v":"2006-A"},{"$f":"IF('Leave Table'!F32=\"YES\",'Leave Table'!P32,\"\")","v":0},{"$f":"IF('Leave Table'!F32=\"YES\",'Leave Table'!Q32,\"\")","v":0},{"$f":"IF('Leave Table'!F32=\"YES\",'Leave Table'!R32,\"\")","v":0},{"$f":"IF('Leave Table'!F32=\"YES\",'Leave Table'!S32,\"\")","v":0},{"$f":"IF('Leave Table'!F32=\"YES\",'Leave Table'!T32,\"\")","v":310},{"$f":"IF('Leave Table'!F32=\"YES\",'Leave Table'!U32,\"\")","v":300},{"$f":"IF('Leave Table'!F32=\"YES\",'Leave Table'!V32,\"\")","v":300}]
[{"$f":"IF('Leave Table'!F33=\"YES\",'Leave Table'!G33,\"\")","v":"2006-07-01"},{"$f":"IF('Leave Table'!F33=\"YES\",'Leave Table'!H33,\"\")","v":"2006-12-31"},{"$f":"IF('Leave Table'!F33=\"YES\",'Leave Table'!L33,\"\")","v":184},{"$f":"IF('Leave Table'!F33=\"YES\",'Leave Table'!N33,\"\")","v":15},{"$f":"IF('Leave Table'!F33=\"YES\",'Leave Table'!O33,\"\")","v":"2006-B"},{"$f":"IF('Leave Table'!F33=\"YES\",'Leave Table'!P33,\"\")","v":0},{"$f":"IF('Leave Table'!F33=\"YES\",'Leave Table'!Q33,\"\")","v":0},{"$f":"IF('Leave Table'!F33=\"YES\",'Leave Table'!R33,\"\")","v":0},{"$f":"IF('Leave Table'!F33=\"YES\",'Leave Table'!S33,\"\")","v":0},{"$f":"IF('Leave Table'!F33=\"YES\",'Leave Table'!T33,\"\")","v":300},{"$f":"IF('Leave Table'!F33=\"YES\",'Leave Table'!U33,\"\")","v":300},{"$f":"IF('Leave Table'!F33=\"YES\",'Leave Table'!V33,\"\")","v":300}]
[{"$f":"IF('Leave Table'!F34=\"YES\",'Leave Table'!G34,\"\")","v":"2007-01-01"},{"$f":"IF('Leave Table'!F34=\"YES\",'Leave Table'!H34,\"\")","v":"2007-06-30"},{"$f":"IF('Leave Table'!F34=\"YES\",'Leave Table'!L34,\"\")","v":181},{"$f":"IF('Leave Table'!F34=\"YES\",'Leave Table'!N34,\"\")","v":15},{"$f":"IF('Leave Table'!F34=\"YES\",'Leave Table'!O34,\"\")","v":"2007-A"},{"$f":"IF('Leave Table'!F34=\"YES\",'Leave Table'!P34,\"\")","v":0},{"$f":"IF('Leave Table'!F34=\"YES\",'Leave Table'!Q34,\"\")","v":0},{"$f":"IF('Leave Table'!F34=\"YES\",'Leave Table'!R34,\"\")","v":0},{"$f":"IF('Leave Table'!F34=\"YES\",'Leave Table'!S34,\"\")","v":0},{"$f":"IF('Leave Table'!F34=\"YES\",'Leave Table'!T34,\"\")","v":300},{"$f":"IF('Leave Table'!F34=\"YES\",'Leave Table'!U34,\"\")","v":300},{"$f":"IF('Leave Table'!F34=\"YES\",'Leave Table'!V34,\"\")","v":300}]
[{"$f":"IF('Leave Table'!F35=\"YES\",'Leave Table'!G35,\"\")","v":"2007-07-01"},{"$f":"IF('Leave Table'!F35=\"YES\",'Leave Table'!H35,\"\")","v":"2007-12-31"},{"$f":"IF('Leave Table'!F35=\"YES\",'Leave Table'!L35,\"\")","v":184},{"$f":"IF('Leave Table'!F35=\"YES\",'Leave Table'!N35,\"\")","v":15},{"$f":"IF('Leave Table'!F35=\"YES\",'Leave Table'!O35,\"\")","v":"2007-B"},{"$f":"IF('Leave Table'!F35=\"YES\",'Leave Table'!P35,\"\")","v":0},{"$f":"IF('Leave Table'!F35=\"YES\",'Leave Table'!Q35,\"\")","v":0},{"$f":"IF('Leave Table'!F35=\"YES\",'Leave Table'!R35,\"\")","v":0},{"$f":"IF('Leave Table'!F35=\"YES\",'Leave Table'!S35,\"\")","v":0},{"$f":"IF('Leave Table'!F35=\"YES\",'Leave Table'!T35,\"\")","v":300},{"$f":"IF('Leave Table'!F35=\"YES\",'Leave Table'!U35,\"\")","v":300},{"$f":"IF('Leave Table'!F35=\"YES\",'Leave Table'!V35,\"\")","v":300}]
[{"$f":"IF('Leave Table'!F36=\"YES\",'Leave Table'!G36,\"\")","v":"2008-01-01"},{"$f":"IF('Leave Table'!F36=\"YES\",'Leave Table'!H36,\"\")","v":"2008-06-30"},{"$f":"IF('Leave Table'!F36=\"YES\",'Leave Table'!L36,\"\")","v":182},{"$f":"IF('Leave Table'!F36=\"YES\",'Leave Table'!N36,\"\")","v":15},{"$f":"IF('Leave Table'!F36=\"YES\",'Leave Table'!O36,\"\")","v":"2008-A"},{"$f":"IF('Leave Table'!F36=\"YES\",'Leave Table'!P36,\"\")","v":0},{"$f":"IF('Leave Table'!F36=\"YES\",'Leave Table'!Q36,\"\")","v":0},{"$f":"IF('Leave Table'!F36=\"YES\",'Leave Table'!R36,\"\")","v":0},{"$f":"IF('Leave Table'!F36=\"YES\",'Leave Table'!S36,\"\")","v":0},{"$f":"IF('Leave Table'!F36=\"YES\",'Leave Table'!T36,\"\")","v":300},{"$f":"IF('Leave Table'!F36=\"YES\",'Leave Table'!U36,\"\")","v":300},{"$f":"IF('Leave Table'!F36=\"YES\",'Leave Table'!V36,\"\")","v":300}]
[{"$f":"IF('Leave Table'!F37=\"YES\",'Leave Table'!G37,\"\")","v":"2008-07-01"},{"$f":"IF('Leave Table'!F37=\"YES\",'Leave Table'!H37,\"\")","v":"2008-12-31"},{"$f":"IF('Leave Table'!F37=\"YES\",'Leave Table'!L37,\"\")","v":184},{"$f":"IF('Leave Table'!F37=\"YES\",'Leave Table'!N37,\"\")","v":15},{"$f":"IF('Leave Table'!F37=\"YES\",'Leave Table'!O37,\"\")","v":"2008-B"},{"$f":"IF('Leave Table'!F37=\"YES\",'Leave Table'!P37,\"\")","v":0},{"$f":"IF('Leave Table'!F37=\"YES\",'Leave Table'!Q37,\"\")","v":0},{"$f":"IF('Leave Table'!F37=\"YES\",'Leave Table'!R37,\"\")","v":0},{"$f":"IF('Leave Table'!F37=\"YES\",'Leave Table'!S37,\"\")","v":0},{"$f":"IF('Leave Table'!F37=\"YES\",'Leave Table'!T37,\"\")","v":300},{"$f":"IF('Leave Table'!F37=\"YES\",'Leave Table'!U37,\"\")","v":300},{"$f":"IF('Leave Table'!F37=\"YES\",'Leave Table'!V37,\"\")","v":300}]
[{"$f":"IF('Leave Table'!F38=\"YES\",'Leave Table'!G38,\"\")","v":"2009-01-01"},{"$f":"IF('Leave Table'!F38=\"YES\",'Leave Table'!H38,\"\")","v":"2009-06-30"},{"$f":"IF('Leave Table'!F38=\"YES\",'Leave Table'!L38,\"\")","v":181},{"$f":"IF('Leave Table'!F38=\"YES\",'Leave Table'!N38,\"\")","v":15},{"$f":"IF('Leave Table'!F38=\"YES\",'Leave Table'!O38,\"\")","v":"2009-A"},{"$f":"IF('Leave Table'!F38=\"YES\",'Leave Table'!P38,\"\")","v":0},{"$f":"IF('Leave Table'!F38=\"YES\",'Leave Table'!Q38,\"\")","v":0},{"$f":"IF('Leave Table'!F38=\"YES\",'Leave Table'!R38,\"\")","v":0},{"$f":"IF('Leave Table'!F38=\"YES\",'Leave Table'!S38,\"\")","v":0},{"$f":"IF('Leave Table'!F38=\"YES\",'Leave Table'!T38,\"\")","v":300},{"$f":"IF('Leave Table'!F38=\"YES\",'Leave Table'!U38,\"\")","v":300},{"$f":"IF('Leave Table'!F38=\"YES\",'Leave Table'!V38,0)","v":300},null,null,1]
[{"$f":"IF('Leave Table'!F39=\"YES\",'Leave Table'!G39,\"\")","v":"2009-07-01"},{"$f":"IF('Leave Table'!F39=\"YES\",'Leave Table'!H39,\"\")","v":"2009-12-31"},{"$f":"IF('Leave Table'!F39=\"YES\",'Leave Table'!L39,\"\")","v":184},{"$f":"IF('Leave Table'!F39=\"YES\",'Leave Table'!N39,\"\")","v":15},{"$f":"IF('Leave Table'!F39=\"YES\",'Leave Table'!O39,\"\")","v":"2009-B"},{"$f":"IF('Leave Table'!F39=\"YES\",'Leave Table'!P39,\"\")","v":0},{"$f":"IF('Leave Table'!F39=\"YES\",'Leave Table'!Q39,\"\")","v":0},{"$f":"IF('Leave Table'!F39=\"YES\",'Leave Table'!R39,\"\")","v":0},{"$f":"IF('Leave Table'!F39=\"YES\",'Leave Table'!S39,\"\")","v":0},{"$f":"IF('Leave Table'!F39=\"YES\",'Leave Table'!T39,\"\")","v":300},{"$f":"IF('Leave Table'!F39=\"YES\",'Leave Table'!U39,\"\")","v":300},{"$f":"IF('Leave Table'!F39=\"YES\",'Leave Table'!V39,\"\")","v":300},null,null,0]
[{"$f":"IF('Leave Table'!F40=\"YES\",'Leave Table'!G40,\"\")","v":"2010-01-01"},{"$f":"IF('Leave Table'!F40=\"YES\",'Leave Table'!H40,\"\")","v":"2010-06-30"},{"$f":"IF('Leave Table'!F40=\"YES\",'Leave Table'!L40,\"\")","v":181},{"$f":"IF('Leave Table'!F40=\"YES\",'Leave Table'!N40,\"\")","v":15},{"$f":"IF('Leave Table'!F40=\"YES\",'Leave Table'!O40,\"\")","v":"2010-A"},{"$f":"IF('Leave Table'!F40=\"YES\",'Leave Table'!P40,\"\")","v":0},{"$f":"IF('Leave Table'!F40=\"YES\",'Leave Table'!Q40,\"\")","v":0},{"$f":"IF('Leave Table'!F40=\"YES\",'Leave Table'!R40,\"\")","v":0},{"$f":"IF('Leave Table'!F40=\"YES\",'Leave Table'!S40,\"\")","v":0},{"$f":"IF('Leave Table'!F40=\"YES\",'Leave Table'!T40,\"\")","v":300},{"$f":"IF('Leave Table'!F40=\"YES\",'Leave Table'!U40,\"\")","v":300},{"$f":"IF('Leave Table'!F40=\"YES\",'Leave Table'!V40,\"\")","v":300}]
[{"$f":"IF('Leave Table'!F41=\"YES\",'Leave Table'!G41,\"\")","v":"2010-07-01"},{"$f":"IF('Leave Table'!F41=\"YES\",'Leave Table'!H41,\"\")","v":"2010-12-31"},{"$f":"IF('Leave Table'!F41=\"YES\",'Leave Table'!L41,\"\")","v":184},{"$f":"IF('Leave Table'!F41=\"YES\",'Leave Table'!N41,\"\")","v":15},{"$f":"IF('Leave Table'!F41=\"YES\",'Leave Table'!O41,\"\")","v":"2010-B"},{"$f":"IF('Leave Table'!F41=\"YES\",'Leave Table'!P41,\"\")","v":0},{"$f":"IF('Leave Table'!F41=\"YES\",'Leave Table'!Q41,\"\")","v":0},{"$f":"IF('Leave Table'!F41=\"YES\",'Leave Table'!R41,\"\")","v":0},{"$f":"IF('Leave Table'!F41=\"YES\",'Leave Table'!S41,\"\")","v":0},{"$f":"IF('Leave Table'!F41=\"YES\",'Leave Table'!T41,\"\")","v":300},{"$f":"IF('Leave Table'!F41=\"YES\",'Leave Table'!U41,\"\")","v":300},{"$f":"IF('Leave Table'!F41=\"YES\",'Leave Table'!V41,\"\")","v":300}]
[{"$f":"IF('Leave Table'!F42=\"YES\",'Leave Table'!G42,\"\")","v":"2011-01-01"},{"$f":"IF('Leave Table'!F42=\"YES\",'Leave Table'!H42,\"\")","v":"2011-06-30"},{"$f":"IF('Leave Table'!F42=\"YES\",'Leave Table'!L42,\"\")","v":181},{"$f":"IF('Leave Table'!F42=\"YES\",'Leave Table'!N42,\"\")","v":15},{"$f":"IF('Leave Table'!F42=\"YES\",'Leave Table'!O42,\"\")","v":"2011-A"},{"$f":"IF('Leave Table'!F42=\"YES\",'Leave Table'!P42,\"\")","v":0},{"$f":"IF('Leave Table'!F42=\"YES\",'Leave Table'!Q42,\"\")","v":0},{"$f":"IF('Leave Table'!F42=\"YES\",'Leave Table'!R42,\"\")","v":0},{"$f":"IF('Leave Table'!F42=\"YES\",'Leave Table'!S42,\"\")","v":0},{"$f":"IF('Leave Table'!F42=\"YES\",'Leave Table'!T42,\"\")","v":300},{"$f":"IF('Leave Table'!F42=\"YES\",'Leave Table'!U42,\"\")","v":300},{"$f":"IF('Leave Table'!F42=\"YES\",'Leave Table'!V42,\"\")","v":300}]
[{"$f":"IF('Leave Table'!F43=\"YES\",'Leave Table'!G43,\"\")","v":"2011-07-01"},{"$f":"IF('Leave Table'!F43=\"YES\",'Leave Table'!H43,\"\")","v":"2011-12-31"},{"$f":"IF('Leave Table'!F43=\"YES\",'Leave Table'!L43,\"\")","v":184},{"$f":"IF('Leave Table'!F43=\"YES\",'Leave Table'!N43,\"\")","v":15},{"$f":"IF('Leave Table'!F43=\"YES\",'Leave Table'!O43,\"\")","v":"2011-B"},{"$f":"IF('Leave Table'!F43=\"YES\",'Leave Table'!P43,\"\")","v":0},{"$f":"IF('Leave Table'!F43=\"YES\",'Leave Table'!Q43,\"\")","v":0},{"$f":"IF('Leave Table'!F43=\"YES\",'Leave Table'!R43,\"\")","v":0},{"$f":"IF('Leave Table'!F43=\"YES\",'Leave Table'!S43,\"\")","v":0},{"$f":"IF('Leave Table'!F43=\"YES\",'Leave Table'!T43,\"\")","v":300},{"$f":"IF('Leave Table'!F43=\"YES\",'Leave Table'!U43,\"\")","v":300},{"$f":"IF('Leave Table'!F43=\"YES\",'Leave Table'!V43,\"\")","v":300}]
[{"$f":"IF('Leave Table'!F44=\"YES\",'Leave Table'!G44,\"\")","v":"2012-01-01"},{"$f":"IF('Leave Table'!F44=\"YES\",'Leave Table'!H44,\"\")","v":"2012-06-30"},{"$f":"IF('Leave Table'!F44=\"YES\",'Leave Table'!L44,\"\")","v":182},{"$f":"IF('Leave Table'!F44=\"YES\",'Leave Table'!N44,\"\")","v":15},{"$f":"IF('Leave Table'!F44=\"YES\",'Leave Table'!O44,\"\")","v":"2012-A"},{"$f":"IF('Leave Table'!F44=\"YES\",'Leave Table'!P44,\"\")","v":0},{"$f":"IF('Leave Table'!F44=\"YES\",'Leave Table'!Q44,\"\")","v":0},{"$f":"IF('Leave Table'!F44=\"YES\",'Leave Table'!R44,\"\")","v":0},{"$f":"IF('Leave Table'!F44=\"YES\",'Leave Table'!S44,\"\")","v":0},{"$f":"IF('Leave Table'!F44=\"YES\",'Leave Table'!T44,\"\")","v":300},{"$f":"IF('Leave Table'!F44=\"YES\",'Leave Table'!U44,\"\")","v":300},{"$f":"IF('Leave Table'!F44=\"YES\",'Leave Table'!V44,\"\")","v":300}]
[{"$f":"IF('Leave Table'!F45=\"YES\",'Leave Table'!G45,\"\")","v":"2012-07-01"},{"$f":"IF('Leave Table'!F45=\"YES\",'Leave Table'!H45,\"\")","v":"2012-12-31"},{"$f":"IF('Leave Table'!F45=\"YES\",'Leave Table'!L45,\"\")","v":184},{"$f":"IF('Leave Table'!F45=\"YES\",'Leave Table'!N45,\"\")","v":15},{"$f":"IF('Leave Table'!F45=\"YES\",'Leave Table'!O45,\"\")","v":"2012-B"},{"$f":"IF('Leave Table'!F45=\"YES\",'Leave Table'!P45,\"\")","v":0},{"$f":"IF('Leave Table'!F45=\"YES\",'Leave Table'!Q45,\"\")","v":0},{"$f":"IF('Leave Table'!F45=\"YES\",'Leave Table'!R45,\"\")","v":0},{"$f":"IF('Leave Table'!F45=\"YES\",'Leave Table'!S45,\"\")","v":0},{"$f":"IF('Leave Table'!F45=\"YES\",'Leave Table'!T45,\"\")","v":300},{"$f":"IF('Leave Table'!F45=\"YES\",'Leave Table'!U45,\"\")","v":300},{"$f":"IF('Leave Table'!F45=\"YES\",'Leave Table'!V45,\"\")","v":300}]
[{"$f":"IF('Leave Table'!F46=\"YES\",'Leave Table'!G46,\"\")","v":"2013-01-01"},{"$f":"IF('Leave Table'!F46=\"YES\",'Leave Table'!H46,\"\")","v":"2013-06-30"},{"$f":"IF('Leave Table'!F46=\"YES\",'Leave Table'!L46,\"\")","v":181},{"$f":"IF('Leave Table'!F46=\"YES\",'Leave Table'!N46,\"\")","v":15},{"$f":"IF('Leave Table'!F46=\"YES\",'Leave Table'!O46,\"\")","v":"2013-A"},{"$f":"IF('Leave Table'!F46=\"YES\",'Leave Table'!P46,\"\")","v":0},{"$f":"IF('Leave Table'!F46=\"YES\",'Leave Table'!Q46,\"\")","v":0},{"$f":"IF('Leave Table'!F46=\"YES\",'Leave Table'!R46,\"\")","v":0},{"$f":"IF('Leave Table'!F46=\"YES\",'Leave Table'!S46,\"\")","v":0},{"$f":"IF('Leave Table'!F46=\"YES\",'Leave Table'!T46,\"\")","v":315},{"$f":"IF('Leave Table'!F46=\"YES\",'Leave Table'!U46,\"\")","v":315},{"$f":"IF('Leave Table'!F46=\"YES\",'Leave Table'!V46,\"\")","v":315}]
[{"$f":"IF('Leave Table'!F47=\"YES\",'Leave Table'!G47,\"\")","v":"2013-07-01"},{"$f":"IF('Leave Table'!F47=\"YES\",'Leave Table'!H47,\"\")","v":"2013-12-31"},{"$f":"IF('Leave Table'!F47=\"YES\",'Leave Table'!L47,\"\")","v":184},{"$f":"IF('Leave Table'!F47=\"YES\",'Leave Table'!N47,\"\")","v":15},{"$f":"IF('Leave Table'!F47=\"YES\",'Leave Table'!O47,\"\")","v":"2013-B"},{"$f":"IF('Leave Table'!F47=\"YES\",'Leave Table'!P47,\"\")","v":0},{"$f":"IF('Leave Table'!F47=\"YES\",'Leave Table'!Q47,\"\")","v":0},{"$f":"IF('Leave Table'!F47=\"YES\",'Leave Table'!R47,\"\")","v":0},{"$f":"IF('Leave Table'!F47=\"YES\",'Leave Table'!S47,\"\")","v":0},{"$f":"IF('Leave Table'!F47=\"YES\",'Leave Table'!T47,\"\")","v":315},{"$f":"IF('Leave Table'!F47=\"YES\",'Leave Table'!U47,\"\")","v":315},{"$f":"IF('Leave Table'!F47=\"YES\",'Leave Table'!V47,\"\")","v":315}]
[{"$f":"IF('Leave Table'!F48=\"YES\",'Leave Table'!G48,\"\")","v":"2014-01-01"},{"$f":"IF('Leave Table'!F48=\"YES\",'Leave Table'!H48,\"\")","v":"2014-06-30"},{"$f":"IF('Leave Table'!F48=\"YES\",'Leave Table'!L48,\"\")","v":181},{"$f":"IF('Leave Table'!F48=\"YES\",'Leave Table'!N48,\"\")","v":15},{"$f":"IF('Leave Table'!F48=\"YES\",'Leave Table'!O48,\"\")","v":"2014-A"},{"$f":"IF('Leave Table'!F48=\"YES\",'Leave Table'!P48,\"\")","v":0},{"$f":"IF('Leave Table'!F48=\"YES\",'Leave Table'!Q48,\"\")","v":0},{"$f":"IF('Leave Table'!F48=\"YES\",'Leave Table'!R48,\"\")","v":0},{"$f":"IF('Leave Table'!F48=\"YES\",'Leave Table'!S48,\"\")","v":0},{"$f":"IF('Leave Table'!F48=\"YES\",'Leave Table'!T48,\"\")","v":315},{"$f":"IF('Leave Table'!F48=\"YES\",'Leave Table'!U48,\"\")","v":315},{"$f":"IF('Leave Table'!F48=\"YES\",'Leave Table'!V48,\"\")","v":315}]
[{"$f":"IF('Leave Table'!F49=\"YES\",'Leave Table'!G49,\"\")","v":"2014-07-01"},{"$f":"IF('Leave Table'!F49=\"YES\",'Leave Table'!H49,\"\")","v":"2014-12-31"},{"$f":"IF('Leave Table'!F49=\"YES\",'Leave Table'!L49,\"\")","v":184},{"$f":"IF('Leave Table'!F49=\"YES\",'Leave Table'!N49,\"\")","v":15},{"$f":"IF('Leave Table'!F49=\"YES\",'Leave Table'!O49,\"\")","v":"2014-B"},{"$f":"IF('Leave Table'!F49=\"YES\",'Leave Table'!P49,\"\")","v":0},{"$f":"IF('Leave Table'!F49=\"YES\",'Leave Table'!Q49,\"\")","v":0},{"$f":"IF('Leave Table'!F49=\"YES\",'Leave Table'!R49,\"\")","v":0},{"$f":"IF('Leave Table'!F49=\"YES\",'Leave Table'!S49,\"\")","v":0},{"$f":"IF('Leave Table'!F49=\"YES\",'Leave Table'!T49,\"\")","v":315},{"$f":"IF('Leave Table'!F49=\"YES\",'Leave Table'!U49,\"\")","v":315},{"$f":"IF('Leave Table'!F49=\"YES\",'Leave Table'!V49,\"\")","v":315}]
[{"$f":"IF('Leave Table'!F50=\"YES\",'Leave Table'!G50,\"\")","v":"2015-01-01"},{"$f":"IF('Leave Table'!F50=\"YES\",'Leave Table'!H50,\"\")","v":"2015-06-30"},{"$f":"IF('Leave Table'!F50=\"YES\",'Leave Table'!L50,\"\")","v":181},{"$f":"IF('Leave Table'!F50=\"YES\",'Leave Table'!N50,\"\")","v":15},{"$f":"IF('Leave Table'!F50=\"YES\",'Leave Table'!O50,\"\")","v":"2015-A"},{"$f":"IF('Leave Table'!F50=\"YES\",'Leave Table'!P50,\"\")","v":0},{"$f":"IF('Leave Table'!F50=\"YES\",'Leave Table'!Q50,\"\")","v":0},{"$f":"IF('Leave Table'!F50=\"YES\",'Leave Table'!R50,\"\")","v":0},{"$f":"IF('Leave Table'!F50=\"YES\",'Leave Table'!S50,\"\")","v":0},{"$f":"IF('Leave Table'!F50=\"YES\",'Leave Table'!T50,\"\")","v":315},{"$f":"IF('Leave Table'!F50=\"YES\",'Leave Table'!U50,\"\")","v":315},{"$f":"IF('Leave Table'!F50=\"YES\",'Leave Table'!V50,\"\")","v":315}]
[{"$f":"IF('Leave Table'!F51=\"YES\",'Leave Table'!G51,\"\")","v":"2015-07-01"},{"$f":"IF('Leave Table'!F51=\"YES\",'Leave Table'!H51,\"\")","v":"2015-12-31"},{"$f":"IF('Leave Table'!F51=\"YES\",'Leave Table'!L51,\"\")","v":184},{"$f":"IF('Leave Table'!F51=\"YES\",'Leave Table'!N51,\"\")","v":15},{"$f":"IF('Leave Table'!F51=\"YES\",'Leave Table'!O51,\"\")","v":"2015-B"},{"$f":"IF('Leave Table'!F51=\"YES\",'Leave Table'!P51,\"\")","v":0},{"$f":"IF('Leave Table'!F51=\"YES\",'Leave Table'!Q51,\"\")","v":0},{"$f":"IF('Leave Table'!F51=\"YES\",'Leave Table'!R51,\"\")","v":0},{"$f":"IF('Leave Table'!F51=\"YES\",'Leave Table'!S51,\"\")","v":0},{"$f":"IF('Leave Table'!F51=\"YES\",'Leave Table'!T51,\"\")","v":315},{"$f":"IF('Leave Table'!F51=\"YES\",'Leave Table'!U51,\"\")","v":315},{"$f":"IF('Leave Table'!F51=\"YES\",'Leave Table'!V51,\"\")","v":315}]
[{"$f":"IF('Leave Table'!F52=\"YES\",'Leave Table'!G52,\"\")","v":"2016-01-01"},{"$f":"IF('Leave Table'!F52=\"YES\",'Leave Table'!H52,\"\")","v":"2016-06-30"},{"$f":"IF('Leave Table'!F52=\"YES\",'Leave Table'!L52,\"\")","v":182},{"$f":"IF('Leave Table'!F52=\"YES\",'Leave Table'!N52,\"\")","v":15},{"$f":"IF('Leave Table'!F52=\"YES\",'Leave Table'!O52,\"\")","v":"2016-A"},{"$f":"IF('Leave Table'!F52=\"YES\",'Leave Table'!P52,\"\")","v":0},{"$f":"IF('Leave Table'!F52=\"YES\",'Leave Table'!Q52,\"\")","v":0},{"$f":"IF('Leave Table'!F52=\"YES\",'Leave Table'!R52,\"\")","v":0},{"$f":"IF('Leave Table'!F52=\"YES\",'Leave Table'!S52,\"\")","v":0},{"$f":"IF('Leave Table'!F52=\"YES\",'Leave Table'!T52,\"\")","v":315},{"$f":"IF('Leave Table'!F52=\"YES\",'Leave Table'!U52,\"\")","v":315},{"$f":"IF('Leave Table'!F52=\"YES\",'Leave Table'!V52,\"\")","v":315}]
[{"$f":"IF('Leave Table'!F53=\"YES\",'Leave Table'!G53,\"\")","v":"2016-07-01"},{"$f":"IF('Leave Table'!F53=\"YES\",'Leave Table'!H53,\"\")","v":"2016-12-31"},{"$f":"IF('Leave Table'!F53=\"YES\",'Leave Table'!L53,\"\")","v":184},{"$f":"IF('Leave Table'!F53=\"YES\",'Leave Table'!N53,\"\")","v":15},{"$f":"IF('Leave Table'!F53=\"YES\",'Leave Table'!O53,\"\")","v":"2016-B"},{"$f":"IF('Leave Table'!F53=\"YES\",'Leave Table'!P53,\"\")","v":0},{"$f":"IF('Leave Table'!F53=\"YES\",'Leave Table'!Q53,\"\")","v":0},{"$f":"IF('Leave Table'!F53=\"YES\",'Leave Table'!R53,\"\")","v":0},{"$f":"IF('Leave Table'!F53=\"YES\",'Leave Table'!S53,\"\")","v":0},{"$f":"IF('Leave Table'!F53=\"YES\",'Leave Table'!T53,\"\")","v":315},{"$f":"IF('Leave Table'!F53=\"YES\",'Leave Table'!U53,\"\")","v":315},{"$f":"IF('Leave Table'!F53=\"YES\",'Leave Table'!V53,\"\")","v":315}]
[{"$f":"IF('Leave Table'!F54=\"YES\",'Leave Table'!G54,\"\")","v":"2017-01-01"},{"$f":"IF('Leave Table'!F54=\"YES\",'Leave Table'!H54,\"\")","v":"2017-06-30"},{"$f":"IF('Leave Table'!F54=\"YES\",'Leave Table'!L54,\"\")","v":181},{"$f":"IF('Leave Table'!F54=\"YES\",'Leave Table'!N54,\"\")","v":15},{"$f":"IF('Leave Table'!F54=\"YES\",'Leave Table'!O54,\"\")","v":"2017-A"},{"$f":"IF('Leave Table'!F54=\"YES\",'Leave Table'!P54,\"\")","v":0},{"$f":"IF('Leave Table'!F54=\"YES\",'Leave Table'!Q54,\"\")","v":0},{"$f":"IF('Leave Table'!F54=\"YES\",'Leave Table'!R54,\"\")","v":0},{"$f":"IF('Leave Table'!F54=\"YES\",'Leave Table'!S54,\"\")","v":0},{"$f":"IF('Leave Table'!F54=\"YES\",'Leave Table'!T54,\"\")","v":315},{"$f":"IF('Leave Table'!F54=\"YES\",'Leave Table'!U54,\"\")","v":315},{"$f":"IF('Leave Table'!F54=\"YES\",'Leave Table'!V54,\"\")","v":315}]
[{"$f":"IF('Leave Table'!F55=\"YES\",'Leave Table'!G55,\"\")","v":"2017-07-01"},{"$f":"IF('Leave Table'!F55=\"YES\",'Leave Table'!H55,\"\")","v":"2017-12-31"},{"$f":"IF('Leave Table'!F55=\"YES\",'Leave Table'!L55,\"\")","v":184},{"$f":"IF('Leave Table'!F55=\"YES\",'Leave Table'!N55,\"\")","v":15},{"$f":"IF('Leave Table'!F55=\"YES\",'Leave Table'!O55,\"\")","v":"2017-B"},{"$f":"IF('Leave Table'!F55=\"YES\",'Leave Table'!P55,\"\")","v":0},{"$f":"IF('Leave Table'!F55=\"YES\",'Leave Table'!Q55,\"\")","v":0},{"$f":"IF('Leave Table'!F55=\"YES\",'Leave Table'!R55,\"\")","v":0},{"$f":"IF('Leave Table'!F55=\"YES\",'Leave Table'!S55,\"\")","v":0},{"$f":"IF('Leave Table'!F55=\"YES\",'Leave Table'!T55,\"\")","v":315},{"$f":"IF('Leave Table'!F55=\"YES\",'Leave Table'!U55,\"\")","v":315},{"$f":"IF('Leave Table'!F55=\"YES\",'Leave Table'!V55,\"\")","v":315}]
[{"$f":"IF('Leave Table'!F56=\"YES\",'Leave Table'!G56,\"\")","v":"2018-01-01"},{"$f":"IF('Leave Table'!F56=\"YES\",'Leave Table'!H56,\"\")","v":"2018-06-30"},{"$f":"IF('Leave Table'!F56=\"YES\",'Leave Table'!L56,\"\")","v":181},{"$f":"IF('Leave Table'!F56=\"YES\",'Leave Table'!N56,\"\")","v":15},{"$f":"IF('Leave Table'!F56=\"YES\",'Leave Table'!O56,\"\")","v":"2018-A"},{"$f":"IF('Leave Table'!F56=\"YES\",'Leave Table'!P56,\"\")","v":0},{"$f":"IF('Leave Table'!F56=\"YES\",'Leave Table'!Q56,\"\")","v":0},{"$f":"IF('Leave Table'!F56=\"YES\",'Leave Table'!R56,\"\")","v":0},{"$f":"IF('Leave Table'!F56=\"YES\",'Leave Table'!S56,\"\")","v":0},{"$f":"IF('Leave Table'!F56=\"YES\",'Leave Table'!T56,\"\")","v":315},{"$f":"IF('Leave Table'!F56=\"YES\",'Leave Table'!U56,\"\")","v":315},{"$f":"IF('Leave Table'!F56=\"YES\",'Leave Table'!V56,\"\")","v":315}]
[{"$f":"IF('Leave Table'!F57=\"YES\",'Leave Table'!G57,\"\")","v":"2018-07-01"},{"$f":"IF('Leave Table'!F57=\"YES\",'Leave Table'!H57,\"\")","v":"2018-12-31"},{"$f":"IF('Leave Table'!F57=\"YES\",'Leave Table'!L57,\"\")","v":184},{"$f":"IF('Leave Table'!F57=\"YES\",'Leave Table'!N57,\"\")","v":15},{"$f":"IF('Leave Table'!F57=\"YES\",'Leave Table'!O57,\"\")","v":"2018-B"},{"$f":"IF('Leave Table'!F57=\"YES\",'Leave Table'!P57,\"\")","v":0},{"$f":"IF('Leave Table'!F57=\"YES\",'Leave Table'!Q57,\"\")","v":0},{"$f":"IF('Leave Table'!F57=\"YES\",'Leave Table'!R57,\"\")","v":0},{"$f":"IF('Leave Table'!F57=\"YES\",'Leave Table'!S57,\"\")","v":0},{"$f":"IF('Leave Table'!F57=\"YES\",'Leave Table'!T57,\"\")","v":315},{"$f":"IF('Leave Table'!F57=\"YES\",'Leave Table'!U57,\"\")","v":315},{"$f":"IF('Leave Table'!F57=\"YES\",'Leave Table'!V57,\"\")","v":315}]
[{"$f":"IF('Leave Table'!F58=\"YES\",'Leave Table'!G58,\"\")","v":"2019-01-01"},{"$f":"IF('Leave Table'!F58=\"YES\",'Leave Table'!H58,\"\")","v":"2019-06-30"},{"$f":"IF('Leave Table'!F58=\"YES\",'Leave Table'!L58,\"\")","v":181},{"$f":"IF('Leave Table'!F58=\"YES\",'Leave Table'!N58,\"\")","v":15},{"$f":"IF('Leave Table'!F58=\"YES\",'Leave Table'!O58,\"\")","v":"2019-A"},{"$f":"IF('Leave Table'!F58=\"YES\",'Leave Table'!P58,\"\")","v":0},{"$f":"IF('Leave Table'!F58=\"YES\",'Leave Table'!Q58,\"\")","v":0},{"$f":"IF('Leave Table'!F58=\"YES\",'Leave Table'!R58,\"\")","v":0},{"$f":"IF('Leave Table'!F58=\"YES\",'Leave Table'!S58,\"\")","v":0},{"$f":"IF('Leave Table'!F58=\"YES\",'Leave Table'!T58,\"\")","v":315},{"$f":"IF('Leave Table'!F58=\"YES\",'Leave Table'!U58,\"\")","v":315},{"$f":"IF('Leave Table'!F58=\"YES\",'Leave Table'!V58,\"\")","v":315}]
[{"$f":"IF('Leave Table'!F59=\"YES\",'Leave Table'!G59,\"\")","v":"2019-07-01"},{"$f":"IF('Leave Table'!F59=\"YES\",'Leave Table'!H59,\"\")","v":"2019-12-31"},{"$f":"IF('Leave Table'!F59=\"YES\",'Leave Table'!L59,\"\")","v":184},{"$f":"IF('Leave Table'!F59=\"YES\",'Leave Table'!N59,\"\")","v":15},{"$f":"IF('Leave Table'!F59=\"YES\",'Leave Table'!O59,\"\")","v":"2019-B"},{"$f":"IF('Leave Table'!F59=\"YES\",'Leave Table'!P59,\"\")","v":0},{"$f":"IF('Leave Table'!F59=\"YES\",'Leave Table'!Q59,\"\")","v":0},{"$f":"IF('Leave Table'!F59=\"YES\",'Leave Table'!R59,\"\")","v":0},{"$f":"IF('Leave Table'!F59=\"YES\",'Leave Table'!S59,\"\")","v":0},{"$f":"IF('Leave Table'!F59=\"YES\",'Leave Table'!T59,\"\")","v":315},{"$f":"IF('Leave Table'!F59=\"YES\",'Leave Table'!U59,\"\")","v":315},{"$f":"IF('Leave Table'!F59=\"YES\",'Leave Table'!V59,\"\")","v":315}]
[{"$f":"IF('Leave Table'!F60=\"YES\",'Leave Table'!G60,\"\")","v":"2020-01-01"},{"$f":"IF('Leave Table'!F60=\"YES\",'Leave Table'!H60,\"\")","v":"2020-06-30"},{"$f":"IF('Leave Table'!F60=\"YES\",'Leave Table'!L60,\"\")","v":182},{"$f":"IF('Leave Table'!F60=\"YES\",'Leave Table'!N60,\"\")","v":15},{"$f":"IF('Leave Table'!F60=\"YES\",'Leave Table'!O60,\"\")","v":"2020-A"},{"$f":"IF('Leave Table'!F60=\"YES\",'Leave Table'!P60,\"\")","v":0},{"$f":"IF('Leave Table'!F60=\"YES\",'Leave Table'!Q60,\"\")","v":0},{"$f":"IF('Leave Table'!F60=\"YES\",'Leave Table'!R60,\"\")","v":0},{"$f":"IF('Leave Table'!F60=\"YES\",'Leave Table'!S60,\"\")","v":0},{"$f":"IF('Leave Table'!F60=\"YES\",'Leave Table'!T60,\"\")","v":315},{"$f":"IF('Leave Table'!F60=\"YES\",'Leave Table'!U60,\"\")","v":315},{"$f":"IF('Leave Table'!F60=\"YES\",'Leave Table'!V60,\"\")","v":315}]
[{"$f":"IF('Leave Table'!F61=\"YES\",'Leave Table'!G61,\"\")","v":"2020-07-01"},{"$f":"IF('Leave Table'!F61=\"YES\",'Leave Table'!H61,\"\")","v":"2020-12-31"},{"$f":"IF('Leave Table'!F61=\"YES\",'Leave Table'!L61,\"\")","v":184},{"$f":"IF('Leave Table'!F61=\"YES\",'Leave Table'!N61,\"\")","v":15},{"$f":"IF('Leave Table'!F61=\"YES\",'Leave Table'!O61,\"\")","v":"2020-B"},{"$f":"IF('Leave Table'!F61=\"YES\",'Leave Table'!P61,\"\")","v":0},{"$f":"IF('Leave Table'!F61=\"YES\",'Leave Table'!Q61,\"\")","v":0},{"$f":"IF('Leave Table'!F61=\"YES\",'Leave Table'!R61,\"\")","v":0},{"$f":"IF('Leave Table'!F61=\"YES\",'Leave Table'!S61,\"\")","v":0},{"$f":"IF('Leave Table'!F61=\"YES\",'Leave Table'!T61,\"\")","v":315},{"$f":"IF('Leave Table'!F61=\"YES\",'Leave Table'!U61,\"\")","v":315},{"$f":"IF('Leave Table'!F61=\"YES\",'Leave Table'!V61,\"\")","v":315}]
[{"$f":"IF('Leave Table'!F62=\"YES\",'Leave Table'!G62,\"\")","v":"2021-01-01"},{"$f":"IF('Leave Table'!F62=\"YES\",'Leave Table'!H62,\"\")","v":"2021-06-30"},{"$f":"IF('Leave Table'!F62=\"YES\",'Leave Table'!L62,\"\")","v":181},{"$f":"IF('Leave Table'!F62=\"YES\",'Leave Table'!N62,\"\")","v":15},{"$f":"IF('Leave Table'!F62=\"YES\",'Leave Table'!O62,\"\")","v":"2021-A"},{"$f":"IF('Leave Table'!F62=\"YES\",'Leave Table'!P62,\"\")","v":0},{"$f":"IF('Leave Table'!F62=\"YES\",'Leave Table'!Q62,\"\")","v":0},{"$f":"IF('Leave Table'!F62=\"YES\",'Leave Table'!R62,\"\")","v":0},{"$f":"IF('Leave Table'!F62=\"YES\",'Leave Table'!S62,\"\")","v":0},{"$f":"IF('Leave Table'!F62=\"YES\",'Leave Table'!T62,\"\")","v":315},{"$f":"IF('Leave Table'!F62=\"YES\",'Leave Table'!U62,\"\")","v":315},{"$f":"IF('Leave Table'!F62=\"YES\",'Leave Table'!V62,\"\")","v":315}]
[{"$f":"IF('Leave Table'!F63=\"YES\",'Leave Table'!G63,\"\")","v":"2021-07-01"},{"$f":"IF('Leave Table'!F63=\"YES\",'Leave Table'!H63,\"\")","v":"2021-12-31"},{"$f":"IF('Leave Table'!F63=\"YES\",'Leave Table'!L63,\"\")","v":184},{"$f":"IF('Leave Table'!F63=\"YES\",'Leave Table'!N63,\"\")","v":15},{"$f":"IF('Leave Table'!F63=\"YES\",'Leave Table'!O63,\"\")","v":"2021-B"},{"$f":"IF('Leave Table'!F63=\"YES\",'Leave Table'!P63,\"\")","v":0},{"$f":"IF('Leave Table'!F63=\"YES\",'Leave Table'!Q63,\"\")","v":0},{"$f":"IF('Leave Table'!F63=\"YES\",'Leave Table'!R63,\"\")","v":0},{"$f":"IF('Leave Table'!F63=\"YES\",'Leave Table'!S63,\"\")","v":0},{"$f":"IF('Leave Table'!F63=\"YES\",'Leave Table'!T63,\"\")","v":315},{"$f":"IF('Leave Table'!F63=\"YES\",'Leave Table'!U63,\"\")","v":315},{"$f":"IF('Leave Table'!F63=\"YES\",'Leave Table'!V63,\"\")","v":315}]
[{"$f":"IF('Leave Table'!F64=\"YES\",'Leave Table'!G64,\"\")","v":"2022-01-01"},{"$f":"IF('Leave Table'!F64=\"YES\",'Leave Table'!H64,\"\")","v":"2022-06-30"},{"$f":"IF('Leave Table'!F64=\"YES\",'Leave Table'!L64,\"\")","v":181},{"$f":"IF('Leave Table'!F64=\"YES\",'Leave Table'!N64,\"\")","v":15},{"$f":"IF('Leave Table'!F64=\"YES\",'Leave Table'!O64,\"\")","v":"2022-A"},{"$f":"IF('Leave Table'!F64=\"YES\",'Leave Table'!P64,\"\")","v":0},{"$f":"IF('Leave Table'!F64=\"YES\",'Leave Table'!Q64,\"\")","v":0},{"$f":"IF('Leave Table'!F64=\"YES\",'Leave Table'!R64,\"\")","v":0},{"$f":"IF('Leave Table'!F64=\"YES\",'Leave Table'!S64,\"\")","v":0},{"$f":"IF('Leave Table'!F64=\"YES\",'Leave Table'!T64,\"\")","v":315},{"$f":"IF('Leave Table'!F64=\"YES\",'Leave Table'!U64,\"\")","v":315},{"$f":"IF('Leave Table'!F64=\"YES\",'Leave Table'!V64,\"\")","v":315}]
[{"$f":"IF('Leave Table'!F65=\"YES\",'Leave Table'!G65,\"\")","v":"2022-07-01"},{"$f":"IF('Leave Table'!F65=\"YES\",'Leave Table'!H65,\"\")","v":"2022-12-31"},{"$f":"IF('Leave Table'!F65=\"YES\",'Leave Table'!L65,\"\")","v":184},{"$f":"IF('Leave Table'!F65=\"YES\",'Leave Table'!N65,\"\")","v":15},{"$f":"IF('Leave Table'!F65=\"YES\",'Leave Table'!O65,\"\")","v":"2022-B"},{"$f":"IF('Leave Table'!F65=\"YES\",'Leave Table'!P65,\"\")","v":0},{"$f":"IF('Leave Table'!F65=\"YES\",'Leave Table'!Q65,\"\")","v":0},{"$f":"IF('Leave Table'!F65=\"YES\",'Leave Table'!R65,\"\")","v":0},{"$f":"IF('Leave Table'!F65=\"YES\",'Leave Table'!S65,\"\")","v":0},{"$f":"IF('Leave Table'!F65=\"YES\",'Leave Table'!T65,\"\")","v":315},{"$f":"IF('Leave Table'!F65=\"YES\",'Leave Table'!U65,\"\")","v":315},{"$f":"IF('Leave Table'!F65=\"YES\",'Leave Table'!V65,\"\")","v":315}]
[{"$f":"IF('Leave Table'!F66=\"YES\",'Leave Table'!G66,\"\")","v":"2023-01-01"},{"$f":"IF('Leave Table'!F66=\"YES\",'Leave Table'!H66,\"\")","v":"2023-06-30"},{"$f":"IF('Leave Table'!F66=\"YES\",'Leave Table'!L66,\"\")","v":181},{"$f":"IF('Leave Table'!F66=\"YES\",'Leave Table'!N66,\"\")","v":15},{"$f":"IF('Leave Table'!F66=\"YES\",'Leave Table'!O66,\"\")","v":"2023-A"},{"$f":"IF('Leave Table'!F66=\"YES\",'Leave Table'!P66,\"\")","v":0},{"$f":"IF('Leave Table'!F66=\"YES\",'Leave Table'!Q66,\"\")","v":0},{"$f":"IF('Leave Table'!F66=\"YES\",'Leave Table'!R66,\"\")","v":0},{"$f":"IF('Leave Table'!F66=\"YES\",'Leave Table'!S66,\"\")","v":0},{"$f":"IF('Leave Table'!F66=\"YES\",'Leave Table'!T66,\"\")","v":315},{"$f":"IF('Leave Table'!F66=\"YES\",'Leave Table'!U66,\"\")","v":315},{"$f":"IF('Leave Table'!F66=\"YES\",'Leave Table'!V66,\"\")","v":315}]
[{"$f":"IF('Leave Table'!F67=\"YES\",'Leave Table'!G67,\"\")","v":"2023-07-01"},{"$f":"IF('Leave Table'!F67=\"YES\",'Leave Table'!H67,\"\")","v":"2023-08-31"},{"$f":"IF('Leave Table'!F67=\"YES\",'Leave Table'!L67,\"\")","v":62},{"$f":"IF('Leave Table'!F67=\"YES\",'Leave Table'!N67,\"\")","v":5},{"$f":"IF('Leave Table'!F67=\"YES\",'Leave Table'!O67,\"\")","v":"2023-B"},{"$f":"IF('Leave Table'!F67=\"YES\",'Leave Table'!P67,\"\")","v":0},{"$f":"IF('Leave Table'!F67=\"YES\",'Leave Table'!Q67,\"\")","v":0},{"$f":"IF('Leave Table'!F67=\"YES\",'Leave Table'!R67,\"\")","v":0},{"$f":"IF('Leave Table'!F67=\"YES\",'Leave Table'!S67,\"\")","v":0},{"$f":"IF('Leave Table'!F67=\"YES\",'Leave Table'!T67,\"\")","v":315},{"$f":"IF('Leave Table'!F67=\"YES\",'Leave Table'!U67,\"\")","v":315},{"$f":"IF('Leave Table'!F67=\"YES\",'Leave Table'!V67,\"\")","v":315}]
[{"$f":"IF('Leave Table'!F68=\"YES\",'Leave Table'!G68,\"\")","v":""},{"$f":"IF('Leave Table'!F68=\"YES\",'Leave Table'!H68,\"\")","v":""},{"$f":"IF('Leave Table'!F68=\"YES\",'Leave Table'!L68,\"\")","v":""},{"$f":"IF('Leave Table'!F68=\"YES\",'Leave Table'!N68,\"\")","v":""},{"$f":"IF('Leave Table'!F68=\"YES\",'Leave Table'!O68,\"\")","v":""},{"$f":"IF('Leave Table'!F68=\"YES\",'Leave Table'!P68,\"\")","v":""},{"$f":"IF('Leave Table'!F68=\"YES\",'Leave Table'!Q68,\"\")","v":""},{"$f":"IF('Leave Table'!F68=\"YES\",'Leave Table'!R68,\"\")","v":""},{"$f":"IF('Leave Table'!F68=\"YES\",'Leave Table'!S68,\"\")","v":""},{"$f":"IF('Leave Table'!F68=\"YES\",'Leave Table'!T68,\"\")","v":""},{"$f":"IF('Leave Table'!F68=\"YES\",'Leave Table'!U68,\"\")","v":""},{"$f":"IF('Leave Table'!F68=\"YES\",'Leave Table'!V68,\"\")","v":""}]
[{"$f":"IF('Leave Table'!F69=\"YES\",'Leave Table'!G69,\"\")","v":""},{"$f":"IF('Leave Table'!F69=\"YES\",'Leave Table'!H69,\"\")","v":""},{"$f":"IF('Leave Table'!F69=\"YES\",'Leave Table'!L69,\"\")","v":""},{"$f":"IF('Leave Table'!F69=\"YES\",'Leave Table'!N69,\"\")","v":""},{"$f":"IF('Leave Table'!F69=\"YES\",'Leave Table'!O69,\"\")","v":""},{"$f":"IF('Leave Table'!F69=\"YES\",'Leave Table'!P69,\"\")","v":""},{"$f":"IF('Leave Table'!F69=\"YES\",'Leave Table'!Q69,\"\")","v":""},{"$f":"IF('Leave Table'!F69=\"YES\",'Leave Table'!R69,\"\")","v":""},{"$f":"IF('Leave Table'!F69=\"YES\",'Leave Table'!S69,\"\")","v":""},{"$f":"IF('Leave Table'!F69=\"YES\",'Leave Table'!T69,\"\")","v":""},{"$f":"IF('Leave Table'!F69=\"YES\",'Leave Table'!U69,\"\")","v":""},{"$f":"IF('Leave Table'!F69=\"YES\",'Leave Table'!V69,\"\")","v":""}]
[{"$f":"IF('Leave Table'!F70=\"YES\",'Leave Table'!G70,\"\")","v":""},{"$f":"IF('Leave Table'!F70=\"YES\",'Leave Table'!H70,\"\")","v":""},{"$f":"IF('Leave Table'!F70=\"YES\",'Leave Table'!L70,\"\")","v":""},{"$f":"IF('Leave Table'!F70=\"YES\",'Leave Table'!N70,\"\")","v":""},{"$f":"IF('Leave Table'!F70=\"YES\",'Leave Table'!O70,\"\")","v":""},{"$f":"IF('Leave Table'!F70=\"YES\",'Leave Table'!P70,\"\")","v":""},{"$f":"IF('Leave Table'!F70=\"YES\",'Leave Table'!Q70,\"\")","v":""},{"$f":"IF('Leave Table'!F70=\"YES\",'Leave Table'!R70,\"\")","v":""},{"$f":"IF('Leave Table'!F70=\"YES\",'Leave Table'!S70,\"\")","v":""},{"$f":"IF('Leave Table'!F70=\"YES\",'Leave Table'!T70,\"\")","v":""},{"$f":"IF('Leave Table'!F70=\"YES\",'Leave Table'!U70,\"\")","v":""},{"$f":"IF('Leave Table'!F70=\"YES\",'Leave Table'!V70,\"\")","v":""}]
[{"$f":"IF('Leave Table'!F71=\"YES\",'Leave Table'!G71,\"\")","v":""},{"$f":"IF('Leave Table'!F71=\"YES\",'Leave Table'!H71,\"\")","v":""},{"$f":"IF('Leave Table'!F71=\"YES\",'Leave Table'!L71,\"\")","v":""},{"$f":"IF('Leave Table'!F71=\"YES\",'Leave Table'!N71,\"\")","v":""},{"$f":"IF('Leave Table'!F71=\"YES\",'Leave Table'!O71,\"\")","v":""},{"$f":"IF('Leave Table'!F71=\"YES\",'Leave Table'!P71,\"\")","v":""},{"$f":"IF('Leave Table'!F71=\"YES\",'Leave Table'!Q71,\"\")","v":""},{"$f":"IF('Leave Table'!F71=\"YES\",'Leave Table'!R71,\"\")","v":""},{"$f":"IF('Leave Table'!F71=\"YES\",'Leave Table'!S71,\"\")","v":""},{"$f":"IF('Leave Table'!F71=\"YES\",'Leave Table'!T71,\"\")","v":""},{"$f":"IF('Leave Table'!F71=\"YES\",'Leave Table'!U71,\"\")","v":""},{"$f":"IF('Leave Table'!F71=\"YES\",'Leave Table'!V71,\"\")","v":""}]
[{"$f":"IF('Leave Table'!F72=\"YES\",'Leave Table'!G72,\"\")","v":""},{"$f":"IF('Leave Table'!F72=\"YES\",'Leave Table'!H72,\"\")","v":""},{"$f":"IF('Leave Table'!F72=\"YES\",'Leave Table'!L72,\"\")","v":""},{"$f":"IF('Leave Table'!F72=\"YES\",'Leave Table'!N72,\"\")","v":""},{"$f":"IF('Leave Table'!F72=\"YES\",'Leave Table'!O72,\"\")","v":""},{"$f":"IF('Leave Table'!F72=\"YES\",'Leave Table'!P72,\"\")","v":""},{"$f":"IF('Leave Table'!F72=\"YES\",'Leave Table'!Q72,\"\")","v":""},{"$f":"IF('Leave Table'!F72=\"YES\",'Leave Table'!R72,\"\")","v":""},{"$f":"IF('Leave Table'!F72=\"YES\",'Leave Table'!S72,\"\")","v":""},{"$f":"IF('Leave Table'!F72=\"YES\",'Leave Table'!T72,\"\")","v":""},{"$f":"IF('Leave Table'!F72=\"YES\",'Leave Table'!U72,\"\")","v":""},{"$f":"IF('Leave Table'!F72=\"YES\",'Leave Table'!V72,\"\")","v":""}]
[{"$f":"IF('Leave Table'!F73=\"YES\",'Leave Table'!G73,\"\")","v":""},{"$f":"IF('Leave Table'!F73=\"YES\",'Leave Table'!H73,\"\")","v":""},{"$f":"IF('Leave Table'!F73=\"YES\",'Leave Table'!L73,\"\")","v":""},{"$f":"IF('Leave Table'!F73=\"YES\",'Leave Table'!N73,\"\")","v":""},{"$f":"IF('Leave Table'!F73=\"YES\",'Leave Table'!O73,\"\")","v":""},{"$f":"IF('Leave Table'!F73=\"YES\",'Leave Table'!P73,\"\")","v":""},{"$f":"IF('Leave Table'!F73=\"YES\",'Leave Table'!Q73,\"\")","v":""},{"$f":"IF('Leave Table'!F73=\"YES\",'Leave Table'!R73,\"\")","v":""},{"$f":"IF('Leave Table'!F73=\"YES\",'Leave Table'!S73,\"\")","v":""},{"$f":"IF('Leave Table'!F73=\"YES\",'Leave Table'!T73,\"\")","v":""},{"$f":"IF('Leave Table'!F73=\"YES\",'Leave Table'!U73,\"\")","v":""},{"$f":"IF('Leave Table'!F73=\"YES\",'Leave Table'!V73,\"\")","v":""}]
[{"$f":"IF('Leave Table'!F74=\"YES\",'Leave Table'!G74,\"\")","v":""},{"$f":"IF('Leave Table'!F74=\"YES\",'Leave Table'!H74,\"\")","v":""},{"$f":"IF('Leave Table'!F74=\"YES\",'Leave Table'!L74,\"\")","v":""},{"$f":"IF('Leave Table'!F74=\"YES\",'Leave Table'!N74,\"\")","v":""},{"$f":"IF('Leave Table'!F74=\"YES\",'Leave Table'!O74,\"\")","v":""},{"$f":"IF('Leave Table'!F74=\"YES\",'Leave Table'!P74,\"\")","v":""},{"$f":"IF('Leave Table'!F74=\"YES\",'Leave Table'!Q74,\"\")","v":""},{"$f":"IF('Leave Table'!F74=\"YES\",'Leave Table'!R74,\"\")","v":""},{"$f":"IF('Leave Table'!F74=\"YES\",'Leave Table'!S74,\"\")","v":""},{"$f":"IF('Leave Table'!F74=\"YES\",'Leave Table'!T74,\"\")","v":""},{"$f":"IF('Leave Table'!F74=\"YES\",'Leave Table'!U74,\"\")","v":""},{"$f":"IF('Leave Table'!F74=\"YES\",'Leave Table'!V74,\"\")","v":""}]
[{"$f":"IF('Leave Table'!F75=\"YES\",'Leave Table'!G75,\"\")","v":""},{"$f":"IF('Leave Table'!F75=\"YES\",'Leave Table'!H75,\"\")","v":""},{"$f":"IF('Leave Table'!F75=\"YES\",'Leave Table'!L75,\"\")","v":""},{"$f":"IF('Leave Table'!F75=\"YES\",'Leave Table'!N75,\"\")","v":""},{"$f":"IF('Leave Table'!F75=\"YES\",'Leave Table'!O75,\"\")","v":""},{"$f":"IF('Leave Table'!F75=\"YES\",'Leave Table'!P75,\"\")","v":""},{"$f":"IF('Leave Table'!F75=\"YES\",'Leave Table'!Q75,\"\")","v":""},{"$f":"IF('Leave Table'!F75=\"YES\",'Leave Table'!R75,\"\")","v":""},{"$f":"IF('Leave Table'!F75=\"YES\",'Leave Table'!S75,\"\")","v":""},{"$f":"IF('Leave Table'!F75=\"YES\",'Leave Table'!T75,\"\")","v":""},{"$f":"IF('Leave Table'!F75=\"YES\",'Leave Table'!U75,\"\")","v":""},{"$f":"IF('Leave Table'!F75=\"YES\",'Leave Table'!V75,\"\")","v":""}]
[{"$f":"IF('Leave Table'!F76=\"YES\",'Leave Table'!G76,\"\")","v":""},{"$f":"IF('Leave Table'!F76=\"YES\",'Leave Table'!H76,\"\")","v":""},{"$f":"IF('Leave Table'!F76=\"YES\",'Leave Table'!L76,\"\")","v":""},{"$f":"IF('Leave Table'!F76=\"YES\",'Leave Table'!N76,\"\")","v":""},{"$f":"IF('Leave Table'!F76=\"YES\",'Leave Table'!O76,\"\")","v":""},{"$f":"IF('Leave Table'!F76=\"YES\",'Leave Table'!P76,\"\")","v":""},{"$f":"IF('Leave Table'!F76=\"YES\",'Leave Table'!Q76,\"\")","v":""},{"$f":"IF('Leave Table'!F76=\"YES\",'Leave Table'!R76,\"\")","v":""},{"$f":"IF('Leave Table'!F76=\"YES\",'Leave Table'!S76,\"\")","v":""},{"$f":"IF('Leave Table'!F76=\"YES\",'Leave Table'!T76,\"\")","v":""},{"$f":"IF('Leave Table'!F76=\"YES\",'Leave Table'!U76,\"\")","v":""},{"$f":"IF('Leave Table'!F76=\"YES\",'Leave Table'!V76,\"\")","v":""}]
[{"$f":"IF('Leave Table'!F77=\"YES\",'Leave Table'!G77,\"\")","v":""},{"$f":"IF('Leave Table'!F77=\"YES\",'Leave Table'!H77,\"\")","v":""},{"$f":"IF('Leave Table'!F77=\"YES\",'Leave Table'!L77,\"\")","v":""},{"$f":"IF('Leave Table'!F77=\"YES\",'Leave Table'!N77,\"\")","v":""},{"$f":"IF('Leave Table'!F77=\"YES\",'Leave Table'!O77,\"\")","v":""},{"$f":"IF('Leave Table'!F77=\"YES\",'Leave Table'!P77,\"\")","v":""},{"$f":"IF('Leave Table'!F77=\"YES\",'Leave Table'!Q77,\"\")","v":""},{"$f":"IF('Leave Table'!F77=\"YES\",'Leave Table'!R77,\"\")","v":""},{"$f":"IF('Leave Table'!F77=\"YES\",'Leave Table'!S77,\"\")","v":""},{"$f":"IF('Leave Table'!F77=\"YES\",'Leave Table'!T77,\"\")","v":""},{"$f":"IF('Leave Table'!F77=\"YES\",'Leave Table'!U77,\"\")","v":""},{"$f":"IF('Leave Table'!F77=\"YES\",'Leave Table'!V77,\"\")","v":""}]
[{"$f":"IF('Leave Table'!F78=\"YES\",'Leave Table'!G78,\"\")","v":""},{"$f":"IF('Leave Table'!F78=\"YES\",'Leave Table'!H78,\"\")","v":""},{"$f":"IF('Leave Table'!F78=\"YES\",'Leave Table'!L78,\"\")","v":""},{"$f":"IF('Leave Table'!F78=\"YES\",'Leave Table'!N78,\"\")","v":""},{"$f":"IF('Leave Table'!F78=\"YES\",'Leave Table'!O78,\"\")","v":""},{"$f":"IF('Leave Table'!F78=\"YES\",'Leave Table'!P78,\"\")","v":""},{"$f":"IF('Leave Table'!F78=\"YES\",'Leave Table'!Q78,\"\")","v":""},{"$f":"IF('Leave Table'!F78=\"YES\",'Leave Table'!R78,\"\")","v":""},{"$f":"IF('Leave Table'!F78=\"YES\",'Leave Table'!S78,\"\")","v":""},{"$f":"IF('Leave Table'!F78=\"YES\",'Leave Table'!T78,\"\")","v":""},{"$f":"IF('Leave Table'!F78=\"YES\",'Leave Table'!U78,\"\")","v":""},{"$f":"IF('Leave Table'!F78=\"YES\",'Leave Table'!V78,\"\")","v":""}]
[{"$f":"IF('Leave Table'!F79=\"YES\",'Leave Table'!G79,\"\")","v":""},{"$f":"IF('Leave Table'!F79=\"YES\",'Leave Table'!H79,\"\")","v":""},{"$f":"IF('Leave Table'!F79=\"YES\",'Leave Table'!L79,\"\")","v":""},{"$f":"IF('Leave Table'!F79=\"YES\",'Leave Table'!N79,\"\")","v":""},{"$f":"IF('Leave Table'!F79=\"YES\",'Leave Table'!O79,\"\")","v":""},{"$f":"IF('Leave Table'!F79=\"YES\",'Leave Table'!P79,\"\")","v":""},{"$f":"IF('Leave Table'!F79=\"YES\",'Leave Table'!Q79,\"\")","v":""},{"$f":"IF('Leave Table'!F79=\"YES\",'Leave Table'!R79,\"\")","v":""},{"$f":"IF('Leave Table'!F79=\"YES\",'Leave Table'!S79,\"\")","v":""},{"$f":"IF('Leave Table'!F79=\"YES\",'Leave Table'!T79,\"\")","v":""},{"$f":"IF('Leave Table'!F79=\"YES\",'Leave Table'!U79,\"\")","v":""},{"$f":"IF('Leave Table'!F79=\"YES\",'Leave Table'!V79,\"\")","v":""}]
[{"$f":"IF('Leave Table'!F80=\"YES\",'Leave Table'!G80,\"\")","v":""},{"$f":"IF('Leave Table'!F80=\"YES\",'Leave Table'!H80,\"\")","v":""},{"$f":"IF('Leave Table'!F80=\"YES\",'Leave Table'!L80,\"\")","v":""},{"$f":"IF('Leave Table'!F80=\"YES\",'Leave Table'!N80,\"\")","v":""},{"$f":"IF('Leave Table'!F80=\"YES\",'Leave Table'!O80,\"\")","v":""},{"$f":"IF('Leave Table'!F80=\"YES\",'Leave Table'!P80,\"\")","v":""},{"$f":"IF('Leave Table'!F80=\"YES\",'Leave Table'!Q80,\"\")","v":""},{"$f":"IF('Leave Table'!F80=\"YES\",'Leave Table'!R80,\"\")","v":""},{"$f":"IF('Leave Table'!F80=\"YES\",'Leave Table'!S80,\"\")","v":""},{"$f":"IF('Leave Table'!F80=\"YES\",'Leave Table'!T80,\"\")","v":""},{"$f":"IF('Leave Table'!F80=\"YES\",'Leave Table'!U80,\"\")","v":""},{"$f":"IF('Leave Table'!F80=\"YES\",'Leave Table'!V80,\"\")","v":""}]
[{"$f":"IF('Leave Table'!F81=\"YES\",'Leave Table'!G81,\"\")","v":""},{"$f":"IF('Leave Table'!F81=\"YES\",'Leave Table'!H81,\"\")","v":""},{"$f":"IF('Leave Table'!F81=\"YES\",'Leave Table'!L81,\"\")","v":""},{"$f":"IF('Leave Table'!F81=\"YES\",'Leave Table'!N81,\"\")","v":""},{"$f":"IF('Leave Table'!F81=\"YES\",'Leave Table'!O81,\"\")","v":""},{"$f":"IF('Leave Table'!F81=\"YES\",'Leave Table'!P81,\"\")","v":""},{"$f":"IF('Leave Table'!F81=\"YES\",'Leave Table'!Q81,\"\")","v":""},{"$f":"IF('Leave Table'!F81=\"YES\",'Leave Table'!R81,\"\")","v":""},{"$f":"IF('Leave Table'!F81=\"YES\",'Leave Table'!S81,\"\")","v":""},{"$f":"IF('Leave Table'!F81=\"YES\",'Leave Table'!T81,\"\")","v":""},{"$f":"IF('Leave Table'!F81=\"YES\",'Leave Table'!U81,\"\")","v":""},{"$f":"IF('Leave Table'!F81=\"YES\",'Leave Table'!V81,\"\")","v":""}]
[{"$f":"IF('Leave Table'!F82=\"YES\",'Leave Table'!G82,\"\")","v":""},{"$f":"IF('Leave Table'!F82=\"YES\",'Leave Table'!H82,\"\")","v":""},{"$f":"IF('Leave Table'!F82=\"YES\",'Leave Table'!L82,\"\")","v":""},{"$f":"IF('Leave Table'!F82=\"YES\",'Leave Table'!N82,\"\")","v":""},{"$f":"IF('Leave Table'!F82=\"YES\",'Leave Table'!O82,\"\")","v":""},{"$f":"IF('Leave Table'!F82=\"YES\",'Leave Table'!P82,\"\")","v":""},{"$f":"IF('Leave Table'!F82=\"YES\",'Leave Table'!Q82,\"\")","v":""},{"$f":"IF('Leave Table'!F82=\"YES\",'Leave Table'!R82,\"\")","v":""},{"$f":"IF('Leave Table'!F82=\"YES\",'Leave Table'!S82,\"\")","v":""},{"$f":"IF('Leave Table'!F82=\"YES\",'Leave Table'!T82,\"\")","v":""},{"$f":"IF('Leave Table'!F82=\"YES\",'Leave Table'!U82,\"\")","v":""},{"$f":"IF('Leave Table'!F82=\"YES\",'Leave Table'!V82,\"\")","v":""}]
[{"$f":"IF('Leave Table'!F83=\"YES\",'Leave Table'!G83,\"\")","v":""},{"$f":"IF('Leave Table'!F83=\"YES\",'Leave Table'!H83,\"\")","v":""},{"$f":"IF('Leave Table'!F83=\"YES\",'Leave Table'!L83,\"\")","v":""},{"$f":"IF('Leave Table'!F83=\"YES\",'Leave Table'!N83,\"\")","v":""},{"$f":"IF('Leave Table'!F83=\"YES\",'Leave Table'!O83,\"\")","v":""},{"$f":"IF('Leave Table'!F83=\"YES\",'Leave Table'!P83,\"\")","v":""},{"$f":"IF('Leave Table'!F83=\"YES\",'Leave Table'!Q83,\"\")","v":""},{"$f":"IF('Leave Table'!F83=\"YES\",'Leave Table'!R83,\"\")","v":""},{"$f":"IF('Leave Table'!F83=\"YES\",'Leave Table'!S83,\"\")","v":""},{"$f":"IF('Leave Table'!F83=\"YES\",'Leave Table'!T83,\"\")","v":""},{"$f":"IF('Leave Table'!F83=\"YES\",'Leave Table'!U83,\"\")","v":""},{"$f":"IF('Leave Table'!F83=\"YES\",'Leave Table'!V83,\"\")","v":""}]
[{"$f":"IF('Leave Table'!F84=\"YES\",'Leave Table'!G84,\"\")","v":""},{"$f":"IF('Leave Table'!F84=\"YES\",'Leave Table'!H84,\"\")","v":""},{"$f":"IF('Leave Table'!F84=\"YES\",'Leave Table'!L84,\"\")","v":""},{"$f":"IF('Leave Table'!F84=\"YES\",'Leave Table'!N84,\"\")","v":""},{"$f":"IF('Leave Table'!F84=\"YES\",'Leave Table'!O84,\"\")","v":""},{"$f":"IF('Leave Table'!F84=\"YES\",'Leave Table'!P84,\"\")","v":""},{"$f":"IF('Leave Table'!F84=\"YES\",'Leave Table'!Q84,\"\")","v":""},{"$f":"IF('Leave Table'!F84=\"YES\",'Leave Table'!R84,\"\")","v":""},{"$f":"IF('Leave Table'!F84=\"YES\",'Leave Table'!S84,\"\")","v":""},{"$f":"IF('Leave Table'!F84=\"YES\",'Leave Table'!T84,\"\")","v":""},{"$f":"IF('Leave Table'!F84=\"YES\",'Leave Table'!U84,\"\")","v":""},{"$f":"IF('Leave Table'!F84=\"YES\",'Leave Table'!V84,\"\")","v":""}]
[{"$f":"IF('Leave Table'!F85=\"YES\",'Leave Table'!G85,\"\")","v":""},{"$f":"IF('Leave Table'!F85=\"YES\",'Leave Table'!H85,\"\")","v":""},{"$f":"IF('Leave Table'!F85=\"YES\",'Leave Table'!L85,\"\")","v":""},{"$f":"IF('Leave Table'!F85=\"YES\",'Leave Table'!N85,\"\")","v":""},{"$f":"IF('Leave Table'!F85=\"YES\",'Leave Table'!O85,\"\")","v":""},{"$f":"IF('Leave Table'!F85=\"YES\",'Leave Table'!P85,\"\")","v":""},{"$f":"IF('Leave Table'!F85=\"YES\",'Leave Table'!Q85,\"\")","v":""},{"$f":"IF('Leave Table'!F85=\"YES\",'Leave Table'!R85,\"\")","v":""},{"$f":"IF('Leave Table'!F85=\"YES\",'Leave Table'!S85,\"\")","v":""},{"$f":"IF('Leave Table'!F85=\"YES\",'Leave Table'!T85,\"\")","v":""},{"$f":"IF('Leave Table'!F85=\"YES\",'Leave Table'!U85,\"\")","v":""},{"$f":"IF('Leave Table'!F85=\"YES\",'Leave Table'!V85,\"\")","v":""}]
[{"$f":"IF('Leave Table'!F86=\"YES\",'Leave Table'!G86,\"\")","v":""},{"$f":"IF('Leave Table'!F86=\"YES\",'Leave Table'!H86,\"\")","v":""},{"$f":"IF('Leave Table'!F86=\"YES\",'Leave Table'!L86,\"\")","v":""},{"$f":"IF('Leave Table'!F86=\"YES\",'Leave Table'!N86,\"\")","v":""},{"$f":"IF('Leave Table'!F86=\"YES\",'Leave Table'!O86,\"\")","v":""},{"$f":"IF('Leave Table'!F86=\"YES\",'Leave Table'!P86,\"\")","v":""},{"$f":"IF('Leave Table'!F86=\"YES\",'Leave Table'!Q86,\"\")","v":""},{"$f":"IF('Leave Table'!F86=\"YES\",'Leave Table'!R86,\"\")","v":""},{"$f":"IF('Leave Table'!F86=\"YES\",'Leave Table'!S86,\"\")","v":""},{"$f":"IF('Leave Table'!F86=\"YES\",'Leave Table'!T86,\"\")","v":""},{"$f":"IF('Leave Table'!F86=\"YES\",'Leave Table'!U86,\"\")","v":""},{"$f":"IF('Leave Table'!F86=\"YES\",'Leave Table'!V86,\"\")","v":""}]
[{"$f":"IF('Leave Table'!F87=\"YES\",'Leave Table'!G87,\"\")","v":""},{"$f":"IF('Leave Table'!F87=\"YES\",'Leave Table'!H87,\"\")","v":""},{"$f":"IF('Leave Table'!F87=\"YES\",'Leave Table'!L87,\"\")","v":""},{"$f":"IF('Leave Table'!F87=\"YES\",'Leave Table'!N87,\"\")","v":""},{"$f":"IF('Leave Table'!F87=\"YES\",'Leave Table'!O87,\"\")","v":""},{"$f":"IF('Leave Table'!F87=\"YES\",'Leave Table'!P87,\"\")","v":""},{"$f":"IF('Leave Table'!F87=\"YES\",'Leave Table'!Q87,\"\")","v":""},{"$f":"IF('Leave Table'!F87=\"YES\",'Leave Table'!R87,\"\")","v":""},{"$f":"IF('Leave Table'!F87=\"YES\",'Leave Table'!S87,\"\")","v":""},{"$f":"IF('Leave Table'!F87=\"YES\",'Leave Table'!T87,\"\")","v":""},{"$f":"IF('Leave Table'!F87=\"YES\",'Leave Table'!U87,\"\")","v":""},{"$f":"IF('Leave Table'!F87=\"YES\",'Leave Table'!V87,\"\")","v":""}]
[{"$f":"IF('Leave Table'!F88=\"YES\",'Leave Table'!G88,\"\")","v":""},{"$f":"IF('Leave Table'!F88=\"YES\",'Leave Table'!H88,\"\")","v":""},{"$f":"IF('Leave Table'!F88=\"YES\",'Leave Table'!L88,\"\")","v":""},{"$f":"IF('Leave Table'!F88=\"YES\",'Leave Table'!N88,\"\")","v":""},{"$f":"IF('Leave Table'!F88=\"YES\",'Leave Table'!O88,\"\")","v":""},{"$f":"IF('Leave Table'!F88=\"YES\",'Leave Table'!P88,\"\")","v":""},{"$f":"IF('Leave Table'!F88=\"YES\",'Leave Table'!Q88,\"\")","v":""},{"$f":"IF('Leave Table'!F88=\"YES\",'Leave Table'!R88,\"\")","v":""},{"$f":"IF('Leave Table'!F88=\"YES\",'Leave Table'!S88,\"\")","v":""},{"$f":"IF('Leave Table'!F88=\"YES\",'Leave Table'!T88,\"\")","v":""},{"$f":"IF('Leave Table'!F88=\"YES\",'Leave Table'!U88,\"\")","v":""},{"$f":"IF('Leave Table'!F88=\"YES\",'Leave Table'!V88,\"\")","v":""}]
[{"$f":"IF('Leave Table'!F89=\"YES\",'Leave Table'!G89,\"\")","v":""},{"$f":"IF('Leave Table'!F89=\"YES\",'Leave Table'!H89,\"\")","v":""},{"$f":"IF('Leave Table'!F89=\"YES\",'Leave Table'!L89,\"\")","v":""},{"$f":"IF('Leave Table'!F89=\"YES\",'Leave Table'!N89,\"\")","v":""},{"$f":"IF('Leave Table'!F89=\"YES\",'Leave Table'!O89,\"\")","v":""},{"$f":"IF('Leave Table'!F89=\"YES\",'Leave Table'!P89,\"\")","v":""},{"$f":"IF('Leave Table'!F89=\"YES\",'Leave Table'!Q89,\"\")","v":""},{"$f":"IF('Leave Table'!F89=\"YES\",'Leave Table'!R89,\"\")","v":""},{"$f":"IF('Leave Table'!F89=\"YES\",'Leave Table'!S89,\"\")","v":""},{"$f":"IF('Leave Table'!F89=\"YES\",'Leave Table'!T89,\"\")","v":""},{"$f":"IF('Leave Table'!F89=\"YES\",'Leave Table'!U89,\"\")","v":""},{"$f":"IF('Leave Table'!F89=\"YES\",'Leave Table'!V89,\"\")","v":""}]
[{"$f":"IF('Leave Table'!F90=\"YES\",'Leave Table'!G90,\"\")","v":""},{"$f":"IF('Leave Table'!F90=\"YES\",'Leave Table'!H90,\"\")","v":""},{"$f":"IF('Leave Table'!F90=\"YES\",'Leave Table'!L90,\"\")","v":""},{"$f":"IF('Leave Table'!F90=\"YES\",'Leave Table'!N90,\"\")","v":""},{"$f":"IF('Leave Table'!F90=\"YES\",'Leave Table'!O90,\"\")","v":""},{"$f":"IF('Leave Table'!F90=\"YES\",'Leave Table'!P90,\"\")","v":""},{"$f":"IF('Leave Table'!F90=\"YES\",'Leave Table'!Q90,\"\")","v":""},{"$f":"IF('Leave Table'!F90=\"YES\",'Leave Table'!R90,\"\")","v":""},{"$f":"IF('Leave Table'!F90=\"YES\",'Leave Table'!S90,\"\")","v":""},{"$f":"IF('Leave Table'!F90=\"YES\",'Leave Table'!T90,\"\")","v":""},{"$f":"IF('Leave Table'!F90=\"YES\",'Leave Table'!U90,\"\")","v":""},{"$f":"IF('Leave Table'!F90=\"YES\",'Leave Table'!V90,\"\")","v":""}]
[{"$f":"IF('Leave Table'!F91=\"YES\",'Leave Table'!G91,\"\")","v":""},{"$f":"IF('Leave Table'!F91=\"YES\",'Leave Table'!H91,\"\")","v":""},{"$f":"IF('Leave Table'!F91=\"YES\",'Leave Table'!L91,\"\")","v":""},{"$f":"IF('Leave Table'!F91=\"YES\",'Leave Table'!N91,\"\")","v":""},{"$f":"IF('Leave Table'!F91=\"YES\",'Leave Table'!O91,\"\")","v":""},{"$f":"IF('Leave Table'!F91=\"YES\",'Leave Table'!P91,\"\")","v":""},{"$f":"IF('Leave Table'!F91=\"YES\",'Leave Table'!Q91,\"\")","v":""},{"$f":"IF('Leave Table'!F91=\"YES\",'Leave Table'!R91,\"\")","v":""},{"$f":"IF('Leave Table'!F91=\"YES\",'Leave Table'!S91,\"\")","v":""},{"$f":"IF('Leave Table'!F91=\"YES\",'Leave Table'!T91,\"\")","v":""},{"$f":"IF('Leave Table'!F91=\"YES\",'Leave Table'!U91,\"\")","v":""},{"$f":"IF('Leave Table'!F91=\"YES\",'Leave Table'!V91,\"\")","v":""}]
[{"$f":"IF('Leave Table'!F92=\"YES\",'Leave Table'!G92,\"\")","v":""},{"$f":"IF('Leave Table'!F92=\"YES\",'Leave Table'!H92,\"\")","v":""},{"$f":"IF('Leave Table'!F92=\"YES\",'Leave Table'!L92,\"\")","v":""},{"$f":"IF('Leave Table'!F92=\"YES\",'Leave Table'!N92,\"\")","v":""},{"$f":"IF('Leave Table'!F92=\"YES\",'Leave Table'!O92,\"\")","v":""},{"$f":"IF('Leave Table'!F92=\"YES\",'Leave Table'!P92,\"\")","v":""},{"$f":"IF('Leave Table'!F92=\"YES\",'Leave Table'!Q92,\"\")","v":""},{"$f":"IF('Leave Table'!F92=\"YES\",'Leave Table'!R92,\"\")","v":""},{"$f":"IF('Leave Table'!F92=\"YES\",'Leave Table'!S92,\"\")","v":""},{"$f":"IF('Leave Table'!F92=\"YES\",'Leave Table'!T92,\"\")","v":""},{"$f":"IF('Leave Table'!F92=\"YES\",'Leave Table'!U92,\"\")","v":""},{"$f":"IF('Leave Table'!F92=\"YES\",'Leave Table'!V92,\"\")","v":""}]
["Total",null,"---",{"$f":"'Leave Table'!N95","v":825},"---",{"$f":"'Leave Table'!P95","v":0},{"$f":"'Leave Table'!Q95","v":0},{"$f":"'Leave Table'!R95","v":0},{"$f":"'Leave Table'!S95","v":0},"END_LINE","END_LINE",{"$f":"'Leave Table'!V95","v":315}]
["Summary"]
["Credit Privilege leave",null,null,null,"Debit  Privilege leave",null,null,null,"Net Balance"]
["Opening Balance (if any)",null,null,{"$f":"G4","v":0},"Leave taken",null,null,{"$f":"F88","v":0},{"$f":"D95-H95","v":825}]
["Earned Leave ",null,null,{"$f":"D88","v":825},"Surrendar Leave",null,null,{"$f":"G88","v":0},"Maximum Leave for Encashment purpose"]
["Joining Time",null,null,{"$f":"H88","v":0},"Leave Adjustment",null,null,{"$f":"IF(I88<0,ABS(I88),0)","v":0}]
["Leave Adjustment",null,null,{"$f":"IF(I88>0,I88,0)","v":0}]
["Total",null,null,{"$f":"+D91+D92+D93+D94","v":825},"Total",null,null,{"$f":"SUM(H91:H94)","v":0},{"$f":"IF(I91>=L4,L4,I91)","v":300}]
[{"$f":"CONCATENATE(\"Ascertainment of encashment of untilised Privilege Leave\",\" on  \",TEXT(B5,\"dd/mm/yyyy\"))","v":"Ascertainment of encashment of untilised Privilege Leave on  31/08/2023"}]
["Last Basic Pay","Pay Commission","Max Leave for encash.",null,"D.A. Rate","Pay admissible on the end of service plus Dearness Allowance",null,"Cash Payment"]
[]
[]
[66300,"V PAY",{"$f":"I95","v":300},null,{"$f":"DA!AL43","v":3.81},{"$f":"A100+ROUND(A100*E100,0)","v":318903},null,{"$f":"ROUND(F100*C100/30,0)","v":3189030}]

{"sheet":"Sheet1","index":5,"n_rows":41,"n_cols":9,"rows_kept":41,"cut":false,"hidden":true,"merged":[]}
["Option Explicit",null,null,null,null,null,null,null,"Option Explicit"]
["Private Sub Worksheet_Activate()",null,null,null,null,null,null,null," "]
["    Dim r As Range, c As Range",null,null,null,null,null,null,null,"Private Sub Worksheet_Activate()"]
["Set r = Range(\"a6:a86\")",null,null,null,null,null,null,null,"     "]
["Application.ScreenUpdating = False",null,null,null,null,null,null,null,"    Dim HiddenRow&, RowRange As Range, RowRangeValue&"]
["For Each c In r",null,null,null,null,null,null,null,"     "]
["    If Len(c.Text) = 0 Then",null,null,null,null,null,null,null,"     '*****************************"]
["        c.EntireRow.Hidden = True",null,null,null,null,null,null,null,"     '< Set the 1st & last rows to be hidden >"]
["    Else",null,null,null,null,null,null,null,"    Const FirstRow As Long = 6"]
["        c.EntireRow.Hidden = False",null,null,null,null,null,null,null,"    Const LastRow As Long = 230"]
["    End If",null,null,null,null,null,null,null,"     "]
["Next c",null,null,null,null,null,null,null,"     '< Set the columns that may contain data >"]
["Application.ScreenUpdating = True",null,null,null,null,null,null,null,"    Const FirstCol As String = \"B\""]
["End Sub",null,null,null,null,null,null,null,"    Const LastCol As String = \"BG\""]
[null,null,null,null,null,null,null,null,"     '*****************************"]
[null,null,null,null,null,null,null,null,"     "]
[null,null,null,null,null,null,null,null,"    ActiveWindow.DisplayZeros = False"]
[null,null,null,null,null,null,null,null,"    Application.ScreenUpdating = False"]
[null,null,null,null,null,null,null,null,"     "]
[null,null,null,null,null,null,null,null,"    For HiddenRow = FirstRow To LastRow"]
[null,null,null,null,null,null,null,null,"         "]
[null,null,null,null,null,null,null,null,"         '(we're using columns B to G here)"]
[null,null,null,null,null,null,null,null,"        Set RowRange = Range(FirstCol & HiddenRow & _"]
[null,null,null,null,null,null,null,null,"        \":\" & LastCol & HiddenRow)"]
[null,null,null,null,null,null,null,null,"         "]
[null,null,null,null,null,null,null,null,"         'sums the entries in cells in the RowRange"]
[null,null,null,null,null,null,null,null,"        RowRangeValue = Application.Sum(RowRange.Value)"]
[null,null,null,null,null,null,null,null,"         "]
[null,null,null,null,null,null,null,null,"        If RowRangeValue <> 0 Then"]
[null,null,null,null,null,null,null,null,"             'there's something in this row - don't hide"]
[null,null,null,null,null,null,null,null,"            Rows(HiddenRow).EntireRow.Hidden = False"]
[null,null,null,null,null,null,null,null,"        Else"]
[null,null,null,null,null,null,null,null,"             'there's nothing in this row yet - hide it"]
[null,null,null,null,null,null,null,null,"            Rows(HiddenRow).EntireRow.Hidden = True"]
[null,null,null,null,null,null,null,null,"        End If"]
[null,null,null,null,null,null,null,null,"         "]
[null,null,null,null,null,null,null,null,"    Next HiddenRow"]
[null,null,null,null,null,null,null,null,"     "]
[null,null,null,null,null,null,null,null,"    Application.ScreenUpdating = True"]
[null,null,null,null,null,null,null,null,"     "]
[null,null,null,null,null,null,null,null,"End Sub"]

{"sheet":"Sheet2","index":6,"n_rows":68,"n_cols":2,"rows_kept":68,"cut":false,"hidden":true,"merged":[]}
["1983-03-30","1983-04-23"]
["1983-09-13","1983-09-13"]
["1983-09-20","1983-09-21"]
["1984-03-29","1984-03-30"]
["1984-04-04","1984-04-05"]
["1984-04-16","1984-04-17"]
["1984-04-23","1984-04-28"]
["1984-08-06","1984-08-18"]
["1985-06-03","1985-06-07"]
["1985-11-23","1985-11-30"]
["1986-05-14","1986-05-31"]
["1988-04-01","1988-04-23"]
["1988-05-12","1988-05-13"]
["1988-05-24","1988-05-28"]
["1988-07-28","1988-07-31"]
["1988-11-24","1988-11-26"]
["1989-01-16","1989-02-23"]
["1990-04-26","1990-05-02"]
["1990-06-18","1990-07-03"]
["1991-03-21","1991-03-22"]
["1991-04-26","1991-05-23"]
["1991-09-03","1991-09-07"]
["1993-02-12","1993-02-13"]
["1994-02-07","1994-03-02"]
["1994-05-18","1994-05-24"]
["1994-08-30","1994-08-31"]
["1994-09-01","1994-09-09"]
["1994-10-24","1994-11-01"]
["1995-06-28","1995-07-12"]
["1995-10-18","1995-10-21"]
["1995-11-05","1995-11-10"]
["1995-12-16","1995-12-31"]
["1996-01-29","1996-02-19"]
["1997-06-19","1997-06-20"]
["1997-07-01","1997-07-03"]
["1997-09-09","1997-09-12"]
["1997-09-23","1997-09-24"]
["1998-09-05","1998-09-17"]
["1998-10-01","1998-10-16"]
["2001-05-23","2001-05-26"]
["2001-06-15","2001-06-19"]
["2002-06-03","2002-06-24"]
["2002-11-06","2002-11-08"]
["2002-12-30","2002-12-31"]
["2003-05-15","2003-05-21"]
["2003-05-14","2003-05-14"]
["2004-06-14","2004-06-18"]
["2005-11-14","2005-11-18"]
["2005-11-20","2005-11-20"]
["2006-06-12","2006-06-15"]
["2006-08-05","2006-08-11"]
["2010-07-26","2010-07-30"]
["2010-09-20","2010-09-24"]
["2012-06-25","2012-06-29"]
["2013-07-11","2013-08-16"]
["2013-09-13","2013-09-24"]
["2016-11-18","2016-11-18"]
["2016-12-08","2016-12-16"]
["2017-08-08","2017-08-25"]
["2018-09-25","2018-10-05"]
["2019-01-21","2019-01-25"]
["2020-08-17","2020-09-18"]
["2020-09-19","2020-10-01"]
["2020-10-02","2020-10-09"]
["2020-10-10","2020-10-26"]
["2020-11-18","2020-12-04"]
["2021-07-16","2021-07-16"]
["1986-11-17","1986-11-29"]

{"sheet":"Rules","index":7,"n_rows":53,"n_cols":13,"rows_kept":53,"cut":false,"hidden":false,"merged":[[8,3,8,6],[9,3,9,6],[10,3,10,6],[12,1,12,2],[12,3,12,6],[12,0,13,0],[11,0,11,6],[6,3,6,6],[0,5,0,6],[32,0,32,6],[17,3,17,4],[15,5,15,6],[16,5,16,6],[17,5,17,6],[5,0,5,6],[7,3,7,6],[13,3,13,4],[13,5,13,6],[14,3,14,4],[14,5,14,6],[6,0,6,1],[35,0,35,6],[1,0,4,6],[25,0,25,6],[26,1,26,4],[26,5,26,6],[30,0,31,6],[27,5,27,6],[28,5,28,6],[18,0,19,6],[20,0,20,6],[21,0,24,4],[21,5,24,6],[15,3,15,4],[16,3,16,4],[29,5,29,6],[27,1,29,4],[36,3,36,6],[37,3,38,6],[41,0,42,6],[39,3,40,6],[39,0,40,0],[39,1,40,1],[37,1,38,1],[37,2,38,2],[37,0,38,0],[39,2,40,2]]}
[null,null,null,null,null,"Home"]
["उपार्जित अवकाश के सामान्य नियम/उपनियम/दिशा-निर्देशों का उल्लेख यंहा पृथक से नहीं किया जा रहा है क्योंकि ये समस्त जानकारियां यूजर को सहज रूप से उपलब्ध है। अतः कुछ विशिष्ट संकलित जानकारियां जो सामान्य रूप से यूजर को उपलब्ध नहीं होती है, को प्रस्तुत किया जा रहा है ।       \n      "]
[]
[]
[]
["Maximum Privilege leave (PL) limit [see rule 91(1)(c )]"]
["Effective period",null,"Max_Limit","FD Notification"]
["1951-04-01","1991-12-31",180]
["1992-01-01","1997-12-31",240,"F.1(49)FD(Gr.2)82 dated 28-12-1991.",null,null,null,null,null,null,null,null,". $ "]
["1998-01-01","2012-12-31",300," F.1(5)FD/Rules/96 dated 02-04-1998 "]
["2013-01-01",null,315," F. 1(4)FD/Rules/98 date 12-12-1998"]
[]
["PL_Limit_Deptt"," * Upto 31-12-1982",null,"From 01-01-1983",null,null,null,"F.D. Notification No. F.I (49 ) FD (Gr.-2)/82, dated 22-2-1983 w.e.f.-l-l-1983"]
[null,"Permanent","Temporary","Annual Leave Limit",null,"Monthly Leave Limit"]
["Judicial Deptt.",3.0303030303030304E-2,{"$f":"1/66","v":1.5151515151515152E-2},12,null,{"$f":"D15/12","v":1}]
["R.A.C Deptt",{"$f":"1/8","v":0.125},{"$f":"1/16","v":6.25E-2},42,null,{"$f":"D16/12","v":3.5}]
["Vacation Deptt",3,0,15,null,{"$f":"D17/12","v":1.25}]
["Others Deptt",{"$f":"1/11","v":9.0909090909090912E-2},{"$f":"1/22","v":4.5454545454545456E-2},30,null,{"$f":"D18/12","v":2.5}]
[" *  period spent on duty  F1(21) G.A.A. (GR-2) 64 dated 08-05-1964 w.e.f. 01-01-1964 (sub. To condition & applicable rules time to time)"]
[]
["Treatment of fraction in the privilege leave at the time of retirement."]
["if there is any fraction of day in the unutilised privilege leave at the time of retirement then the fraction of a day below half should be ignored and fraction half or more should be reckoned as a day. ",null,null,null,null,"FD order No. F.l(12) FD/Rules/2005 dated 17-11-2014"]
[]
[]
[]
["Effect of Extra ordinary leave (EOL) on PL"]
["Deptt Categ.","Deduction of PL in one half",null,null,null," * Max. Limit"]
["R.A.C Deptt","one tenth of the period of extraordinary leave (i.e. One PL deduct for every 10 days)",null,null,null,21]
["Other Deptt",null,null,null,null,15]
["Judicial Deptt.",null,null,null,null,6]
[" * F.D. Notification No. F.l(49)FD(Gr.2)/82, dated 5-11-1984, w.e.f. 1-1-1985 (before this limit is 42 & 30 days)"]
[]
["Example showing the PL deduct (you may change the data)"]
["Deptt Categ.","From","To","Total","Max. Limit","Calculted","Allowed"]
["Others Deptt","2020-04-01","2020-04-14",{"$f":"IF(C35>0,1+C35-B35,\"\")","v":14},{"$f":"IF($A$35=\"Judicial Deptt.\",$F$30,IF($A$35=\"R.A.C Deptt\",$F$28,$F$29))","v":15},{"$f":"IF(D35>=10,ROUND(D35/10,0),0)","v":1},{"$f":"MIN(E35:F35)","v":1}]
["Surrendar of  Privilege Leave [see ruleRule 91(A)1]"]
["Block/Year","Max Days","Effective date","FD Notification"]
["* 2 Year Block",30,"1983-01-01","FD Notification No.F.1(49)FD(Gr.2)/82, dated 22.2.1983 "]
[]
["Each Financial Year",15,"2010-06-18",".F.1 (12)FD(Rules)/2005 dated 18-06-2010"]
[]
["* first block commencing from 1-4-1982, be granted leave encashment equal to the period of leave surrendered for permanent employee"]
[]
[]
[]
[]
[]
[]
[]
[]
[]
[]
["Amendment in Rajasthan Service Rules, 1951 [(change in rule Rule 91B(1)]"]

{"sheet":"Leave Print","index":8,"n_rows":49,"n_cols":14,"rows_kept":49,"cut":false,"hidden":false,"merged":[[6,0,7,0],[6,1,7,5],[8,1,8,5],[6,6,7,10],[8,6,8,7],[2,0,2,10],[3,0,3,10],[4,1,4,5],[4,6,4,10],[5,1,5,5],[5,6,5,10],[16,0,19,0],[16,1,19,5],[14,6,15,10],[16,6,19,10],[9,0,10,0],[9,1,10,5],[9,6,10,10],[11,0,13,0],[11,1,13,5],[11,6,12,10],[45,7,45,10],[46,0,48,0],[46,1,48,5],[47,6,47,10],[48,7,48,10],[0,9,0,10],[1,9,1,10],[0,11,1,11],[39,0,41,0],[39,1,40,10],[37,0,37,10],[20,0,21,0],[20,1,21,5],[22,0,26,0],[22,1,26,1],[20,6,21,10],[32,6,32,10],[33,7,33,10],[34,0,36,0],[34,1,36,5],[14,0,15,0],[31,0,33,0],[32,1,33,5],[38,0,38,10],[35,6,35,10],[36,7,36,10],[22,2,25,10],[26,3,26,10],[3,13,3,14],[44,6,44,10],[27,1,30,1],[27,2,30,10],[14,1,15,5],[6,13,7,15]]}
[null,null,null,null,null,null,null,null,null,"lkekU; la- 45",null,1]
[null,null,null,null,null,null,null,null,null,"th-,Q-,-vkj- 64"]
["राजस्थान सरकार"]
["राजस्थान सेवा नियमों के अन्तर्गत अवकाश के लिए आवेदन-पत्र का प्रपत्र",null,null,null,null,null,null,null,null,null,null,null,null,"Home"]
["1.","आवेदक का नाम",null,null,null,null,{"$f":"IF(INDEX(Data!$B$9:$B$58,MATCH('Leave Print'!$L$1,Data!$A$9:$A$58,0))=\"\",\"\",INDEX(Data!$B$9:$B$58,MATCH('Leave Print'!$L$1,Data!$A$9:$A$58,0)))","v":",chlhMh"}]
["2.","पद नाम",null,null,null,null,{"$f":"IF(INDEX(Data!$C$9:$C$58,MATCH('Leave Print'!$L$1,Data!$A$9:$A$58,0))=\"\",\"\",INDEX(Data!$C$9:$C$58,MATCH('Leave Print'!$L$1,Data!$A$9:$A$58,0)))","v":"lgk;d ys[kkf/kdkjh xzsM&izFke"}]
["3.","विभाग, कार्यालय और अनुभाग",null,null,null,null,{"$f":"IF(INDEX(Data!$F$9:$F$58,MATCH('Leave Print'!$L$1,Data!$A$9:$A$58,0))=\"\",\"\",INDEX(Data!$F$9:$F$58,MATCH('Leave Print'!$L$1,Data!$A$9:$A$58,0)))","v":",DlokbZtsM ]  "},null,null,null,null,null,null,"Input Data"]
[]
["4.","वेतन",null,null,null,null,{"$f":"IF(INDEX(Data!$G$9:$G$58,MATCH('Leave Print'!$L$1,Data!$A$9:$A$58,0))=\"\",\"\",INDEX(Data!$G$9:$G$58,MATCH('Leave Print'!$L$1,Data!$A$9:$A$58,0)))","v":77900}]
["5.","गृह किराया भत्ता, सवारी भत्ता, या वर्तमान पद पर प्राप्त अन्य क्षतिपूर्ति भत्ता",null,null,null,null,{"$f":"IF(INDEX(Data!$H$9:$H$208,MATCH('Leave Print'!$L$1,Data!$A$9:$A$208,0))=\"\",\"\",INDEX(Data!$H$9:$H$208,MATCH('Leave Print'!$L$1,Data!$A$9:$A$208,0)))","v":"नियमानुसार"}]
[]
["6.","आवेदित अवकाश का प्रकार और उसकी अवधि तथा दिनांक जिससे उसकी आवश्यकता है",null,null,null,null,{"$f":"IF(INDEX(Data!$N$9:$N$208,MATCH('Leave Print'!$L$1,Data!$A$9:$A$208,0))=\"\",\"\",INDEX(Data!$N$9:$N$208,MATCH('Leave Print'!$L$1,Data!$A$9:$A$208,0)))","v":"उपार्जित अवकाश  दिनांक  19/03/2021  से  26/03/2021  कुल   8  दिन"}]
[]
[]
["7.","रविवार तथा छुट्टियां यदि कोई हो, जिन्हें अवकाश के पहले या बाद में जोड़ने का प्रस्ताव हो",null,null,null,null,{"$f":"IF(INDEX(Data!$O$9:$O$252,MATCH('Leave Print'!$L$1,Data!$A$9:$A$252,0))=\"\",\"\",INDEX(Data!$O$9:$O$252,MATCH('Leave Print'!$L$1,Data!$A$9:$A$252,0)))","v":"नियमानुसार"}]
[]
["8.","अवकाश के लिए आवेदन देने के कारण (यदि वह मुख्यालय के बाहर जाने का विचार रखता हो तो विभिन्न स्थानों का पूरा पता, जहां उनके जाने की सम्भावना हो)",null,null,null,null,{"$f":"IF(INDEX(Data!$R$9:$R$252,MATCH('Leave Print'!$L$1,Data!$A$9:$A$252,0))=\"\",\"\",INDEX(Data!$R$9:$R$252,MATCH('Leave Print'!$L$1,Data!$A$9:$A$252,0)))","v":"fookg dk;ZØe esa tkus gsrq "}]
[]
[]
[]
["9.","गत अवकाश से लौटने का दिनांक तथा उस अवकाश का प्रकार तथा अवधि",null,null,null,null,{"$f":"IF(INDEX(Data!$U$9:$U$252,MATCH('Leave Print'!$L$1,Data!$A$9:$A$252,0))=\"\",\"\",INDEX(Data!$U$9:$U$252,MATCH('Leave Print'!$L$1,Data!$A$9:$A$252,0)))","v":"dk;kZy; vfHkys[kkuqlkj"}]
[]
["10."," (क) ","मैं, रियायती अन्तर्वर्तित (कम्यूटेड अवकाश) के दौरान प्राप्त किया गया अवकाश-वेतन और अर्द्ध-वेतन अवकाश जो उस दशा में जबकि राजस्थान सर्विस रूल्स के नियम 93 के उप-नियम (ग) के खण्ड (3) के नीचे दिये गये परन्तुक के प्रावघान, उक्त अवकाश की समाप्ति पर अथवा उसके दौरान, सर्विस से मेरे रिटायर होने की स्थिति में प्रयुक्त नहीं किये गये होते, अनुमत नहीं होता।             "]
[]
[]
[]
[null,null,"...............","की अवधि में अनुमत वेतन की अन्तर राशि वापस अदा करने का वचन देता हूं।"]
[null,"(ख)","मैं, \"अवकाश अनोपार्जित\"  जो कि उस दशा में जबकि राजस्थान सर्विस रूल्स के नियम 93 (ग), उक्त अवकाश की समाप्ति पर अथवा उसके दौरान, सर्विस से मेरे स्वेच्छानुगत रिटायर होने की स्थिति में प्रयुक्त नहीं किया गया होता, अनुमत नहीं होता, की अवधि में प्राप्त किये गये अवकाश-वेतन को वापस अदा करने का वचन देता हूं।"]
[]
[]
[]
["11.","अवकाश का पता:-"]
[null,{"$f":"IF(INDEX(Data!$W$9:$W$252,MATCH('Leave Print'!$L$1,Data!$A$9:$A$252,0))=\"\",\"\",INDEX(Data!$W$9:$W$252,MATCH('Leave Print'!$L$1,Data!$A$9:$A$252,0)))","v":"ihD;wvkj,l------ chdkusj"},null,null,null,null,"आवेदक के हस्ताक्षर (दिनांक सहित)"]
[null,null,null,null,null,null,"पद नाम",{"$f":"G6","v":"lgk;d ys[kkf/kdkjh xzsM&izFke"}]
["12.","नियंत्रण अधिकारी की अभ्युक्ति और/या सिफारिश"]
[null,null,null,null,null,null,"हस्ताक्षर (दिनांक सहित)"]
[null,null,null,null,null,null,"पद नाम"]
["अवकाश अनुमत होने सम्बन्धी प्रमाण-पत्र"]
["(राजपत्रित अधिकारियों के मामले में महालेखापाल द्वारा)"]
["13.","प्रमाणित किया जाता है कि ......................................................................नियमों के नियम............... के अधीन "]
[]
[null,null,null,null,null,null,"(अवकाश का प्रकार)"]
[null,"दिनांक ............................... से ................................... तक ..............  का अनुमत है।"]
[]
[null,null,null,null,null,null,"हस्ताक्षर (दिनांक सहित)"]
[null,null,null,null,null,null,"पद नाम"]
["14.","अवकाश की स्वीकृति देने वाले प्राधिकारी की आज्ञा।"]
[null,null,null,null,null,null,"हस्ताक्षर (दिनांक सहित)"]
[null,null,null,null,null,null,"पद नाम"]

{"sheet":"Blank Format","index":9,"n_rows":45,"n_cols":13,"rows_kept":45,"cut":false,"hidden":false,"merged":[[0,0,0,10],[1,0,1,10],[2,1,2,5],[2,6,2,10],[3,1,3,5],[3,6,3,10],[4,0,5,0],[4,1,5,5],[4,6,4,10],[5,6,5,10],[6,1,6,5],[6,6,6,10],[7,0,8,0],[7,1,8,5],[7,6,8,10],[9,0,11,0],[9,1,11,5],[9,6,9,10],[12,0,13,0],[12,1,13,5],[12,6,12,10],[14,0,16,0],[14,1,16,5],[14,6,14,10],[17,0,18,0],[17,1,18,5],[17,6,17,10],[19,0,22,0],[19,1,22,1],[19,2,22,10],[42,0,44,0],[42,1,44,5],[43,6,43,10],[44,7,44,10],[34,0,34,10],[0,12,0,13],[35,0,37,0],[35,1,36,10],[40,6,40,10],[41,7,41,10],[23,1,26,1],[23,2,26,10],[27,0,29,0],[28,1,29,5],[28,6,28,10],[29,7,29,10],[30,0,32,0],[30,1,32,5],[31,6,31,10],[32,7,32,10],[33,0,33,10]]}
["राजस्थान सरकार",null,null,null,null,null,null,null,null,null,null,null,"Home"]
["राजस्थान सेवा नियमों के अन्तर्गत अवकाश के लिए आवेदन-पत्र का प्रपत्र"]
["1.","आवेदक का नाम"]
["2.","पद नाम"]
["3.","विभाग, कार्यालय और अनुभाग"]
[]
["4.","वेतन"]
["5.","गृह किराया भत्ता, सवारी भत्ता, या वर्तमान पद पर प्राप्त अन्य क्षतिपूर्ति भत्ता"]
[]
["6.","आवेदित अवकाश का प्रकार और उसकी अवधि तथा दिनांक जिससे उसकी आवश्यकता है"]
[]
[]
["7.","रविवार तथा छुट्टियां यदि कोई हो, जिन्हें अवकाश के पहले या बाद में जोड़ने का प्रस्ताव हो"]
[]
["8.","अवकाश के लिए आवेदन देने के कारण (यदि वह मुख्यालय के बाहर जाने का विचार रखता हो तो विभिन्न स्थानों का पूरा पता, जहां उनके जाने की सम्भावना हो)"]
[]
[]
["9.","गत अवकाश से लौटने का दिनांक तथा उस अवकाश का प्रकार तथा अवधि"]
[]
["10."," (क) ","मैं, रियायती अन्तर्वर्तित (कम्यूटेड अवकाश) के दौरान प्राप्त किया गया अवकाश-वेतन और अर्द्ध-वेतन अवकाश जो उस दशा में जबकि राजस्थान सर्विस रूल्स के नियम 93 के उप-नियम (ग) के खण्ड (3) के नीचे दिये गये परन्तुक के प्रावघान, उक्त अवकाश की समाप्ति पर अथवा उसके दौरान, सर्विस से मेरे रिटायर होने की स्थिति में प्रयुक्त नहीं किये गये होते, अनुमत नहीं होता               की अवधि में अनुमत वेतन की अन्तर राशि वापस अदा करने का वचन देता हूं।"]
[]
[]
[]
[null,"(ख)","मैं, \"अवकाश अनोपार्जित\"  जो कि उस दशा में जबकि राजस्थान सर्विस रूल्स के नियम 93 (ग), उक्त अवकाश की समाप्ति पर अथवा उसके दौरान, सर्विस से मेरे स्वेच्छानुगत रिटायर होने की स्थिति में प्रयुक्त नहीं किया गया होता, अनुमत नहीं होता, की अवधि में प्राप्त किये गये अवकाश-वेतन को वापस अदा करने का वचन देता हूं।"]
[]
[]
[]
["11.","अवकाश का पता:-"]
[null,null,null,null,null,null,"आवेदक के हस्ताक्षर (दिनांक सहित)"]
[null,null,null,null,null,null,"पद नाम"]
["12.","नियंत्रण अधिकारी की अभ्युक्ति और/या सिफारिश"]
[null,null,null,null,null,null,"हस्ताक्षर (दिनांक सहित)"]
[null,null,null,null,null,null,"पद नाम"]
["अवकाश अनुमत होने सम्बन्धी प्रमाण-पत्र"]
["(राजपत्रित अधिकारियों के मामले में महालेखापाल द्वारा)"]
["13.","प्रमाणित किया जाता है कि ......................................................................नियमों के नियम............... के अधीन "]
[]
[null,null,null,null,null,null,"(अवकाश का प्रकार)"]
[null,"दिनांक ............................... से ................................... तक ..............  का अनुमत है।"]
[]
[null,null,null,null,null,null,"हस्ताक्षर (दिनांक सहित)"]
[null,null,null,null,null,null,"पद नाम"]
["14.","अवकाश की स्वीकृति देने वाले प्राधिकारी की आज्ञा।"]
[null,null,null,null,null,null,"हस्ताक्षर (दिनांक सहित)"]
[null,null,null,null,null,null,"पद नाम"]

{"sheet":"Data","index":10,"n_rows":209,"n_cols":28,"rows_kept":209,"cut":false,"hidden":false,"merged":[[54,7,54,8],[55,7,55,8],[56,7,56,8],[57,7,57,8],[49,7,49,8],[50,7,50,8],[51,7,51,8],[52,7,52,8],[53,7,53,8],[44,7,44,8],[45,7,45,8],[46,7,46,8],[47,7,47,8],[48,7,48,8],[39,7,39,8],[40,7,40,8],[41,7,41,8],[42,7,42,8],[43,7,43,8],[34,7,34,8],[35,7,35,8],[36,7,36,8],[37,7,37,8],[38,7,38,8],[29,7,29,8],[30,7,30,8],[31,7,31,8],[32,7,32,8],[33,7,33,8],[24,7,24,8],[25,7,25,8],[26,7,26,8],[27,7,27,8],[28,7,28,8],[19,7,19,8],[20,7,20,8],[21,7,21,8],[22,7,22,8],[23,7,23,8],[14,7,14,8],[15,7,15,8],[16,7,16,8],[17,7,17,8],[18,7,18,8],[9,7,9,8],[10,7,10,8],[11,7,11,8],[12,7,12,8],[13,7,13,8],[7,9,7,13],[4,12,4,13],[2,14,4,14],[2,9,3,11],[8,7,8,8],[2,7,6,8],[2,0,6,0],[2,1,6,1],[2,2,6,2],[2,3,6,4],[2,6,6,6],[0,9,1,11],[0,21,1,23],[0,1,0,2],[0,17,0,18],[8,17,8,19],[8,20,8,21],[2,22,4,22],[8,3,8,4],[7,20,7,21],[7,3,7,4],[7,7,7,8],[7,15,7,16],[7,17,7,19],[2,15,6,16],[2,17,6,19],[2,20,6,21]]}
[null,"Home",null,null,null,null,null,null,null,"Print Leave Application",null,null,null,null,null,null,null,"Home",null,null,null,"Print Leave Application"]
[]
["Øe la[;k","आवेदक का नाम","पद नाम","कार्यालय और अनुभाग",null,null,"वेतन","गृह किराया भत्ता, सवारी भत्ता, या वर्तमान पद पर प्राप्त अन्य क्षतिपूर्ति भत्ता",null,"आवेदित अवकाश का प्रकार और उसकी अवधि तथा दिनांक जिससे उसकी आवश्यकता है",null,null,null,null,"रविवार तथा छुट्टियां यदि कोई हो, जिन्हें अवकाश के पहले या बाद में जोड़ने का प्रस्ताव हो","रविवार तथा छुट्टियां यदि कोई हो, जिन्हें अवकाश के पहले या बाद में जोड़ने का प्रस्ताव हो",null,"अवकाश के लिए आवेदन देने के कारण (यदि वह मुख्यालय के बाहर जाने का विचार रखता हो तो विभिन्न स्थानों का पूरा पता, जहां उनके जाने की सम्भावना हो)",null,null,"गत अवकाश से लौटने का दिनांक तथा उस अवकाश का प्रकार तथा अवधि",null,"अवकाश का पता:-",null,null,null,null,"Type of Leave"]
[null,null,null,null,null,null,null,null,null,null,null,null,null,null,null,null,null,null,null,null,null,null,null,null,null,null,null,"उपार्जित अवकाश"]
[null,null,null,null,null,null,null,null,null,"Type of Leave","From","To","Total Period",null,null,null,null,null,null,null,null,null,null,null,null,null,null,"समर्पित अवकाश"]
[]
[]
[null,"1.","2.","3.",null,null,"4.","5.",null,"6.",null,null,null,null,"7","7.",null,"8.",null,null,"9.",null,11,null,null,null,null,"अर्द्व-वेतन अवकाश"]
[1,",chlhMh","lgk;d ys[kkf/kdkjh xzsM&izFke",",DlokbZtsM",null,{"$f":"CONCATENATE(D9,\" ]  \",E9)","v":",DlokbZtsM ]  "},77900,"नियमानुसार",null,"उपार्जित अवकाश","2021-03-19","2021-03-26",{"$f":"1+L9-K9","v":8},{"$f":"CONCATENATE(J9,\"  \",\"दिनांक\",\"  \",TEXT(K9,\"dd/mm/yyyy\"),\"  \",\"से\",\"  \",TEXT(L9,\"dd/mm/yyyy\"),\"  \",\"कुल \",\"  \",M9,\"  \",\"दिन\")","v":"उपार्जित अवकाश  दिनांक  19/03/2021  से  26/03/2021  कुल   8  दिन"},"नियमानुसार",null,null,"fookg dk;ZØe esa tkus gsrq ",null,null,"dk;kZy; vfHkys[kkuqlkj",null,"ihD;wvkj,l------ chdkusj",null,null,null,null,"रूपान्तरित अवकाश"]
[2,null,null,null,null," ]  ",0,10,null,null,null,null,{"$f":"IF(K10>0,1+L10-K10,\"\")","v":""},{"$f":"IF(M10=\"\",\"\",CONCATENATE(J10,\"  \",\"दिनांक\",\"  \",TEXT(K10,\"dd/mm/yyyy\"),\"  \",\"से\",\"  \",TEXT(L10,\"dd/mm/yyyy\"),\"  \",\"कुल \",\"  \",M10,\"  \",\"दिन\"))","v":""},null,null,null,null,null,null,null,null,null,null,null,null,null,"अदेय अवकाश"]
[3,null,null,null,null," ]  ",0,null,null,null,null,null,{"$f":"IF(K11>0,1+L11-K11,\"\")","v":""},{"$f":"IF(M11=\"\",\"\",CONCATENATE(J11,\"  \",\"दिनांक\",\"  \",TEXT(K11,\"dd/mm/yyyy\"),\"  \",\"से\",\"  \",TEXT(L11,\"dd/mm/yyyy\"),\"  \",\"कुल \",\"  \",M11,\"  \",\"दिन\"))","v":""},null,null,null,null,null,null,null,null,null,null,null,null,null,"सेवा समाप्ति अवकाश"]
[4,null,null,null,null," ]  ",0,null,null,null,null,null,"","",null,null,null,null,null,null,null,null,null,null,null,null,null,"असाधारण अवकाश"]
[5,null,null,null,null," ]  ",0,null,null,null,null,null,"","",null,null,null,null,null,null,null,null,null,null,null,null,null,"विशेष असमर्थता अवकाश"]
[6,null,null,null,null," ]  ",0,null,null,null,null,null,"","",null,null,null,null,null,null,null,null,null,null,null,null,null,"प्रसूति अवकाश "]
[7,null,null,null,null," ]  ",0,null,null,null,null,null,"","",null,null,null,null,null,null,null,null,null,null,null,null,null,"अस्पताल अवकाश"]
[8,null,null,null,null," ]  ",0,null,null,null,null,null,"","",null,null,null,null,null,null,null,null,null,null,null,null,null,"अध्ययन अवकाश"]
[9,null,null,null,null," ]  ",0,null,null,null,null,null,"",""]
[10,null,null,null,null," ]  ",0,null,null,null,null,null,"",""]
[11,null,null,null,null," ]  ",0,null,null,null,null,null,"",""]
[12,null,null,null,null," ]  ",0,null,null,null,null,null,"",""]
[13,null,null,null,null," ]  ",0,null,null,null,null,null,"",""]
[14,null,null,null,null," ]  ",0,null,null,null,null,null,"",""]
[15,null,null,null,null," ]  ",0,null,null,null,null,null,"",""]
[16,null,null,null,null," ]  ",0,null,null,null,null,null,"",""]
[17,null,null,null,null," ]  ",0,null,null,null,null,null,"",""]
[18,null,null,null,null," ]  ",0,null,null,null,null,null,"",""]
[19,null,null,null,null," ]  ",0,null,null,null,null,null,"",""]
[20,null,null,null,null," ]  ",0,null,null,null,null,null,"",""]
[21,null,null,null,null," ]  ",0,null,null,null,null,null,"",""]
[22,null,null,null,null," ]  ",0,null,null,null,null,null,"",""]
[23,null,null,null,null," ]  ",0,null,null,null,null,null,"",""]
[24,null,null,null,null," ]  ",0,null,null,null,null,null,"",""]
[25,null,null,null,null," ]  ",0,null,null,null,null,null,"",""]
[26,null,null,null,null," ]  ",0,null,null,null,null,null,"",""]
[27,null,null,null,null," ]  ",0,null,null,null,null,null,"",""]
[28,null,null,null,null," ]  ",0,null,null,null,null,null,"",""]
[29,null,null,null,null," ]  ",0,null,null,null,null,null,"",""]
[30,null,null,null,null," ]  ",0,null,null,null,null,null,"",""]
[31,null,null,null,null," ]  ",0,null,null,null,null,null,"",""]
[32,null,null,null,null," ]  ",0,null,null,null,null,null,"",""]
[33,null,null,null,null,{"$f":"CONCATENATE(D41,\" ]  \",E41)","v":" ]  "},0,null,null,null,null,null,"",""]
[34,null,null,null,null," ]  ",0,null,null,null,null,null,"",""]
[35,null,null,null,null," ]  ",0,null,null,null,null,null,"",""]
[36,null,null,null,null," ]  ",0,null,null,null,null,null,"",""]
[37,null,null,null,null," ]  ",0,null,null,null,null,null,"",""]
[38,null,null,null,null," ]  ",0,null,null,null,null,null,"",""]
[39,null,null,null,null," ]  ",0,null,null,null,null,null,"",""]
[40,null,null,null,null," ]  ",0,null,null,null,null,null,"",""]
[41,null,null,null,null," ]  ",0,null,null,null,null,null,"",""]
[42,null,null,null,null," ]  ",0,null,null,null,null,null,"",""]
[43,null,null,null,null," ]  ",0,null,null,null,null,null,"",""]
[44,null,null,null,null," ]  ",0,null,null,null,null,null,"",""]
[45,null,null,null,null," ]  ",0,null,null,null,null,null,"",""]
[46,null,null,null,null," ]  ",0,null,null,null,null,null,"",""]
[47,null,null,null,null," ]  ",0,null,null,null,null,null,"",""]
[48,null,null,null,null," ]  ",0,null,null,null,null,null,"",""]
[49,null,null,null,null," ]  ",0,null,null,null,null,null,"",""]
[50,null,null,null,null," ]  ",0,null,null,null,null,null,"",""]
[51,"EL","EL","EL","EL","EL","EL","EL","EL","EL","EL",null,{"$error":"#VALUE!"},{"$error":"#VALUE!"},null,"EL","EL","EL","EL","EL"]
[52,null,null,null,null,null,null,null,null,null,null,null,"",""]
[53,null,null,null,null,null,null,null,null,null,null,null,"",""]
[54,null,null,null,null,null,null,null,null,null,null,null,"",""]
[55,null,null,null,null,null,null,null,null,null,null,null,"",""]
[56,null,null,null,null,null,null,null,null,null,null,null,"",""]
[57,null,null,null,null,null,null,null,null,null,null,null,"",""]
[58,null,null,null,null,null,null,null,null,null,null,null,"",""]
[59,null,null,null,null,null,null,null,null,null,null,null,"",""]
[60,null,null,null,null,null,null,null,null,null,null,null,"",""]
[61,null,null,null,null,null,null,null,null,null,null,null,"",""]
[62,null,null,null,null,null,null,null,null,null,null,null,"",""]
[63,null,null,null,null,null,null,null,null,null,null,null,"",""]
[64,null,null,null,null,null,null,null,null,null,null,null,"",""]
[65,null,null,null,null,null,null,null,null,null,null,null,"",""]
[66,null,null,null,null,null,null,null,null,null,null,null,"",""]
[67,null,null,null,null,null,null,null,null,null,null,null,{"$f":"IF(K75>0,1+L75-K75,\"\")","v":""},{"$f":"IF(M75=\"\",\"\",CONCATENATE(J75,\"  \",\"दिनांक\",\"  \",TEXT(K75,\"dd/mm/yyyy\"),\"  \",\"से\",\"  \",TEXT(L75,\"dd/mm/yyyy\"),\"  \",\"कुल \",\"  \",M75,\"  \",\"दिन\"))","v":""}]
[68,null,null,null,null,null,null,null,null,null,null,null,"",""]
[69,null,null,null,null,null,null,null,null,null,null,null,"",""]
[70,null,null,null,null,null,null,null,null,null,null,null,"",""]
[71,null,null,null,null,null,null,null,null,null,null,null,"",""]
[72,null,null,null,null,null,null,null,null,null,null,null,"",""]
[73,null,null,null,null,null,null,null,null,null,null,null,"",""]
[74,null,null,null,null,null,null,null,null,null,null,null,"",""]
[75,null,null,null,null,null,null,null,null,null,null,null,"",""]
[76,null,null,null,null,null,null,null,null,null,null,null,"",""]
[77,null,null,null,null,null,null,null,null,null,null,null,"",""]
[78,null,null,null,null,null,null,null,null,null,null,null,"",""]
[79,null,null,null,null,null,null,null,null,null,null,null,"",""]
[80,null,null,null,null,null,null,null,null,null,null,null,"",""]
[81,null,null,null,null,null,null,null,null,null,null,null,"",""]
[82,null,null,null,null,null,null,null,null,null,null,null,"",""]
[83,null,null,null,null,null,null,null,null,null,null,null,"",""]
[84,null,null,null,null,null,null,null,null,null,null,null,"",""]
[85,null,null,null,null,null,null,null,null,null,null,null,"",""]
[86,null,null,null,null,null,null,null,null,null,null,null,"",""]
[87,null,null,null,null,null,null,null,null,null,null,null,"",""]
[88,null,null,null,null,null,null,null,null,null,null,null,"",""]
[89,null,null,null,null,null,null,null,null,null,null,null,"",""]
[90,null,null,null,null,null,null,null,null,null,null,null,"",""]
[91,null,null,null,null,null,null,null,null,null,null,null,"",""]
[92,null,null,null,null,null,null,null,null,null,null,null,"",""]
[93,null,null,null,null,null,null,null,null,null,null,null,"",""]
[94,null,null,null,null,null,null,null,null,null,null,null,"",""]
[95,null,null,null,null,null,null,null,null,null,null,null,"",""]
[96,null,null,null,null,null,null,null,null,null,null,null,"",""]
[97,null,null,null,null,null,null,null,null,null,null,null,"",""]
[98,null,null,null,null,null,null,null,null,null,null,null,"",""]
[99,null,null,null,null,null,null,null,null,null,null,null,"",""]
[100,null,null,null,null,null,null,null,null,null,null,null,"",""]
[101,null,null,null,null,null,null,null,null,null,null,null,"",""]
[102,null,null,null,null,null,null,null,null,null,null,null,"",""]
[103,null,null,null,null,null,null,null,null,null,null,null,"",""]
[104,null,null,null,null,null,null,null,null,null,null,null,"",""]
[105,null,null,null,null,null,null,null,null,null,null,null,"",""]
[106,null,null,null,null,null,null,null,null,null,null,null,"",""]
[107,null,null,null,null,null,null,null,null,null,null,null,"",""]
[108,null,null,null,null,null,null,null,null,null,null,null,"",""]
[109,null,null,null,null,null,null,null,null,null,null,null,"",""]
[110,null,null,null,null,null,null,null,null,null,null,null,"",""]
[111,null,null,null,null,null,null,null,null,null,null,null,"",""]
[112,null,null,null,null,null,null,null,null,null,null,null,"",""]
[113,null,null,null,null,null,null,null,null,null,null,null,"",""]
[114,null,null,null,null,null,null,null,null,null,null,null,"",""]
[115,null,null,null,null,null,null,null,null,null,null,null,"",""]
[116,null,null,null,null,null,null,null,null,null,null,null,"",""]
[117,null,null,null,null,null,null,null,null,null,null,null,"",""]
[118,null,null,null,null,null,null,null,null,null,null,null,"",""]
[119,null,null,null,null,null,null,null,null,null,null,null,"",""]
[120,null,null,null,null,null,null,null,null,null,null,null,"",""]
[121,null,null,null,null,null,null,null,null,null,null,null,"",""]
[122,null,null,null,null,null,null,null,null,null,null,null,"",""]
[123,null,null,null,null,null,null,null,null,null,null,null,"",""]
[124,null,null,null,null,null,null,null,null,null,null,null,"",""]
[125,null,null,null,null,null,null,null,null,null,null,null,"",""]
[126,null,null,null,null,null,null,null,null,null,null,null,"",""]
[127,null,null,null,null,null,null,null,null,null,null,null,"",""]
[128,null,null,null,null,null,null,null,null,null,null,null,"",""]
[129,null,null,null,null,null,null,null,null,null,null,null,"",""]
[130,null,null,null,null,null,null,null,null,null,null,null,"",""]
[131,null,null,null,null,null,null,null,null,null,null,null,{"$f":"IF(K139>0,1+L139-K139,\"\")","v":""},{"$f":"IF(M139=\"\",\"\",CONCATENATE(J139,\"  \",\"दिनांक\",\"  \",TEXT(K139,\"dd/mm/yyyy\"),\"  \",\"से\",\"  \",TEXT(L139,\"dd/mm/yyyy\"),\"  \",\"कुल \",\"  \",M139,\"  \",\"दिन\"))","v":""}]
[132,null,null,null,null,null,null,null,null,null,null,null,"",""]
[133,null,null,null,null,null,null,null,null,null,null,null,"",""]
[134,null,null,null,null,null,null,null,null,null,null,null,"",""]
[135,null,null,null,null,null,null,null,null,null,null,null,"",""]
[136,null,null,null,null,null,null,null,null,null,null,null,"",""]
[137,null,null,null,null,null,null,null,null,null,null,null,"",""]
[138,null,null,null,null,null,null,null,null,null,null,null,"",""]
[139,null,null,null,null,null,null,null,null,null,null,null,"",""]
[140,null,null,null,null,null,null,null,null,null,null,null,"",""]
[141,null,null,null,null,null,null,null,null,null,null,null,"",""]
[142,null,null,null,null,null,null,null,null,null,null,null,"",""]
[143,null,null,null,null,null,null,null,null,null,null,null,"",""]
[144,null,null,null,null,null,null,null,null,null,null,null,"",""]
[145,null,null,null,null,null,null,null,null,null,null,null,"",""]
[146,null,null,null,null,null,null,null,null,null,null,null,"",""]
[147,null,null,null,null,null,null,null,null,null,null,null,"",""]
[148,null,null,null,null,null,null,null,null,null,null,null,"",""]
[149,null,null,null,null,null,null,null,null,null,null,null,"",""]
[150,null,null,null,null,null,null,null,null,null,null,null,"",""]
[151,null,null,null,null,null,null,null,null,null,null,null,"",""]
[152,null,null,null,null,null,null,null,null,null,null,null,"",""]
[153,null,null,null,null,null,null,null,null,null,null,null,"",""]
[154,null,null,null,null,null,null,null,null,null,null,null,"",""]
[155,null,null,null,null,null,null,null,null,null,null,null,"",""]
[156,null,null,null,null,null,null,null,null,null,null,null,"",""]
[157,null,null,null,null,null,null,null,null,null,null,null,"",""]
[158,null,null,null,null,null,null,null,null,null,null,null,"",""]
[159,null,null,null,null,null,null,null,null,null,null,null,"",""]
[160,null,null,null,null,null,null,null,null,null,null,null,"",""]
[161,null,null,null,null,null,null,null,null,null,null,null,"",""]
[162,null,null,null,null,null,null,null,null,null,null,null,"",""]
[163,null,null,null,null,null,null,null,null,null,null,null,"",""]
[164,null,null,null,null,null,null,null,null,null,null,null,"",""]
[165,null,null,null,null,null,null,null,null,null,null,null,"",""]
[166,null,null,null,null,null,null,null,null,null,null,null,"",""]
[167,null,null,null,null,null,null,null,null,null,null,null,"",""]
[168,null,null,null,null,null,null,null,null,null,null,null,"",""]
[169,null,null,null,null,null,null,null,null,null,null,null,"",""]
[170,null,null,null,null,null,null,null,null,null,null,null,"",""]
[171,null,null,null,null,null,null,null,null,null,null,null,"",""]
[172,null,null,null,null,null,null,null,null,null,null,null,"",""]
[173,null,null,null,null,null,null,null,null,null,null,null,"",""]
[174,null,null,null,null,null,null,null,null,null,null,null,"",""]
[175,null,null,null,null,null,null,null,null,null,null,null,"",""]
[176,null,null,null,null,null,null,null,null,null,null,null,"",""]
[177,null,null,null,null,null,null,null,null,null,null,null,"",""]
[178,null,null,null,null,null,null,null,null,null,null,null,"",""]
[179,null,null,null,null,null,null,null,null,null,null,null,"",""]
[180,null,null,null,null,null,null,null,null,null,null,null,"",""]
[181,null,null,null,null,null,null,null,null,null,null,null,"",""]
[182,null,null,null,null,null,null,null,null,null,null,null,"",""]
[183,null,null,null,null,null,null,null,null,null,null,null,"",""]
[184,null,null,null,null,null,null,null,null,null,null,null,"",""]
[185,null,null,null,null,null,null,null,null,null,null,null,"",""]
[186,null,null,null,null,null,null,null,null,null,null,null,"",""]
[187,null,null,null,null,null,null,null,null,null,null,null,"",""]
[188,null,null,null,null,null,null,null,null,null,null,null,"",""]
[189,null,null,null,null,null,null,null,null,null,null,null,"",""]
[190,null,null,null,null,null,null,null,null,null,null,null,"",""]
[191,null,null,null,null,null,null,null,null,null,null,null,"",""]
[192,null,null,null,null,null,null,null,null,null,null,null,"",""]
[193,null,null,null,null,null,null,null,null,null,null,null,"",""]
[194,null,null,null,null,null,null,null,null,null,null,null,"",""]
[195,null,null,null,null,null,null,null,null,null,null,null,{"$f":"IF(K203>0,1+L203-K203,\"\")","v":""},{"$f":"IF(M203=\"\",\"\",CONCATENATE(J203,\"  \",\"दिनांक\",\"  \",TEXT(K203,\"dd/mm/yyyy\"),\"  \",\"से\",\"  \",TEXT(L203,\"dd/mm/yyyy\"),\"  \",\"कुल \",\"  \",M203,\"  \",\"दिन\"))","v":""}]
[196,null,null,null,null,null,null,null,null,null,null,null,"",""]
[197,null,null,null,null,null,null,null,null,null,null,null,"",""]
[198,null,null,null,null,null,null,null,null,null,null,null,"",""]
[199,null,null,null,null,null,null,null,null,null,null,null,"",""]
[200,null,null,null,null,null,null,null,null,null,null,null,"",""]
["EL","EL","EL","EL","EL","EL","EL","EL","EL","EL","EL","EL","EL","EL","EL","EL","EL","EL","EL","EL","EL","EL","EL","EL","EL"]

{"sheet":"EOL","index":11,"n_rows":18,"n_cols":6,"rows_kept":18,"cut":false,"hidden":false,"merged":[[17,1,17,2],[5,3,6,3],[7,3,8,3],[7,4,8,4],[9,3,10,3],[9,4,10,4],[14,3,14,4],[13,3,13,4],[15,3,15,4],[11,3,12,3],[11,4,12,4],[15,0,15,1],[3,0,3,2],[3,3,3,4],[4,3,4,4],[0,5,0,6],[0,0,1,4],[2,0,2,4]]}
["It is try to accurate calcuation but if you found any  error, please inform for correction with its soluation (if possible) and mail (praveshbkn@gmail.com) to me for further development/benefited to all ",null,null,null,null,"Home"]
[]
["Treatment of Extraordinary leave for Probation-trainees"]
["Enter your EOL period(dd/mm/yyyy)",null,null,"Output"]
["From","To","Days","Competent Authority (in days limit)"]
["2022-04-01","2022-06-30",{"$f":"IF(B6=\"\",\"\",1+B6-A6)","v":91},"Appointing authority",{"$f":"'Table-Probation'!F10","v":"Upto 30  Days"}]
[null,null,{"$f":"IF(B7=\"\",\"\",1+B7-A7)","v":""},null,{"$f":"'Table-Probation'!I10","v":"Upto  30  Days"}]
[null,null,{"$f":"IF(B8=\"\",\"\",1+B8-A8)","v":""},"Administrative Department",{"$f":"'Table-Probation'!J10","v":"Remaining  61 (91-30) Days"}]
[null,null,{"$f":"IF(B9=\"\",\"\",1+B9-A9)","v":""}]
[null,null,null,"Probation Period extended",{"$f":"'Table-Probation'!H10","v":"Probation period extended for 91 Days"}]
[]
[null,null,null,"Fin. Deptt. Memorandum /   date",{"$f":"'Table-Probation'!K10","v":"F.1 (2)FD/Rules/2006 Pt-I Dated 06-01-2020"}]
[null,null,{"$f":"IF(B13=\"\",\"\",1+B13-A13)","v":""}]
[null,null,{"$f":"IF(B14=\"\",\"\",1+B14-A14)","v":""}]
[null,null,{"$f":"IF(B15=\"\",\"\",1+B15-A15)","v":""},"Design and prepared by Pravesh Kumar Sharma"]
["Total EOL",null,{"$f":"SUM(C6:C15)","v":91},"View EOL order and silent points in tabular format"]
[]
[null,"Home"]

{"sheet":"Table-Probation","index":12,"n_rows":25,"n_cols":11,"rows_kept":25,"cut":false,"hidden":true,"merged":[[0,5,0,6],[22,2,22,3]]}
[null,null,null,null,null,"Competent Authority (in days limit)"]
[null,null,"FROM","TO","CODE","Appointing authority","Administrative Department","PB extend","Appointing authority","Administrative Department","GOV ORDER"]
[null,null,"2004-04-01","2014-06-11","A",90,{"$f":"F3+1","v":91},{"$f":"IF('Table-Probation'!$E$10<F3,0,IF($E$9=E3,'Table-Probation'!$E$10-F3,\"N.A.\"))","v":"N.A."},{"$f":"IF('Table-Probation'!$E$10>F3,F3,'Table-Probation'!$E$10)","v":90},{"$f":"IF('Table-Probation'!$E$10>G3,'Table-Probation'!$E$10-F3)","v":false},"F.1 (2)FD/Rules/2006 Pt-I Dated 11-06-2014"]
[null,null,{"$f":"D3+1","v":"2014-06-12"},"2019-08-07","B",30,{"$f":"F4+1","v":31},{"$f":"IF('Table-Probation'!$E$10<F4,0,IF($E$9=E4,'Table-Probation'!$E$10-F4,\"N.A.\"))","v":"N.A."},{"$f":"IF('Table-Probation'!$E$10>F4,F4,'Table-Probation'!$E$10)","v":30},{"$f":"IF('Table-Probation'!$E$10>G4,'Table-Probation'!$E$10-F4)","v":61},"No. F. l(2)FD/RuIes/2006-I Dated 08-08-2019"]
[null,null,"2019-08-08",null,"C",30,{"$f":"F5+1","v":31},{"$f":"IF('Table-Probation'!$E$10<F5,0,IF($E$9=E5,'Table-Probation'!$E$10,\"N.A.\"))","v":91},{"$f":"IF('Table-Probation'!$E$10>F5,F5,'Table-Probation'!$E$10)","v":30},{"$f":"IF('Table-Probation'!$E$10>G5,'Table-Probation'!$E$10-F5)","v":61},"F.1 (2)FD/Rules/2006 Pt-I Dated 06-01-2020"]
[]
[null,null,null,null,{"$f":"$E$9","v":"C"},{"$f":"INDEX(F3:F6,MATCH($E$7,$E$3:$E$6,0))","v":30},31,91,30,61,"F.1 (2)FD/Rules/2006 Pt-I Dated 06-01-2020"]
[]
[null,null,null,{"$f":"MAX(EOL!B6:B15)","v":"2022-06-30"},{"$f":"VLOOKUP(D9,$C$3:$E$5,3)","v":"C"},null,null,null,{"$f":"IF(I7<F7,\"Complete EOL period\",\"Upto\")","v":"Upto"},{"$f":"IF(J7=FALSE,\"N.A.\",J7)","v":61}]
[null,null,null,"Total period",{"$f":"SUM(EOL!$C$6:$C$15)","v":91},{"$f":"CONCATENATE(\"Upto \",F7,\"  \",\"Days\")","v":"Upto 30  Days"},{"$f":"CONCATENATE(\"More than\",\"  \",F7,\"  \",\"Days\")","v":"More than  30  Days"},{"$f":"IF(H7>0,CONCATENATE(\"Probation period extended for \",\"\",H7,\" \",\"Days\"),\"Not Extended\")","v":"Probation period extended for 91 Days"},{"$f":"CONCATENATE(I9,\"  \",I7,\"  \",\"Days\")","v":"Upto  30  Days"},{"$f":"IF(J9=\"N.A.\",\"N.A.\",CONCATENATE(\"Remaining\",\"  \",J7,,\" \",\"(\",E10,\"-\",I7,\")\",\" \",\"Days\"))","v":"Remaining  61 (91-30) Days"},{"$f":"K7","v":"F.1 (2)FD/Rules/2006 Pt-I Dated 06-01-2020"}]
[]
[]
[]
[]
[null,null,null,null,null,null,null,{"$f":"EOL!A6","v":"2022-04-01"},{"$f":"EOL!B6","v":"2022-06-30"},{"$f":"EOL!C6","v":91}]
[null,null,null,null,null,null,null,{"$f":"EOL!A7","v":"00:00:00"},{"$f":"EOL!B7","v":"00:00:00"},{"$f":"EOL!C7","v":""}]
[]
[]
[null,null,null,null,{"$f":"INDEX($E$3:$E$5,MATCH($D$9,$D$3:$D$5,0))","v":{"$error":"#N/A"}}]
[null,null,null,{"$f":"'Table-Probation'!G10","v":"More than  30  Days"}]
[null,null,"CODE",{"$f":"'Table-Probation'!E7","v":"C"}]
[]
[null,null,"Sanction of EOL (in days limit)"]
[null,null,"Appointing authority",{"$f":"'Table-Probation'!I10","v":"Upto  30  Days"}]
[null,null,"Administrative Department"]

{"sheet":"CHART","index":13,"n_rows":39,"n_cols":4,"rows_kept":39,"cut":false,"hidden":false,"merged":[[24,1,28,3],[24,0,28,0],[29,1,30,3],[31,1,32,3],[33,1,37,3],[38,1,42,3],[29,0,30,0],[31,0,32,0],[33,0,37,0],[38,0,42,0],[21,0,21,1],[21,2,21,3],[22,0,23,3],[19,1,19,3],[20,1,20,3],[17,1,17,3],[18,1,18,3],[3,0,3,1],[3,2,3,3],[7,0,7,1],[7,2,7,3],[4,3,6,3],[11,3,12,3],[13,0,13,3],[10,0,10,1],[10,2,10,3],[8,3,9,3],[0,2,0,3],[1,0,1,2],[14,1,14,3],[15,1,15,3],[16,1,16,3]]}
[null,null,"Home"]
[]
["S.N.","Extraordinary leave period","Competent Authority to sanction leave","Probation Period extended"]
["FD Memorandum",null,"No. F.1(2)FD/Rules/06 Pt.I Dated 11 June 2014."]
[1,"Upto three months","Appointing Authority","the probation period will be extended for the period of extraordinary leave taken beyond one month."]
[2,"Beyond three months but period not more than one year.","Appointing Authority with the approval of Administrative Department."]
[3,"Extraordinary leave beyond the period of one year in exceptional and unavoidable circumstances ","Appointing Authority only with the prior approval of Department of Personnel and Finance Department."]
["FD Memorandum",null,"No. F. l(2)FD/RuIes/2006-I Dated 08-08-2019"]
[1,"Upto one month","Appointing authority","If EOL period  is exceeding one month, the probation period shall be extended for the entire period of extraordinary leave."]
[2,"Beyond one month in exceptional and unavoidable circumstances","Administrative Department"]
["FD Memorandum",null,"F.1 (2)FD/Rules/2006 Pt-I Dated 06-01-2020"]
[1,"Upto one month","Appointing authority","extraordinary leave period is exceeding one month, the probation period shall be extended for the entire period of extraordinary leave."]
[2,"Beyond one month in exceptional and unavoidable circumstances","Administrative Department"]
["Silent points of EOL"]
[1,"Prior sanction of extraordinary leave shall be pre-requisite in all such cases."]
[2," No extraordinary leave be sanctioned for study purpose and for preparing competitive examination."]
[3,"Extraordinary leave shall be granted up to one month by appointing authorithy on reasonable grounds. Extraordinary leave beyond one month shall be granted in exceptional and unavoidable circumstances, related to medical urgency."]
[4," In case of extraordinary leave applied for critical illness of self, wife/husband, mother, father and children, extraordinary leave can be sanctioned on the basis of certificate of authorized medical attendant."]
[5,"Those who proceed on extraordinary leave without prior sanction shall be treated as cases of wilful absence and liable to disciplinary action."]
[6,"If anyone remains absent without getting prior sanction for extraordinary leave or in cases where absence is due to higher study / preparing for competitive examination, the period of absence shall be treated as dies non and the same shall not be countable for any purpose."]
[7,"In all cases where extraordinary leave period is exceeding one month, the probation period shall be extended for the entire period of extraordinary leave"]
["FD Memorandum",null,"F.1 (2)FD/Rules/2006 Pt-I Dated 22-02-2021"]
["वित्त विभाग के आदेश दिनांक 22.02.2021 द्वारा् संशोधित मेमोरेंडम जारी कर प्रोबेशनर ट्रेनी कार्मिकों को राहत प्रदान की है। सामान्य शब्दों को यहां प्रस्तुत किया जा रहा है-"]
[]
[1,"परिवीक्षाधीन प्रशिक्षु कार्मिक जो परिवीक्षाधीन-प्रशिक्षु के रूप में नियुक्ति से पहले किसी नियमित पाठ्यक्रम या प्रतियोगी परीक्षा की तैयारी कर रहा है और उपर्युक्त पाठ्यक्रम की पूर्णता के लिए असाधारणध्अवैतनिक अवकाश हेतु आवेदन करता है तो प्रोबेशनर कार्मिक को पाठ्यक्रम पूर्णता हेतु आवश्यक अवधि के लिए असाधारण अवकाश की अनुमति दी जा सकती है। "]
[]
[]
[]
[]
[2,"अध्ययन के किसी भी पाठ्यक्रम को जारी रखने या निकट प्रतियोगी परीक्षा की तैयारी करने के लिए असाधारण/अवैतनिक अवकाश लेने पर लिए गए अवैतनिक अवकाश के बराबर परिवीक्षाकाल को आगे बढ़ाया जाएगा।"]
[]
[3,"यदि कोई कार्मिक बिना पूर्व स्वीकृति के इस प्रयोजन के लिए असाधारण/अवैतनिक अवकाश पर प्रस्थान करता है तो इसे स्वेच्छा से अनुपस्थिति के रूप में माना जाएगा और कार्मिक अनुशासनात्मक कार्रवाई के लिए स्वयं उत्तरदायी होगा।"]
[]
[4,"इस ज्ञापन को जारी करने से पहले एवं प्रोबेशनर ट्रेनी के रूप में सेवा में शामिल होने से पहले के अध्ययन के सतत् पाठ्यक्रम को पूरा करने या निकट प्रतियोगी परीक्षा की तैयारी से सम्बन्धित असाधारण अवकाश स्वीकृति के लंबित मामलों को नियुक्ति प्राधिकारी और प्रशासनिक विभाग द्वारा इस आदेश के संदर्भ में तय किया जा सकता है अर्थात नियुक्ति अधिकारी/प्रशासनिक विभाग द्वारा इस प्रकार के अवकाश कार्मिक/विभागीय हित में स्वीकृत किए जा सकेंगे।"]
[]
[]
[]
[]
["नोट-","उक्त शिथिलन केवल उन कार्मिकों के लिए ही है,जो प्रोबेशन में नियुक्ति से पूर्व से ही किसी नियमित पाठ्यक्रम में अध्ययन कर रहे थे। सेवा में नियुक्ति के बाद किसी नियमित पाठ्यक्रम के लिए असाधारण/अवैतनिक अवकाश के सम्बन्ध में वित्त विभाग के आदेश दिनांक 08.08.2019 एवं 06.01.2020 के ही प्रावधान लागू होंगे अर्थात सेवा में नियुक्ति के बाद अध्ययन/परीक्षा तैयारी हेतु अवैतनिक अवकाश देय नहीं होगा।"]

{"sheet":"How to use","index":14,"n_rows":21,"n_cols":5,"rows_kept":21,"cut":false,"hidden":false,"merged":[[20,0,21,6],[0,0,0,1],[0,4,0,6],[1,0,2,6],[3,0,5,6],[16,0,19,6],[6,0,7,6],[8,0,9,6],[10,0,11,6],[12,0,13,6],[14,0,15,6]]}
["Home",null,null,null,"Back PL Calculation"]
["The main purpose of this axle seat is to match the earned leave earned/utilized during the service of an employee on retirement or other any stage , as required"]
[]
["Prior to 01-01-1983, earned leave was not calculated as today basis  Therefore, if any employee is in the period before this period, then the initial balance has to be written in cell B10, in addition to this zero should be filled in all the cases."]
[]
[]
["While accounting for earned leave, the user has to select the Employee Department (Status) from cell G14"]
[]
["Accounting of the earned leave availed during the service should be done accordingly from Cell L19: R19."]
[]
["Use only unhighlighted cells (i.e. white colour cells)..avoid copy/cut/paste in white colour cells"]
[]
["All the calculations are based on Leave Start Date to Leave End Date (i.e. last day of relevant year).. So input your data as accordingly"]
[]
["Calculations is possible maximum 40 years service period (last day of relevant year) & upto 200 transcation."]
[]
["Please add/less no. of days for\"Leave adjustment\" & \"Joning Time\" and \"Surrendra Leave\",if its occurrence more than once in the year (Leave adjustment=P.L. reverse debit/credit/strike period/earned PL in vacation department.. so on)"]
[]
[]
[]
["Hear \"A\" indicate first half of calender year i.e. Jan to June of relevant year and \" B \" indicate second half of calender year i.e. July to Dec of relevant year "]

{"sheet":"DA","index":15,"n_rows":43,"n_cols":38,"rows_kept":43,"cut":false,"hidden":false,"merged":[[39,0,39,4],[0,4,0,5],[1,0,1,1],[1,2,1,4]]}
[null,null,null,null,"Home"]
["Periods",null,"DA Rate",null,null,null,null,null,null,null,null,null,null,null,null,null,null,null,null,null,null,null,null,null,null,null,null,null,null,null,null,"MONTH","YEAR","MONTH","YEAR"]
["Start Period","End Period","Period","V PAY","VI PAY","VII PAY",null,null,null,null,null,null,null,null,null,null,null,null,null,null,null,null,null,null,null,null,null,null,null,1,"Jan"]
["2007-01-01","2007-06-30",{"$f":"AL4","v":"Jan-2007  to June-2007 "},0.35,0.06,null,null,null,null,null,null,null,null,null,null,null,null,null,null,null,null,null,null,null,null,null,null,null,null,2,"Feb",{"$f":"MONTH(A4)","v":1},{"$f":"YEAR(A4)","v":2007},{"$f":"MONTH(B4)","v":6},{"$f":"YEAR(B4)","v":2007},{"$f":"INDEX($AE$3:$AE$14,MATCH(AF4,$AD$3:$AD$23,0))","v":"Jan"},{"$f":"INDEX($AE$3:$AE$14,MATCH(AH4,$AD$3:$AD$23,0))","v":"June"},{"$f":"CONCATENATE(AJ4,\"-\",AG4,\"  \",\"to \",  AK4,\"-\",AI4,\" \")","v":"Jan-2007  to June-2007 "}]
[{"$f":"B4+1","v":"2007-07-01"},"2007-12-31","July-2007  to Dec-2007 ",0.41,0.09,null,null,null,null,null,null,null,null,null,null,null,null,null,null,null,null,null,null,null,null,null,null,null,null,3,"March",7,2007,12,2007,{"$f":"INDEX($AE$3:$AE$14,MATCH(AF5,$AD$3:$AD$23,0))","v":"July"},{"$f":"INDEX($AE$3:$AE$14,MATCH(AH5,$AD$3:$AD$23,0))","v":"Dec"},{"$f":"CONCATENATE(AJ5,\"-\",AG5,\"  \",\"to \",  AK5,\"-\",AI5,\" \")","v":"July-2007  to Dec-2007 "}]
[{"$f":"B5+1","v":"2008-01-01"},"2008-06-30","Jan-2008  to June-2008 ",0.47,0.12,null,null,null,null,null,null,null,null,null,null,null,null,null,null,null,null,null,null,null,null,null,null,null,null,4,"April",1,2008,6,2008,"Jan","June","Jan-2008  to June-2008 "]
["2008-07-01","2008-12-31","July-2008  to Dec-2008 ",0.54,0.16,null,null,null,null,null,null,null,null,null,null,null,null,null,null,null,null,null,null,null,null,null,null,null,null,5,"May",7,2008,12,2008,"July","Dec","July-2008  to Dec-2008 "]
["2009-01-01","2009-06-30","Jan-2009  to June-2009 ",0.64,0.22,null,null,null,null,null,null,null,null,null,null,null,null,null,null,null,null,null,null,null,null,null,null,null,null,6,"June",1,2009,6,2009,"Jan","June","Jan-2009  to June-2009 "]
["2009-07-01","2009-12-31","July-2009  to Dec-2009 ",0.73,0.27,null,null,null,null,null,null,null,null,null,null,null,null,null,null,null,null,null,null,null,null,null,null,null,null,7,"July",7,2009,12,2009,"July","Dec","July-2009  to Dec-2009 "]
["2010-01-01","2010-06-30","Jan-2010  to June-2010 ",0.87,0.35,null,null,null,null,null,null,null,null,null,null,null,null,null,null,null,null,null,null,null,null,null,null,null,null,8,"Aug",1,2010,6,2010,"Jan","June","Jan-2010  to June-2010 "]
["2010-07-01","2010-12-31","July-2010  to Dec-2010 ",1.03,0.45,null,null,null,null,null,null,null,null,null,null,null,null,null,null,null,null,null,null,null,null,null,null,null,null,9,"Sept",7,2010,12,2010,"July","Dec","July-2010  to Dec-2010 "]
["2011-01-01","2011-06-30","Jan-2011  to June-2011 ",1.1499999999999999,0.51,null,null,null,null,null,null,null,null,null,null,null,null,null,null,null,null,null,null,null,null,null,null,null,null,10,"Oct",1,2011,6,2011,"Jan","June","Jan-2011  to June-2011 "]
["2011-07-01","2011-12-31","July-2011  to Dec-2011 ",1.27,0.57999999999999996,null,null,null,null,null,null,null,null,null,null,null,null,null,null,null,null,null,null,null,null,null,null,null,null,11,"Nov",7,2011,12,2011,"July","Dec","July-2011  to Dec-2011 "]
["2012-01-01","2012-06-30","Jan-2012  to June-2012 ",1.39,0.65,null,null,null,null,null,null,null,null,null,null,null,null,null,null,null,null,null,null,null,null,null,null,null,null,12,"Dec",1,2012,6,2012,"Jan","June","Jan-2012  to June-2012 "]
["2012-07-01","2012-12-31","July-2012  to Dec-2012 ",1.51,0.72,null,null,null,null,null,null,null,null,null,null,null,null,null,null,null,null,null,null,null,null,null,null,null,null,null,null,7,2012,12,2012,"July","Dec","July-2012  to Dec-2012 "]
["2013-01-01","2013-06-30","Jan-2013  to June-2013 ",1.66,0.8,null,null,null,null,null,null,null,null,null,null,null,null,null,null,null,null,null,null,null,null,null,null,null,null,null,null,1,2013,6,2013,"Jan","June","Jan-2013  to June-2013 "]
["2013-07-01","2013-12-31","July-2013  to Dec-2013 ",1.83,0.9,null,null,null,null,null,null,null,null,null,null,null,null,null,null,null,null,null,null,null,null,null,null,null,null,null,null,7,2013,12,2013,"July","Dec","July-2013  to Dec-2013 "]
["2014-01-01","2014-06-30","Jan-2014  to June-2014 ",2,1,null,null,null,null,null,null,null,null,null,null,null,null,null,null,null,null,null,null,null,null,null,null,null,null,null,null,1,2014,6,2014,"Jan","June","Jan-2014  to June-2014 "]
["2014-07-01","2014-12-31","July-2014  to Dec-2014 ",2.12,1.07,null,null,null,null,null,null,null,null,null,null,null,null,null,null,null,null,null,null,null,null,null,null,null,null,null,null,7,2014,12,2014,"July","Dec","July-2014  to Dec-2014 "]
["2015-01-01","2015-06-30","Jan-2015  to June-2015 ",2.23,1.1299999999999999,null,null,null,null,null,null,null,null,null,null,null,null,null,null,null,null,null,null,null,null,null,null,null,null,null,null,1,2015,6,2015,"Jan","June","Jan-2015  to June-2015 "]
["2015-07-01","2015-12-31","July-2015  to Dec-2015 ",2.34,1.19,null,null,null,null,null,null,null,null,null,null,null,null,null,null,null,null,null,null,null,null,null,null,null,null,null,null,7,2015,12,2015,"July","Dec","July-2015  to Dec-2015 "]
["2016-01-01","2016-06-30","Jan-2016  to June-2016 ",2.4500000000000002,1.25,0,null,null,null,null,null,null,null,null,null,null,null,null,null,null,null,null,null,null,null,null,null,null,null,null,null,1,2016,6,2016,"Jan","June","Jan-2016  to June-2016 "]
["2016-07-01","2016-12-31","July-2016  to Dec-2016 ",2.57,1.32,0.02,null,null,null,null,null,null,null,null,null,null,null,null,null,null,null,null,null,null,null,null,null,null,null,null,null,7,2016,12,2016,"July","Dec","July-2016  to Dec-2016 "]
["2017-01-01","2017-06-30","Jan-2017  to June-2017 ",2.64,1.36,0.04,null,null,null,null,null,null,null,null,null,null,null,null,null,null,null,null,null,null,null,null,null,null,null,null,null,1,2017,6,2017,"Jan","June","Jan-2017  to June-2017 "]
["2017-07-01","2017-12-31","July-2017  to Dec-2017 ",2.68,1.39,0.05,null,null,null,null,null,null,null,null,null,null,null,null,null,null,null,null,null,null,null,null,null,null,null,null,null,7,2017,12,2017,"July","Dec","July-2017  to Dec-2017 "]
["2018-01-01","2018-06-30","Jan-2018  to June-2018 ",2.74,1.42,7.0000000000000007E-2,null,null,null,null,null,null,null,null,null,null,null,null,null,null,null,null,null,null,null,null,null,null,null,null,null,1,2018,6,2018,"Jan","June","Jan-2018  to June-2018 "]
["2018-07-01","2018-12-31","July-2018  to Dec-2018 ",2.84,1.48,0.09,null,null,null,null,null,null,null,null,null,null,null,null,null,null,null,null,null,null,null,null,null,null,null,null,null,7,2018,12,2018,"July","Dec","July-2018  to Dec-2018 "]
[{"$f":"B27+1","v":"2019-01-01"},"2019-06-30","Jan-2019  to June-2019 ",2.95,1.54,0.12,null,null,null,null,null,null,null,null,null,null,null,null,null,null,null,null,null,null,null,null,null,null,null,null,null,{"$f":"MONTH(A28)","v":1},{"$f":"YEAR(A28)","v":2019},6,2019,"Jan","June","Jan-2019  to June-2019 "]
[{"$f":"B28+1","v":"2019-07-01"},"2019-12-31","July-2019  to Dec-2019 ",3.12,1.64,0.17,null,null,null,null,null,null,null,null,null,null,null,null,null,null,null,null,null,null,null,null,null,null,null,null,null,{"$f":"MONTH(A29)","v":7},{"$f":"YEAR(A29)","v":2019},12,2019,"July","Dec","July-2019  to Dec-2019 "]
[{"$f":"B29+1","v":"2020-01-01"},"2020-06-30","Jan-2020  to June-2020 ",3.12,{"$f":"E29","v":1.64},0.17,null,null,null,null,null,null,null,null,null,null,null,null,null,null,null,null,null,null,null,null,null,null,null,null,null,{"$f":"MONTH(A30)","v":1},{"$f":"YEAR(A30)","v":2020},6,2020,"Jan","June","Jan-2020  to June-2020 "]
[{"$f":"B30+1","v":"2020-07-01"},"2020-12-31","July-2020  to Dec-2020 ",{"$f":"D30","v":3.12},1.64,0.17,null,null,null,null,null,null,null,null,null,null,null,null,null,null,null,null,null,null,null,null,null,null,null,null,null,{"$f":"MONTH(A31)","v":7},{"$f":"YEAR(A31)","v":2020},12,2020,"July","Dec","July-2020  to Dec-2020 "]
[{"$f":"B31+1","v":"2021-01-01"},"2021-06-30","Jan-2021  to June-2021 ",{"$f":"D31","v":3.12},1.64,0.17,null,null,null,null,null,null,null,null,null,null,null,null,null,null,null,null,null,null,null,null,null,null,null,null,null,{"$f":"MONTH(A32)","v":1},{"$f":"YEAR(A32)","v":2021},6,2021,"Jan","June","Jan-2021  to June-2021 "]
["2021-07-01","2021-12-31","July-2021  to Dec-2021 ",3.68,1.96,0.31,null,null,null,null,null,null,null,null,null,null,null,null,null,null,null,null,null,null,null,null,null,null,null,null,null,7,2021,12,2021,"July","Dec","July-2021  to Dec-2021 "]
["2022-01-01","2022-06-30","Jan-2022  to June-2022 ",3.81,2.0299999999999998,0.34,null,null,null,null,null,null,null,null,null,null,null,null,null,null,null,null,null,null,null,null,null,null,null,null,null,1,2022,6,2022,"Jan","June","Jan-2022  to June-2022 "]
["2022-07-01","2022-12-31","July-2022  to Dec-2022 ",{"$f":"D34","v":3.81},2.0299999999999998,0.38,null,null,null,null,null,null,null,null,null,null,null,null,null,null,null,null,null,null,null,null,null,null,null,null,null,7,2022,12,2022,"July","Dec","July-2022  to Dec-2022 "]
["2023-01-01","2023-06-30","Jan-2023  to June-2023 ",3.81,2.0299999999999998,0.42,null,null,null,null,null,null,null,null,null,null,null,null,null,null,null,null,null,null,null,null,null,null,null,null,null,1,2023,6,2023,"Jan","June","Jan-2023  to June-2023 "]
["2023-07-01","2023-12-31","July-2023  to Dec-2023 ",3.81,2.0299999999999998,0.42,null,null,null,null,null,null,null,null,null,null,null,null,null,null,null,null,null,null,null,null,null,null,null,null,null,7,2023,12,2023,"July","Dec","July-2023  to Dec-2023 "]
["2024-01-01","2024-06-30","Jan-2024  to June-2024 ",3.81,2.0299999999999998,0.42,null,null,null,null,null,null,null,null,null,null,null,null,null,null,null,null,null,null,null,null,null,null,null,null,null,1,2024,6,2024,"Jan","June","Jan-2024  to June-2024 "]
["2024-07-01","2024-12-31","July-2024  to Dec-2024 ",3.81,2.0299999999999998,0.42,null,null,null,null,null,null,null,null,null,null,null,null,null,null,null,null,null,null,null,null,null,null,null,null,null,7,2024,12,2024,"July","Dec","July-2024  to Dec-2024 "]
[]
[]
[null,null,null,null,null,null,null,null,null,null,null,null,null,null,null,null,null,null,null,null,null,null,null,null,null,null,null,null,null,null,null,null,"End Period","Pay Commission","V PAY","VI PAY","VII PAY","DA Rate"]
[null,null,null,null,null,null,null,null,null,null,null,null,null,null,null,null,null,null,null,null,null,null,null,null,null,null,null,null,null,null,null,null,{"$f":"PL!C14","v":"2023-08-31"},{"$f":"'Leave Report'!$B$100","v":"V PAY"},{"$f":"VLOOKUP($AG$43,$A$4:$F$39,4)","v":3.81},{"$f":"VLOOKUP($AG$43,$A$4:$F$39,5)","v":2.0299999999999998},{"$f":"VLOOKUP($AG$43,$A$4:$F$39,6)","v":0.42},{"$f":"IF($AH$43=AI42,AI43,IF($AH$43=AJ42,AJ43,AK43))","v":3.81}]

{"sheet":"Rule","index":16,"n_rows":2,"n_cols":14,"rows_kept":2,"cut":false,"hidden":false,"merged":[[1,13,1,14]]}
[]
[null,null,null,null,null,null,null,null,null,null,null,null,null,"Home"]

{"sheet":"Sheet3","index":17,"n_rows":0,"n_cols":0,"rows_kept":0,"cut":false,"hidden":false,"merged":[]}