{"text_format":"1","workbook":"xlsx","n_sheets":18,"sheets":["Home","Mat Leave","PL","Leave Table","Leave Report","Sheet1","Sheet2","Rules","Leave Print","Blank Format","Data","EOL","Table-Probation","CHART","How to use","DA","Rule","Sheet3"],"not_rendered":{"charts":0,"images":14,"macros":1,"external_links":1,"defined_names":21,"comments":2,"pivot_tables":0},"unopened":[],"bounds":{"document_bytes":16777216,"sheet_cells":100000,"rows_first":2000,"rows_last":500,"rows_between":2000,"halvings":0,"cell_chars":16384,"cell_head_chars":4096},"cells_cut":0,"cells_raw":0,"read":"whole","date_system":"1900"}

{"sheet":"Home","index":0,"n_rows":27,"n_cols":12,"rows_kept":27,"cut":false,"hidden":false,"merged":[[10,2,10,4],[7,11,8,14],[6,0,6,10],[0,1,1,14],[7,1,8,4],[7,6,8,9],[3,1,5,9],[2,0,2,10],[3,11,5,14],[10,6,10,9],[26,1,27,3],[26,5,27,9],[12,11,13,14],[16,11,17,14],[20,11,22,14],[18,1,19,3],[22,1,23,3],[15,5,16,9],[18,5,20,9],[22,5,24,9],[12,1,13,9],[15,1,16,3]]}
[null,"Design & Prepaired by Pravesh Kumar Sharma, Accountant, please call-9460100093 or write mail to  praveshbkn@gmail.com for further query/error/updation/suggestion"]
[]
[]
[null,"Determination of closing balance of Privilege Leave(PL)  at End of Service or any other period",null,null,null,null,null,null,null,null,null,"Home/Back "]
[]
[]
{"$rows_left_out":22}
{"sheet":"Mat Leave","index":1,"n_rows":13,"n_cols":7,"rows_kept":13,"cut":false,"hidden":false,"merged":[[0,6,0,7],[12,0,12,1],[12,2,12,3],[0,0,1,3],[2,2,4,2],[2,3,4,3],[5,0,5,3],[10,0,10,2]]}
["Calculate Maternity Leave under FD order \nF.1(6)FD(Rules)/2021 dated  23-12-2021",null,null,null,null,null,"Home"]
[]
["Child Birth Date","2021-12-24","Total Meternity Leave allowed in days",180]
["Date of Joining in Service","2022-03-04"]
["Maternity Leave applied on","2022-03-07"]
["Result on bais of input data"]
{"$rows_left_out":8}
{"sheet":"PL","index":2,"n_rows":222,"n_cols":20,"rows_kept":222,"cut":false,"hidden":false,"merged":[[4,0,4,1],[4,2,4,4],[4,6,4,7],[12,2,12,3],[17,19,18,20],[6,0,6,7],[14,0,14,3],[13,2,13,3],[16,0,18,3],[7,7,8,7],[18,4,18,7],[12,4,12,6],[11,0,11,7],[10,0,10,4],[0,1,0,2],[0,8,0,9],[33,9,34,10],[1,0,2,7],[29,9,30,10],[14,4,14,6],[13,6,13,7],[13,4,13,5],[15,0,15,4],[17,8,20,8],[15,6,15,7],[19,4,19,7],[12,0,12,1],[13,0,13,1],[19,0,19,3],[0,5,0,6]]}
[null,"Home",null,null,null,"PL Leave Report",null,null,"Home"]
["Design & Prepaired by Pravesh Kumar Sharma, Accountant, please call-9460100093 or write mail to  praveshbkn@gmail.com for further query/error/updation/suggestion"]
[]
[]
["Name of Employe",null,"ABCD",null,null,"Designation","AAO"]
[]
{"$rows_left_out":217}
{"sheet":"Leave Table","index":3,"n_rows":473,"n_cols":99,"rows_kept":473,"cut":false,"hidden":true,"merged":[[13,50,13,52],[14,50,14,52],[15,50,15,52],[16,50,16,52],[472,5,472,6],[463,3,463,4],[464,5,464,6],[471,3,471,4],[1,12,2,12],[243,2,243,3],[9,4,9,5],[9,2,9,3],[3,12,4,12],[5,12,5,13],[1,1,1,2],[9,6,9,7]]}
[]
[null,"Leave_Limit",null,"Max_Limit",null,null,"PL_Limit_Deptt","Annual Leave Limit","CODE","Limit",null,"Monthly Leave Limit","Selected",{"$f":"PL!$G$14","v":"Others Deptt"},null,"Calculation of Last day of month",null,null,{"$f":"DATE(YEAR(P4),12,31)","v":"2023-12-31"},{"$f":"S2-$S$4","v":122},{"$f":"IF(T3>=0,S3,S2)","v":"2023-12-31"},"Date of Birth",{"$f":"PL!#REF!","v":{"$error":"#REF!"}},null,null,null,null,null,1,null,null,null,"Start date","Month end date","Days in month","Days diff",0,null,"Start date/code","Closedate","Days diff","Last day of month condt.",null,null,"today",null,null,null,null,null,null,null,null,null,null,null,null,null,null,null,null,null,null,null,null,null,null,null,null,null,null,null,null,null,null,null,null,null,null,null,null,null,null,null,null,null,null,null,null,null,null,null,null,"Last name","Middle name","First name"]
[null,"1951-04-01","1991-12-31",180,180,180,"Judicial Deptt.",12,"A",{"$f":"TODAY()","v":"2023-05-08"},12,{"$f":"H3/12","v":1},null,{"$f":"INDEX($I$3:$I$6,MATCH($N$2,PL_Limit_Deptt,0))","v":"B"},null,"Start date","month",null,{"$f":"EOMONTH(S2,-6)","v":"2023-06-30"},{"$f":"S3-$S$4","v":-62},null,"Date of Rite.",{"$f":"IF(DAY(W2)>1,DATE(YEAR(W2)+60,MONTH(W2),DAY(EOMONTH(W2,0))),DATE(YEAR(W2)+60,MONTH(W2),DAY(W2)))","v":{"$error":"#REF!"}},null,null,{"$f":"B12","v":"1996-02-20"},{"$f":"INDEX($AJ$7:$AJ$18,MATCH(MONTH(Z3),$AG$7:$AG$18,0))-(EOMONTH(Z3,0)-Z3+1)","v":18},{"$f":"(EOMONTH(Z3,0)-Z3+1)","v":"1900-01-10"},2,null,null,null,{"$f":"D11","v":"1996-02-20"},{"$f":"EOMONTH(AG3,0)","v":"1996-02-29"},{"$f":"MONTH(AH3)","v":2},{"$f":"IF(AH3>B10,B10-AG3+1,AH3-AG3+1)","v":10},{"$f":"IFERROR(DATEDIF(B12,C12,\"M\"),\"\")","v":4},null,{"$f":"AG3","v":"1996-02-20"},{"$f":"E7","v":"1996-06-30"},{"$f":"AN3-AM3+1","v":132},{"$f":"IF(AM5=AM6,\"YES\",\"NO\")","v":"NO"},{"$f":"IF(AM6>1,TRUNC(AO3/31,0),TRUNC(AO3/30,0))","v":4},null,{"$f":"TODAY()","v":"2023-05-08"},null,null,null,null,null,null,null,null,null,null,null,null,null,null,null,null,null,null,null,null,null,null,null,null,null,null,null,null,null,null,null,null,null,null,null,null,null,null,null,null,null,null,null,null,null,null,null,null,"PL_YEAR","PL_DAYS","PL_TYPE","Last name","Middle name","First name"]
[null,"1992-01-01","1997-12-31",240,240,240,"R.A.C Deptt",42,"B",{"$f":"TODAY()","v":"2023-05-08"},42,{"$f":"H4/12","v":3.5},"Leave limit",{"$f":"INDEX($H$3:$H$6,MATCH(N2,PL_Limit_Deptt,0))","v":30},null,{"$f":"B10","v":"2023-08-31"},{"$f":"EOMONTH(P4,-6)","v":"2023-02-28"},null,{"$f":"P4","v":"2023-08-31"},{"$f":"S4-$S$4","v":0},null,null,null,null,null,{"$f":"B13","v":"1996-07-01"},{"$f":"INDEX($AJ$7:$AJ$18,MATCH(MONTH(Z4),$AG$7:$AG$18,0))","v":31},{"$f":"N12","v":10},3,null,null,null,{"$f":"IF(OR(MOD(AG3,400)=0,AND(MOD(AG3,4)=0,MOD(AG3,100)<>0)),\"Leap Year\", \"NOT a Leap Year\")","v":"NOT a Leap Year"},{"$f":"AJ4/4","v":4.5},{"$f":"INDEX(AJ7:AJ18,MATCH(MONTH(AH3),AG7:AG18,0))","v":28},{"$f":"AI4-AJ3","v":18},{"$f":"IF(AJ4>0,AK3,AK3+1)","v":4},"Month Code",{"$f":"MONTH(AM3)","v":2},{"$f":"MONTH(AN3)","v":6},{"$f":"AO3-AK4*AM5","v":20},null,null,null,null,null,null,null,null,null,null,null,null,null,null,null,null,null,null,null,null,null,null,null,null,null,null,null,null,null,null,null,null,null,null,null,null,null,null,null,null,null,null,null,null,null,null,null,null,null,null,null,1,{"$f":"INDEX($BK$12:$BK$56,MATCH(ROWS($CO$4:CO4),$CO$4:$CO$48,0))","v":""},{"$f":"INDEX($BN$12:$BN$56,MATCH(ROWS($CO$4:CP4),$CO$4:$CO$48,0))","v":0},{"$f":"INDEX($BJ$12:$BJ$56,MATCH(ROWS($CO$4:CQ4),$CO$4:$CO$48,0))","v":""},{"$f":"CP4","v":""},{"$f":"CQ4","v":0},{"$f":"CR4","v":""}]
[null,"1998-01-01","2012-12-31",300,300,300,"Vacation Deptt",15,"A","1993-12-31",8,{"$f":"H5/12","v":1.25},null,{"$f":"INDEX($L$3:$L$6,MATCH(N2,PL_Limit_Deptt,0))","v":2.5},null,null,null,null,null,null,null,null,null,null,null,null,null,{"$f":"N13","v":15},4,null,null,null,{"$f":"IF(AG4=\"Leap Year\",1,0)","v":0},{"$f":"IF(AG5>0,\"NO\",\"YES\")","v":"YES"},null,"Diff in year",null,"Days in Month",{"$f":"INDEX($AJ$7:$AJ$18,MATCH(MONTH(AM3),$AG$7:$AG$18,0))","v":28},{"$f":"INDEX($AJ$7:$AJ$18,MATCH(MONTH(AN3),$AG$7:$AG$18,0))","v":30},{"$f":"IF(AO4>0,\"YES\",\"NO\")","v":"YES"},null,"IF(AL3>=AI7,IFERROR(DATEDIF(AI3,AJ3,\"M\")+1,\"\"),",null,null,null,null,null,null,null,null,null,null,null,null,null,null,null,null,null,null,null,null,null,null,null,null,null,null,null,null,null,null,null,null,null,null,null,null,null,null,null,null,null,null,null,null,null,null,null,null,null,2,{"$f":"INDEX($BK$12:$BK$56,MATCH(ROWS($CO$4:CO5),$CO$4:$CO$48,0))","v":""},{"$f":"INDEX($BN$12:$BN$56,MATCH(ROWS($CO$4:CP5),$CO$4:$CO$48,0))","v":0},{"$f":"INDEX($BJ$12:$BJ$56,MATCH(ROWS($CO$4:CQ5),$CO$4:$CO$48,0))","v":""},"",0,""]
[null,"2013-01-01",null,315,300,300,"Others Deptt",30,"B",{"$f":"TODAY()","v":"2023-05-08"},30,{"$f":"H6/12","v":2.5},{"$f":"CONCATENATE(N5,\"  \",\"Days\", \" \")","v":"2.5  Days "},null,null,"start date",{"$f":"D11","v":"1996-02-20"},null,null,"2019-01-01",305,null,null,null,null,null,null,{"$f":"N14","v":15},5,null,null,null,"Month code","Month code","Month name","Day-end","Day-calculted","Count of Days",{"$f":"DAY(AM3)","v":20},{"$f":"DAY(AN3)","v":30},{"$f":"INDEX($AJ$7:$AJ$18,MATCH(MONTH(AM3),$AG$7:$AG$18,0))-(EOMONTH(AM3,0)-AM3+1)","v":18},{"$f":"INDEX($AJ$7:$AJ$18,MATCH(MONTH(AN3),$AG$7:$AG$18,0))-(EOMONTH(AN3,0)-AN3+1)","v":29},null,null,null,null,null,null,null,null,null,null,null,null,null,null,null,null,null,null,null,null,null,null,null,null,null,null,null,null,null,null,null,null,null,null,null,null,null,null,null,null,null,null,null,null,null,null,null,null,null,null,3,{"$f":"INDEX($BK$12:$BK$56,MATCH(ROWS($CO$4:CO6),$CO$4:$CO$48,0))","v":""},{"$f":"INDEX($BN$12:$BN$56,MATCH(ROWS($CO$4:CP6),$CO$4:$CO$48,0))","v":0},{"$f":"INDEX($BJ$12:$BJ$56,MATCH(ROWS($CO$4:CQ6),$CO$4:$CO$48,0))","v":""},"",0,""]
{"$rows_left_out":468}
{"sheet":"Leave Report","index":4,"n_rows":100,"n_cols":16,"rows_kept":100,"cut":false,"hidden":false,"merged":[[0,5,1,8],[4,2,4,3],[3,2,3,3],[87,0,87,1],[3,4,3,5],[3,7,3,8],[3,0,3,1],[4,4,4,11],[0,0,0,1],[2,0,2,2],[2,3,2,11],[88,0,88,11],[89,0,89,3],[90,0,90,2],[91,0,91,2],[92,0,92,2],[89,4,89,7],[89,8,89,11],[90,4,90,6],[91,4,91,6],[92,4,92,6],[90,8,90,11],[95,0,95,11],[96,2,98,3],[96,1,98,1],[96,0,98,0],[91,8,93,11],[94,8,94,11],[93,0,93,2],[94,0,94,2],[94,4,94,6],[93,4,93,6],[99,2,99,3],[96,4,98,4],[96,5,98,6],[99,5,99,6],[96,7,98,11],[99,7,99,11]]}
["Home",null,null,null,null,"Back to PL Calculation"]
[]
["Name of Employee & Designation",null,null,{"$f":"CONCATENATE(PL!C5,\", \",PL!G5)","v":"ABCD, AAO"}]
["Calculation period",null,"Max. leave in month",null,"Opening Balance",null,{"$f":"'Leave Table'!R10","v":0},"Max. Limit",null,null,null,300]
[{"$f":"'Leave Table'!D11","v":"1996-02-20"},{"$f":"'Leave Table'!B10","v":"2023-08-31"},{"$f":"PL!H15","v":"2.5  Days "},null,"Leave treatment in period",null,null,null,null,null,null,null,null,"Opening Balance",null,300]
["Start_Period","End_Period","Days Gap","Earned Leave in period","Leave Balance Year","Leave Taken in Year","Surrender Leave","Joining Time","Leave Adjut.","Closing Balance (A)","Maxi Leave Limit","Closing\n Balance ",null,"Start_Period","End_Period","Days Gap"]
{"$rows_left_out":95}
{"sheet":"Sheet1","index":5,"n_rows":41,"n_cols":9,"rows_kept":41,"cut":false,"hidden":true,"merged":[]}
["Option Explicit",null,null,null,null,null,null,null,"Option Explicit"]
["Private Sub Worksheet_Activate()",null,null,null,null,null,null,null," "]
["    Dim r As Range, c As Range",null,null,null,null,null,null,null,"Private Sub Worksheet_Activate()"]
["Set r = Range(\"a6:a86\")",null,null,null,null,null,null,null,"     "]
["Application.ScreenUpdating = False",null,null,null,null,null,null,null,"    Dim HiddenRow&, RowRange As Range, RowRangeValue&"]
["For Each c In r",null,null,null,null,null,null,null,"     "]
{"$rows_left_out":36}
{"sheet":"Sheet2","index":6,"n_rows":68,"n_cols":2,"rows_kept":68,"cut":false,"hidden":true,"merged":[]}
["1983-03-30","1983-04-23"]
["1983-09-13","1983-09-13"]
["1983-09-20","1983-09-21"]
["1984-03-29","1984-03-30"]
["1984-04-04","1984-04-05"]
["1984-04-16","1984-04-17"]
{"$rows_left_out":63}
{"sheet":"Rules","index":7,"n_rows":53,"n_cols":13,"rows_kept":53,"cut":false,"hidden":false,"merged":[[8,3,8,6],[9,3,9,6],[10,3,10,6],[12,1,12,2],[12,3,12,6],[12,0,13,0],[11,0,11,6],[6,3,6,6],[0,5,0,6],[32,0,32,6],[17,3,17,4],[15,5,15,6],[16,5,16,6],[17,5,17,6],[5,0,5,6],[7,3,7,6],[13,3,13,4],[13,5,13,6],[14,3,14,4],[14,5,14,6],[6,0,6,1],[35,0,35,6],[1,0,4,6],[25,0,25,6],[26,1,26,4],[26,5,26,6],[30,0,31,6],[27,5,27,6],[28,5,28,6],[18,0,19,6],[20,0,20,6],[21,0,24,4],[21,5,24,6],[15,3,15,4],[16,3,16,4],[29,5,29,6],[27,1,29,4],[36,3,36,6],[37,3,38,6],[41,0,42,6],[39,3,40,6],[39,0,40,0],[39,1,40,1],[37,1,38,1],[37,2,38,2],[37,0,38,0],[39,2,40,2]]}
[null,null,null,null,null,"Home"]
["उपार्जित अवकाश के सामान्य नियम/उपनियम/दिशा-निर्देशों का उल्लेख यंहा पृथक से नहीं किया जा रहा है क्योंकि ये समस्त जानकारियां यूजर को सहज रूप से उपलब्ध है। अतः कुछ विशिष्ट संकलित जानकारियां जो सामान्य रूप से यूजर को उपलब्ध नहीं होती है, को प्रस्तुत किया जा रहा है ।       \n      "]
[]
[]
[]
["Maximum Privilege leave (PL) limit [see rule 91(1)(c )]"]
{"$rows_left_out":48}
{"sheet":"Leave Print","index":8,"n_rows":49,"n_cols":14,"rows_kept":49,"cut":false,"hidden":false,"merged":[[6,0,7,0],[6,1,7,5],[8,1,8,5],[6,6,7,10],[8,6,8,7],[2,0,2,10],[3,0,3,10],[4,1,4,5],[4,6,4,10],[5,1,5,5],[5,6,5,10],[16,0,19,0],[16,1,19,5],[14,6,15,10],[16,6,19,10],[9,0,10,0],[9,1,10,5],[9,6,10,10],[11,0,13,0],[11,1,13,5],[11,6,12,10],[45,7,45,10],[46,0,48,0],[46,1,48,5],[47,6,47,10],[48,7,48,10],[0,9,0,10],[1,9,1,10],[0,11,1,11],[39,0,41,0],[39,1,40,10],[37,0,37,10],[20,0,21,0],[20,1,21,5],[22,0,26,0],[22,1,26,1],[20,6,21,10],[32,6,32,10],[33,7,33,10],[34,0,36,0],[34,1,36,5],[14,0,15,0],[31,0,33,0],[32,1,33,5],[38,0,38,10],[35,6,35,10],[36,7,36,10],[22,2,25,10],[26,3,26,10],[3,13,3,14],[44,6,44,10],[27,1,30,1],[27,2,30,10],[14,1,15,5],[6,13,7,15]]}
[null,null,null,null,null,null,null,null,null,"lkekU; la- 45",null,1]
[null,null,null,null,null,null,null,null,null,"th-,Q-,-vkj- 64"]
["राजस्थान सरकार"]
["राजस्थान सेवा नियमों के अन्तर्गत अवकाश के लिए आवेदन-पत्र का प्रपत्र",null,null,null,null,null,null,null,null,null,null,null,null,"Home"]
["1.","आवेदक का नाम",null,null,null,null,{"$f":"IF(INDEX(Data!$B$9:$B$58,MATCH('Leave Print'!$L$1,Data!$A$9:$A$58,0))=\"\",\"\",INDEX(Data!$B$9:$B$58,MATCH('Leave Print'!$L$1,Data!$A$9:$A$58,0)))","v":",chlhMh"}]
["2.","पद नाम",null,null,null,null,{"$f":"IF(INDEX(Data!$C$9:$C$58,MATCH('Leave Print'!$L$1,Data!$A$9:$A$58,0))=\"\",\"\",INDEX(Data!$C$9:$C$58,MATCH('Leave Print'!$L$1,Data!$A$9:$A$58,0)))","v":"lgk;d ys[kkf/kdkjh xzsM&izFke"}]
{"$rows_left_out":44}
{"sheet":"Blank Format","index":9,"n_rows":45,"n_cols":13,"rows_kept":45,"cut":false,"hidden":false,"merged":[[0,0,0,10],[1,0,1,10],[2,1,2,5],[2,6,2,10],[3,1,3,5],[3,6,3,10],[4,0,5,0],[4,1,5,5],[4,6,4,10],[5,6,5,10],[6,1,6,5],[6,6,6,10],[7,0,8,0],[7,1,8,5],[7,6,8,10],[9,0,11,0],[9,1,11,5],[9,6,9,10],[12,0,13,0],[12,1,13,5],[12,6,12,10],[14,0,16,0],[14,1,16,5],[14,6,14,10],[17,0,18,0],[17,1,18,5],[17,6,17,10],[19,0,22,0],[19,1,22,1],[19,2,22,10],[42,0,44,0],[42,1,44,5],[43,6,43,10],[44,7,44,10],[34,0,34,10],[0,12,0,13],[35,0,37,0],[35,1,36,10],[40,6,40,10],[41,7,41,10],[23,1,26,1],[23,2,26,10],[27,0,29,0],[28,1,29,5],[28,6,28,10],[29,7,29,10],[30,0,32,0],[30,1,32,5],[31,6,31,10],[32,7,32,10],[33,0,33,10]]}
["राजस्थान सरकार",null,null,null,null,null,null,null,null,null,null,null,"Home"]
["राजस्थान सेवा नियमों के अन्तर्गत अवकाश के लिए आवेदन-पत्र का प्रपत्र"]
["1.","आवेदक का नाम"]
["2.","पद नाम"]
["3.","विभाग, कार्यालय और अनुभाग"]
[]
{"$rows_left_out":40}
{"sheet":"Data","index":10,"n_rows":209,"n_cols":28,"rows_kept":209,"cut":false,"hidden":false,"merged":[[54,7,54,8],[55,7,55,8],[56,7,56,8],[57,7,57,8],[49,7,49,8],[50,7,50,8],[51,7,51,8],[52,7,52,8],[53,7,53,8],[44,7,44,8],[45,7,45,8],[46,7,46,8],[47,7,47,8],[48,7,48,8],[39,7,39,8],[40,7,40,8],[41,7,41,8],[42,7,42,8],[43,7,43,8],[34,7,34,8],[35,7,35,8],[36,7,36,8],[37,7,37,8],[38,7,38,8],[29,7,29,8],[30,7,30,8],[31,7,31,8],[32,7,32,8],[33,7,33,8],[24,7,24,8],[25,7,25,8],[26,7,26,8],[27,7,27,8],[28,7,28,8],[19,7,19,8],[20,7,20,8],[21,7,21,8],[22,7,22,8],[23,7,23,8],[14,7,14,8],[15,7,15,8],[16,7,16,8],[17,7,17,8],[18,7,18,8],[9,7,9,8],[10,7,10,8],[11,7,11,8],[12,7,12,8],[13,7,13,8],[7,9,7,13],[4,12,4,13],[2,14,4,14],[2,9,3,11],[8,7,8,8],[2,7,6,8],[2,0,6,0],[2,1,6,1],[2,2,6,2],[2,3,6,4],[2,6,6,6],[0,9,1,11],[0,21,1,23],[0,1,0,2],[0,17,0,18],[8,17,8,19],[8,20,8,21],[2,22,4,22],[8,3,8,4],[7,20,7,21],[7,3,7,4],[7,7,7,8],[7,15,7,16],[7,17,7,19],[2,15,6,16],[2,17,6,19],[2,20,6,21]]}
[null,"Home",null,null,null,null,null,null,null,"Print Leave Application",null,null,null,null,null,null,null,"Home",null,null,null,"Print Leave Application"]
[]
["Øe la[;k","आवेदक का नाम","पद नाम","कार्यालय और अनुभाग",null,null,"वेतन","गृह किराया भत्ता, सवारी भत्ता, या वर्तमान पद पर प्राप्त अन्य क्षतिपूर्ति भत्ता",null,"आवेदित अवकाश का प्रकार और उसकी अवधि तथा दिनांक जिससे उसकी आवश्यकता है",null,null,null,null,"रविवार तथा छुट्टियां यदि कोई हो, जिन्हें अवकाश के पहले या बाद में जोड़ने का प्रस्ताव हो","रविवार तथा छुट्टियां यदि कोई हो, जिन्हें अवकाश के पहले या बाद में जोड़ने का प्रस्ताव हो",null,"अवकाश के लिए आवेदन देने के कारण (यदि वह मुख्यालय के बाहर जाने का विचार रखता हो तो विभिन्न स्थानों का पूरा पता, जहां उनके जाने की सम्भावना हो)",null,null,"गत अवकाश से लौटने का दिनांक तथा उस अवकाश का प्रकार तथा अवधि",null,"अवकाश का पता:-",null,null,null,null,"Type of Leave"]
[null,null,null,null,null,null,null,null,null,null,null,null,null,null,null,null,null,null,null,null,null,null,null,null,null,null,null,"उपार्जित अवकाश"]
[null,null,null,null,null,null,null,null,null,"Type of Leave","From","To","Total Period",null,null,null,null,null,null,null,null,null,null,null,null,null,null,"समर्पित अवकाश"]
[]
{"$rows_left_out":204}
{"sheet":"EOL","index":11,"n_rows":18,"n_cols":6,"rows_kept":18,"cut":false,"hidden":false,"merged":[[17,1,17,2],[5,3,6,3],[7,3,8,3],[7,4,8,4],[9,3,10,3],[9,4,10,4],[14,3,14,4],[13,3,13,4],[15,3,15,4],[11,3,12,3],[11,4,12,4],[15,0,15,1],[3,0,3,2],[3,3,3,4],[4,3,4,4],[0,5,0,6],[0,0,1,4],[2,0,2,4]]}
["It is try to accurate calcuation but if you found any  error, please inform for correction with its soluation (if possible) and mail (praveshbkn@gmail.com) to me for further development/benefited to all ",null,null,null,null,"Home"]
[]
["Treatment of Extraordinary leave for Probation-trainees"]
["Enter your EOL period(dd/mm/yyyy)",null,null,"Output"]
["From","To","Days","Competent Authority (in days limit)"]
["2022-04-01","2022-06-30",{"$f":"IF(B6=\"\",\"\",1+B6-A6)","v":91},"Appointing authority",{"$f":"'Table-Probation'!F10","v":"Upto 30  Days"}]
{"$rows_left_out":13}
{"sheet":"Table-Probation","index":12,"n_rows":25,"n_cols":11,"rows_kept":25,"cut":false,"hidden":true,"merged":[[0,5,0,6],[22,2,22,3]]}
[null,null,null,null,null,"Competent Authority (in days limit)"]
[null,null,"FROM","TO","CODE","Appointing authority","Administrative Department","PB extend","Appointing authority","Administrative Department","GOV ORDER"]
[null,null,"2004-04-01","2014-06-11","A",90,{"$f":"F3+1","v":91},{"$f":"IF('Table-Probation'!$E$10<F3,0,IF($E$9=E3,'Table-Probation'!$E$10-F3,\"N.A.\"))","v":"N.A."},{"$f":"IF('Table-Probation'!$E$10>F3,F3,'Table-Probation'!$E$10)","v":90},{"$f":"IF('Table-Probation'!$E$10>G3,'Table-Probation'!$E$10-F3)","v":false},"F.1 (2)FD/Rules/2006 Pt-I Dated 11-06-2014"]
[null,null,{"$f":"D3+1","v":"2014-06-12"},"2019-08-07","B",30,{"$f":"F4+1","v":31},{"$f":"IF('Table-Probation'!$E$10<F4,0,IF($E$9=E4,'Table-Probation'!$E$10-F4,\"N.A.\"))","v":"N.A."},{"$f":"IF('Table-Probation'!$E$10>F4,F4,'Table-Probation'!$E$10)","v":30},{"$f":"IF('Table-Probation'!$E$10>G4,'Table-Probation'!$E$10-F4)","v":61},"No. F. l(2)FD/RuIes/2006-I Dated 08-08-2019"]
[null,null,"2019-08-08",null,"C",30,{"$f":"F5+1","v":31},{"$f":"IF('Table-Probation'!$E$10<F5,0,IF($E$9=E5,'Table-Probation'!$E$10,\"N.A.\"))","v":91},{"$f":"IF('Table-Probation'!$E$10>F5,F5,'Table-Probation'!$E$10)","v":30},{"$f":"IF('Table-Probation'!$E$10>G5,'Table-Probation'!$E$10-F5)","v":61},"F.1 (2)FD/Rules/2006 Pt-I Dated 06-01-2020"]
[]
{"$rows_left_out":20}
{"sheet":"CHART","index":13,"n_rows":39,"n_cols":4,"rows_kept":39,"cut":false,"hidden":false,"merged":[[24,1,28,3],[24,0,28,0],[29,1,30,3],[31,1,32,3],[33,1,37,3],[38,1,42,3],[29,0,30,0],[31,0,32,0],[33,0,37,0],[38,0,42,0],[21,0,21,1],[21,2,21,3],[22,0,23,3],[19,1,19,3],[20,1,20,3],[17,1,17,3],[18,1,18,3],[3,0,3,1],[3,2,3,3],[7,0,7,1],[7,2,7,3],[4,3,6,3],[11,3,12,3],[13,0,13,3],[10,0,10,1],[10,2,10,3],[8,3,9,3],[0,2,0,3],[1,0,1,2],[14,1,14,3],[15,1,15,3],[16,1,16,3]]}
[null,null,"Home"]
[]
["S.N.","Extraordinary leave period","Competent Authority to sanction leave","Probation Period extended"]
["FD Memorandum",null,"No. F.1(2)FD/Rules/06 Pt.I Dated 11 June 2014."]
[1,"Upto three months","Appointing Authority","the probation period will be extended for the period of extraordinary leave taken beyond one month."]
[2,"Beyond three months but period not more than one year.","Appointing Authority with the approval of Administrative Department."]
{"$rows_left_out":34}
{"sheet":"How to use","index":14,"n_rows":21,"n_cols":5,"rows_kept":21,"cut":false,"hidden":false,"merged":[[20,0,21,6],[0,0,0,1],[0,4,0,6],[1,0,2,6],[3,0,5,6],[16,0,19,6],[6,0,7,6],[8,0,9,6],[10,0,11,6],[12,0,13,6],[14,0,15,6]]}
["Home",null,null,null,"Back PL Calculation"]
["The main purpose of this axle seat is to match the earned leave earned/utilized during the service of an employee on retirement or other any stage , as required"]
[]
["Prior to 01-01-1983, earned leave was not calculated as today basis  Therefore, if any employee is in the period before this period, then the initial balance has to be written in cell B10, in addition to this zero should be filled in all the cases."]
[]
[]
{"$rows_left_out":16}
{"sheet":"DA","index":15,"n_rows":43,"n_cols":38,"rows_kept":43,"cut":false,"hidden":false,"merged":[[39,0,39,4],[0,4,0,5],[1,0,1,1],[1,2,1,4]]}
[null,null,null,null,"Home"]
["Periods",null,"DA Rate",null,null,null,null,null,null,null,null,null,null,null,null,null,null,null,null,null,null,null,null,null,null,null,null,null,null,null,null,"MONTH","YEAR","MONTH","YEAR"]
["Start Period","End Period","Period","V PAY","VI PAY","VII PAY",null,null,null,null,null,null,null,null,null,null,null,null,null,null,null,null,null,null,null,null,null,null,null,1,"Jan"]
["2007-01-01","2007-06-30",{"$f":"AL4","v":"Jan-2007  to June-2007 "},0.35,0.06,null,null,null,null,null,null,null,null,null,null,null,null,null,null,null,null,null,null,null,null,null,null,null,null,2,"Feb",{"$f":"MONTH(A4)","v":1},{"$f":"YEAR(A4)","v":2007},{"$f":"MONTH(B4)","v":6},{"$f":"YEAR(B4)","v":2007},{"$f":"INDEX($AE$3:$AE$14,MATCH(AF4,$AD$3:$AD$23,0))","v":"Jan"},{"$f":"INDEX($AE$3:$AE$14,MATCH(AH4,$AD$3:$AD$23,0))","v":"June"},{"$f":"CONCATENATE(AJ4,\"-\",AG4,\"  \",\"to \",  AK4,\"-\",AI4,\" \")","v":"Jan-2007  to June-2007 "}]
[{"$f":"B4+1","v":"2007-07-01"},"2007-12-31","July-2007  to Dec-2007 ",0.41,0.09,null,null,null,null,null,null,null,null,null,null,null,null,null,null,null,null,null,null,null,null,null,null,null,null,3,"March",7,2007,12,2007,{"$f":"INDEX($AE$3:$AE$14,MATCH(AF5,$AD$3:$AD$23,0))","v":"July"},{"$f":"INDEX($AE$3:$AE$14,MATCH(AH5,$AD$3:$AD$23,0))","v":"Dec"},{"$f":"CONCATENATE(AJ5,\"-\",AG5,\"  \",\"to \",  AK5,\"-\",AI5,\" \")","v":"July-2007  to Dec-2007 "}]
[{"$f":"B5+1","v":"2008-01-01"},"2008-06-30","Jan-2008  to June-2008 ",0.47,0.12,null,null,null,null,null,null,null,null,null,null,null,null,null,null,null,null,null,null,null,null,null,null,null,null,4,"April",1,2008,6,2008,"Jan","June","Jan-2008  to June-2008 "]
{"$rows_left_out":38}
{"sheet":"Rule","index":16,"n_rows":2,"n_cols":14,"rows_kept":2,"cut":false,"hidden":false,"merged":[[1,13,1,14]]}
[]
[null,null,null,null,null,null,null,null,null,null,null,null,null,"Home"]

{"sheet":"Sheet3","index":17,"n_rows":0,"n_cols":0,"rows_kept":0,"cut":false,"hidden":false,"merged":[]}