{"text_format":"1","workbook":"xlsx","n_sheets":4,"sheets":["Master","GA 55","Extra deduc","COMPUTATION"],"not_rendered":{"charts":0,"images":1,"macros":1,"external_links":1,"defined_names":2,"comments":0,"pivot_tables":0},"unopened":[],"bounds":{"document_bytes":16777216,"sheet_cells":100000,"rows_first":2000,"rows_last":500,"rows_between":2000,"halvings":0,"cell_chars":16384,"cell_head_chars":4096},"cells_cut":0,"cells_raw":0,"read":"whole","date_system":"1900"}

{"sheet":"Master","index":0,"n_rows":29,"n_cols":27,"rows_kept":29,"cut":false,"hidden":false,"merged":[[28,5,28,7],[13,9,13,13],[27,2,27,10],[6,3,6,8],[0,2,0,10],[7,10,7,13],[10,10,10,12],[11,10,11,12],[12,10,12,12],[16,7,16,8],[17,7,17,8],[14,1,14,2],[14,3,14,4],[14,5,14,6],[14,7,14,8],[12,1,12,2],[13,1,13,2],[13,3,13,4],[13,5,13,6],[13,7,13,8],[19,0,20,0],[16,3,16,4],[17,3,17,4],[16,1,16,2],[17,5,17,6],[17,1,17,2],[11,1,11,2],[11,3,11,4],[11,5,11,6],[11,7,11,8],[12,3,12,4],[12,5,12,6],[12,7,12,8],[8,7,8,8],[9,3,9,4],[9,5,9,6],[9,7,9,8],[10,1,10,2],[10,3,10,4],[10,5,10,6],[10,7,10,8],[4,1,4,3],[22,4,22,7],[3,2,3,3],[3,5,3,7],[1,1,1,3],[1,5,1,7],[2,1,2,3],[2,5,2,7],[4,5,4,7],[5,1,5,3],[5,5,5,7],[7,1,7,2],[7,3,7,8],[8,1,8,2],[8,3,8,4],[8,5,8,6]]}
[null,null,"EMPLOYEE  PERSONAL  DETAIL"]
[null,"              D;k vkius lefiZr osru fy;k gS \\",null,null,"YES",";fn gk¡ rks ekg dks lysDV djsaA",null,null,"OCT",null,null,null,null,null,null,null,null,null,"YES","JAN",8,"GPF","Jaipur (U.A.)",null,"Regular Pay",null,"2019-03-01"]
[null,"         vki fdl vk;q oxZ dh Js.kh esa vkrs gS \\",null,null,"Under 60","           D;k vkidks cksul feyk gS \\  %&",null,null,"YES",6774,null,{"$f":"UPPER(IF(Master!H9=\"\",\"\",Master!H9))","v":"SR TEACHER"},null,null,null,null,null,null,"NO",{"$f":"UPPER(IF(Master!D10=\"\",\"\",Master!D10))","v":"G.S.S.S. INDERWARA"},9,"NPS","Ajmer",null,"Fix Pay",null,"2019-04-01"]
[null,null,"foadykax HkÙkk %&",null,600,"  vkidks osru fey jgk gS %&",null,null,"Regular Pay",null,{"$f":"IF(AND(Master!I5=Master!V3),\"\",Master!D13)","v":112233},null,null,null,null,null,{"$f":"IF(AND(Master!I5=Master!V2),\"\",Master!D14)","v":""},null,null,"MAR",10,null,"Bikaner",null,{"$f":"IF(AND(Master!D15=\"\"),\"\",Master!D15)","v":51046657419},null,"2019-05-01"]
[null,"    7th PAY  HRA izfr'kr esa %&",null,null,8,"%                      GPF / NPS :- ",null,null,"GPF",null,null,null,null,null,null,null,null,null,null,"APR",12,null,"Jodhpur",null,null,null,"2019-06-01"]
[null,"CCA yxrk gSa rks sellect Yes / No   %&",null,null,"YES"," CCA ykxw gks rks CITY lysDV djsa %&",null,null,"Jodhpur",null,null,null,null,null,null,null,null,null,null,"MAY",16,null,"Kota",null,null,null,"2019-07-01"]
[null,null,null,"First Unlock Cell Entry Fill Up Then Click On Generate Button",null,null,null,null,null,null,null,null,null,null,null,null,null,null,null,"JUN",20,null,null,null,null,null,"2019-08-01"]
[null,"Office Name :-",null,"Government Sr. Secondary School INDERWARA , Rani (Pali)",null,null,null,null,null,null,"ije~ iwT; xw:nso Jh Jh 1008 oklwnso th egkjkt",null,null,null,null,null,null,null,null,"JUL",null,null,null,1000,null,null,"2019-09-01"]
[null,"Employee Name :-",null,"Heeralal jat",null,"Designation :-",null,"Sr Teacher",null,null,null,null,null,null,null,null,null,null,null,"AUG",null,null,null,620,null,null,"2019-10-01"]
[null,null,"Posting Place :-","G.S.S.S. Inderwara",null,"DDO Name :-",null,"Mishrilal",null,null,null,null,null,null,null,null,null,null,null,"SEP",null,null,null,null,null,null,"2019-11-01"]
{"$rows_left_out":20}
{"sheet":"GA 55","index":1,"n_rows":30,"n_cols":47,"rows_kept":30,"cut":false,"hidden":true,"merged":[[3,24,3,26],[2,0,2,2],[28,3,28,7],[28,18,28,24],[4,0,4,11],[4,12,4,23],[4,25,5,25],[2,3,2,7],[4,24,5,24],[4,26,5,26],[26,0,26,1],[2,25,2,26],[2,8,2,10],[2,11,2,14],[2,15,2,18],[2,19,2,24],[3,16,3,20],[3,21,3,23],[3,0,3,1],[3,2,3,4],[3,6,3,8],[3,10,3,12],[3,13,3,15]]}
[]
[]
["Employee Name :-",null,null,{"$f":"UPPER(IF(Master!D9=\"\",\"\",Master!D9))","v":"HEERALAL JAT"},null,null,null,null,"Designation :-",null,null,{"$f":"UPPER(IF(Master!H9=\"\",\"\",Master!H9))","v":"SR TEACHER"},null,null,null,"Posting Place :-",null,null,null,{"$f":"UPPER(IF(Master!D10=\"\",\"\",Master!D10))","v":"G.S.S.S. INDERWARA"},null,null,null,null,null,"osru Mªk ekufp="]
["PAN No. :-",null,{"$f":"UPPER(IF(Master!D12=\"\",\"\",Master!D12))","v":"ADTXXXXXX2"},null,null,"SI No.",{"$f":"IF(AND(Master!H13=\"\"),\"\",Master!H13)","v":123456},null,null,"GPF",{"$f":"IF(AND(Master!I5=Master!V3),\"\",Master!D13)","v":112233},null,null,"PRAN No. :-",null,null,{"$f":"IF(AND(Master!I5=Master!V2),\"\",Master!D14)","v":""},null,null,null,null,"Bank A/C.",null,null,{"$f":"IF(AND(Master!D15=\"\"),\"\",Master!D15)","v":51046657419}]
["Total Allowances",null,null,null,null,null,null,null,null,null,null,null,"Deductions",null,null,null,null,null,null,null,null,null,null,null,"NET PAY","TV.NO.","Enc.  DATE"]
["S.R.","Month","Basic With Grade Pay","DA","HRA",{"$f":"Master!B20","v":"Wash All."},{"$f":"Master!C20","v":"Handi. All."},"Bonus",{"$f":"Master!D20","v":"CCA"},"N.P.S. By Govt.",{"$f":"Master!E20","v":"other"},"Total","SI","GPF","RPMF","N.P.S. By SELF",{"$f":"Master!H20","v":"L.I.C."},{"$f":"Master!I20","v":"S.I. LOAN"},{"$f":"Master!J20","v":"GPF LOAN"},{"$f":"Master!K20","v":"Other"},"Income Tax","G.I. + S. Tax",{"$f":"Master!K20","v":"Other"},"Total Ded."]
[1,{"$f":"IF(AND(AT7=\"\"),\"\",AP7)","v":"2019-03-01"},{"$f":"IF(AND(B7=\"\"),\"\",AT7)","v":45100},{"$f":"IF(AND(Master!$I$4=Master!$Y$3),\"\",IF(AND(C7=\"\"),\"\",ROUND(12%*C7,0)))","v":5412},{"$f":"IF(AND(Master!$I$4=Master!$Y$3),\"\",IF(AND(C7=\"\"),\"\",ROUND(Master!$E$5%*C7,0)))","v":3608},{"$f":"IF(AND(C7=\"\"),\"\",IF(AND(Master!$B$21=\"\"),\"\",Master!$B$21))","v":""},{"$f":"IF(AND(C7=\"\"),\"\",IF(AND(Master!$C$21=\"\"),\"\",Master!$C$21))","v":""},null,{"$f":"IF(AND(C7=\"\"),\"\",IF(AND(Master!$D$21=\"\"),\"\",Master!$D$21))","v":""},{"$f":"IF(AND(Master!I$5=Master!V$2),\"\",IF(AND(Master!I$4=Master!Y$3),ROUND((C7)*0.1,0),IF(AND(Master!I$5=Master!V$3),ROUND((C7+D7)*0.1,0),\"\")))","v":""},{"$f":"IF(AND(C7=\"\"),\"\",IF(AND(Master!$E$21=\"\"),\"\",Master!$E$21))","v":""},{"$f":"IF(AND(B7=\"\"),\"\",SUM(C7,D7,E7,F7,G7,I7,K7))","v":54120},{"$f":"IF(AND(C7=\"\"),\"\",IF(AND(Master!$I$4=Master!$Y$3),\"\",Master!$F$21))","v":4000},{"$f":"IF(AND(C7=\"\"),\"\",IF(AND(Master!$I$4=Master!$Y$3),\"\",IF(AND(Master!$I$5=Master!$V$3),\"\",Master!$G$21)))","v":3575},{"$f":"IF(AND(B7=\"\"),\"\",IF(AND(Master!$I$4=Master!$Y$3),\"\",IF(AND(Master!$I$5=Master!$V$3),\"\",IF(C7<18001,228,IF(C7<33501,379,IF(C7<54001,568,755))))))","v":568},{"$f":"IF(AND(Master!I$5=Master!V$2),\"\",IF(AND(Master!I$4=Master!Y$3),ROUND((C7)*0.1,0),IF(AND(Master!I$5=Master!V$3),ROUND((C7+D7)*0.1,0),\"\")))","v":""},{"$f":"IF(AND(C7=\"\"),\"\",IF(AND(Master!$I$4=Master!$Y$3),\"\",Master!$H$21))","v":2178},{"$f":"IF(AND(C7=\"\"),\"\",IF(AND(Master!$I$4=Master!$Y$3),\"\",Master!$H$21))","v":2178},{"$f":"IF(AND(C7=\"\"),\"\",IF(AND(Master!$I$4=Master!$Y$3),\"\",Master!$I$21))","v":0},{"$f":"IF(AND(C7=\"\"),\"\",IF(AND(Master!$I$4=Master!$Y$3),\"\",Master!$K$21))","v":0},{"$f":"IF(AND(C7=\"\"),\"\",IF(AND(Master!$I$4=Master!$Y$3),\"\",Master!B25))","v":200},null,{"$f":"IF(AND(C7=\"\"),\"\",IF(AND(Master!$I$4=Master!$Y$3),\"\",Master!$L$21))","v":0},{"$f":"IF(AND(B7=\"\"),\"\",SUM(M7:W7))","v":12699},{"$f":"IF(AND(B7=\"\"),\"\",IF(AND(L7=\"\",X7=\"\"),\"\",SUM(L7-X7)))","v":41421},null,null,null,null,null,null,null,null,null,null,null,null,null,null,null,"MAR","2019-03-01",3,null,{"$f":"$AR$10","v":45100},{"$f":"IF(AND(AP7<$AR$11),\"\",IF(AND(AP7>$AR$12),\"\",AS7))","v":45100},{"$f":"ROUND(12%*AS7,0)","v":5412}]
[2,{"$f":"IF(AND(AT8=\"\"),\"\",AP8)","v":"2019-04-01"},{"$f":"IF(AND(B8=\"\"),\"\",AT8)","v":45100},{"$f":"IF(AND(Master!$I$4=Master!$Y$3),\"\",IF(AND(C8=\"\"),\"\",ROUND(12%*C8,0)))","v":5412},{"$f":"IF(AND(Master!$I$4=Master!$Y$3),\"\",IF(AND(C8=\"\"),\"\",ROUND(Master!$E$5%*C8,0)))","v":3608},{"$f":"IF(AND(C8=\"\"),\"\",IF(AND(Master!$B$21=\"\"),\"\",Master!$B$21))","v":""},{"$f":"IF(AND(C8=\"\"),\"\",IF(AND(Master!$C$21=\"\"),\"\",Master!$C$21))","v":""},null,{"$f":"IF(AND(C8=\"\"),\"\",IF(AND(Master!$D$21=\"\"),\"\",Master!$D$21))","v":""},{"$f":"IF(AND(Master!I$5=Master!V$2),\"\",IF(AND(Master!I$4=Master!Y$3),ROUND((C8)*0.1,0),IF(AND(Master!I$5=Master!V$3),ROUND((C8+D8)*0.1,0),\"\")))","v":""},{"$f":"IF(AND(C8=\"\"),\"\",IF(AND(Master!$E$21=\"\"),\"\",Master!$E$21))","v":""},{"$f":"IF(AND(B8=\"\"),\"\",SUM(C8,D8,E8,F8,G8,I8,K8))","v":54120},{"$f":"IF(AND(C8=\"\"),\"\",IF(AND(Master!$I$4=Master!$Y$3),\"\",Master!$F$21))","v":4000},{"$f":"IF(AND(C8=\"\"),\"\",IF(AND(Master!$I$4=Master!$Y$3),\"\",IF(AND(Master!$I$5=Master!$V$3),\"\",Master!$G$21)))","v":3575},{"$f":"IF(AND(B8=\"\"),\"\",IF(AND(Master!$I$4=Master!$Y$3),\"\",IF(AND(Master!$I$5=Master!$V$3),\"\",IF(C8<18001,242,IF(C8<33501,402,IF(C8<54001,602,800))))))","v":602},{"$f":"IF(AND(Master!I$5=Master!V$2),\"\",IF(AND(Master!I$4=Master!Y$3),ROUND((C8)*0.1,0),IF(AND(Master!I$5=Master!V$3),ROUND((C8+D8)*0.1,0),\"\")))","v":""},{"$f":"IF(AND(C8=\"\"),\"\",IF(AND(Master!$I$4=Master!$Y$3),\"\",Master!$H$21))","v":2178},{"$f":"IF(AND(C8=\"\"),\"\",IF(AND(Master!$I$4=Master!$Y$3),\"\",Master!$H$21))","v":2178},{"$f":"IF(AND(C8=\"\"),\"\",IF(AND(Master!$I$4=Master!$Y$3),\"\",Master!$I$21))","v":0},{"$f":"IF(AND(C8=\"\"),\"\",IF(AND(Master!$I$4=Master!$Y$3),\"\",Master!$K$21))","v":0},{"$f":"IF(AND(C8=\"\"),\"\",IF(AND(Master!$I$4=Master!$Y$3),\"\",Master!C25))","v":500},220,{"$f":"IF(AND(C8=\"\"),\"\",IF(AND(Master!$I$4=Master!$Y$3),\"\",Master!$L$21))","v":0},{"$f":"IF(AND(B8=\"\"),\"\",SUM(M8:W8))","v":13253},{"$f":"IF(AND(B8=\"\"),\"\",IF(AND(L8=\"\",X8=\"\"),\"\",SUM(L8-X8)))","v":40867},null,null,null,null,null,null,null,null,null,null,null,null,null,null,null,"APR","2019-04-01",4,null,{"$f":"$AR$10","v":45100},{"$f":"IF(AND(AP8<$AR$11),\"\",IF(AND(AP8>$AR$12),\"\",AS8))","v":45100},{"$f":"ROUND(12%*AS8,0)","v":5412}]
[3,"2019-05-01",45100,{"$f":"IF(AND(Master!$I$4=Master!$Y$3),\"\",IF(AND(C9=\"\"),\"\",ROUND(12%*C9,0)))","v":5412},{"$f":"IF(AND(Master!$I$4=Master!$Y$3),\"\",IF(AND(C9=\"\"),\"\",ROUND(Master!$E$5%*C9,0)))","v":3608},{"$f":"IF(AND(C9=\"\"),\"\",IF(AND(Master!$B$21=\"\"),\"\",Master!$B$21))","v":""},{"$f":"IF(AND(C9=\"\"),\"\",IF(AND(Master!$C$21=\"\"),\"\",Master!$C$21))","v":""},null,{"$f":"IF(AND(C9=\"\"),\"\",IF(AND(Master!$D$21=\"\"),\"\",Master!$D$21))","v":""},{"$f":"IF(AND(Master!I$5=Master!V$2),\"\",IF(AND(Master!I$4=Master!Y$3),ROUND((C9)*0.1,0),IF(AND(Master!I$5=Master!V$3),ROUND((C9+D9)*0.1,0),\"\")))","v":""},{"$f":"IF(AND(C9=\"\"),\"\",IF(AND(Master!$E$21=\"\"),\"\",Master!$E$21))","v":""},54120,{"$f":"IF(AND(C9=\"\"),\"\",IF(AND(Master!$I$4=Master!$Y$3),\"\",Master!$F$21))","v":4000},{"$f":"IF(AND(C9=\"\"),\"\",IF(AND(Master!$I$4=Master!$Y$3),\"\",IF(AND(Master!$I$5=Master!$V$3),\"\",Master!$G$21)))","v":3575},{"$f":"IF(AND(B9=\"\"),\"\",IF(AND(Master!$I$4=Master!$Y$3),\"\",IF(AND(Master!$I$5=Master!$V$3),\"\",IF(C9<18001,242,IF(C9<33501,402,IF(C9<54001,602,800))))))","v":602},{"$f":"IF(AND(Master!I$5=Master!V$2),\"\",IF(AND(Master!I$4=Master!Y$3),ROUND((C9)*0.1,0),IF(AND(Master!I$5=Master!V$3),ROUND((C9+D9)*0.1,0),\"\")))","v":""},{"$f":"IF(AND(C9=\"\"),\"\",IF(AND(Master!$I$4=Master!$Y$3),\"\",Master!$H$21))","v":2178},{"$f":"IF(AND(C9=\"\"),\"\",IF(AND(Master!$I$4=Master!$Y$3),\"\",Master!$H$21))","v":2178},{"$f":"IF(AND(C9=\"\"),\"\",IF(AND(Master!$I$4=Master!$Y$3),\"\",Master!$I$21))","v":0},{"$f":"IF(AND(C9=\"\"),\"\",IF(AND(Master!$I$4=Master!$Y$3),\"\",Master!$K$21))","v":0},{"$f":"IF(AND(C9=\"\"),\"\",IF(AND(Master!$I$4=Master!$Y$3),\"\",Master!D25))","v":1000},null,{"$f":"IF(AND(C9=\"\"),\"\",IF(AND(Master!$I$4=Master!$Y$3),\"\",Master!$L$21))","v":0},13533,40587,null,null,null,null,null,null,null,null,null,null,null,null,null,null,null,"MAY","2019-05-01",5,null,45100,45100,5412]
[4,"2019-06-01",45100,{"$f":"IF(AND(Master!$I$4=Master!$Y$3),\"\",IF(AND(C10=\"\"),\"\",ROUND(12%*C10,0)))","v":5412},{"$f":"IF(AND(Master!$I$4=Master!$Y$3),\"\",IF(AND(C10=\"\"),\"\",ROUND(Master!$E$5%*C10,0)))","v":3608},{"$f":"IF(AND(C10=\"\"),\"\",IF(AND(Master!$B$21=\"\"),\"\",Master!$B$21))","v":""},{"$f":"IF(AND(C10=\"\"),\"\",IF(AND(Master!$C$21=\"\"),\"\",Master!$C$21))","v":""},null,{"$f":"IF(AND(C10=\"\"),\"\",IF(AND(Master!$D$21=\"\"),\"\",Master!$D$21))","v":""},{"$f":"IF(AND(Master!I$5=Master!V$2),\"\",IF(AND(Master!I$4=Master!Y$3),ROUND((C10)*0.1,0),IF(AND(Master!I$5=Master!V$3),ROUND((C10+D10)*0.1,0),\"\")))","v":""},{"$f":"IF(AND(C10=\"\"),\"\",IF(AND(Master!$E$21=\"\"),\"\",Master!$E$21))","v":""},54120,{"$f":"IF(AND(C10=\"\"),\"\",IF(AND(Master!$I$4=Master!$Y$3),\"\",Master!$F$21))","v":4000},{"$f":"IF(AND(C10=\"\"),\"\",IF(AND(Master!$I$4=Master!$Y$3),\"\",IF(AND(Master!$I$5=Master!$V$3),\"\",Master!$G$21)))","v":3575},{"$f":"IF(AND(B10=\"\"),\"\",IF(AND(Master!$I$4=Master!$Y$3),\"\",IF(AND(Master!$I$5=Master!$V$3),\"\",IF(C10<18001,242,IF(C10<33501,402,IF(C10<54001,602,800))))))","v":602},{"$f":"IF(AND(Master!I$5=Master!V$2),\"\",IF(AND(Master!I$4=Master!Y$3),ROUND((C10)*0.1,0),IF(AND(Master!I$5=Master!V$3),ROUND((C10+D10)*0.1,0),\"\")))","v":""},{"$f":"IF(AND(C10=\"\"),\"\",IF(AND(Master!$I$4=Master!$Y$3),\"\",Master!$H$21))","v":2178},{"$f":"IF(AND(C10=\"\"),\"\",IF(AND(Master!$I$4=Master!$Y$3),\"\",Master!$H$21))","v":2178},{"$f":"IF(AND(C10=\"\"),\"\",IF(AND(Master!$I$4=Master!$Y$3),\"\",Master!$I$21))","v":0},{"$f":"IF(AND(C10=\"\"),\"\",IF(AND(Master!$I$4=Master!$Y$3),\"\",Master!$K$21))","v":0},{"$f":"IF(AND(C10=\"\"),\"\",IF(AND(Master!$I$4=Master!$Y$3),\"\",Master!E25))","v":500},null,{"$f":"IF(AND(C10=\"\"),\"\",IF(AND(Master!$I$4=Master!$Y$3),\"\",Master!$L$21))","v":0},13033,41087,null,null,null,null,null,null,null,null,null,null,null,null,null,null,null,"JUN","2019-06-01",6,{"$f":"IF(AND(Master!D17=\"\"),\"\",Master!D17)","v":45100},45100,45100,5412]
{"$rows_left_out":21}
{"sheet":"Extra deduc","index":2,"n_rows":41,"n_cols":41,"rows_kept":41,"cut":false,"hidden":true,"merged":[[34,4,34,5],[35,4,35,5],[36,4,36,5],[36,7,37,7],[24,0,24,7],[27,4,27,6],[29,7,30,7],[30,4,30,5],[31,4,31,5],[31,7,32,7],[20,7,20,8],[10,4,10,5],[10,7,10,8],[11,4,11,5],[11,7,11,8],[12,7,12,8],[13,7,13,8],[14,7,14,8],[15,7,15,8],[17,7,17,8],[18,7,18,8],[19,7,19,8],[7,4,7,5],[7,7,7,8],[8,4,8,5],[8,7,8,8],[9,4,9,5],[9,7,9,8],[6,4,6,5],[6,7,6,8],[1,4,1,9],[2,4,3,9],[4,7,4,8],[5,4,5,5],[5,7,5,8]]}
[]
[null,null,null,null,"Deduction Detail"]
[null,null,null,null,"osru dVkSrh ds vfrfjDr dVkSfr;k ftlds rgr vki vk;dj esa NwV pkgrs gSa] rFkk vfrfjDr ¼vU;½ vk; dks ;gkW ij bUnzkt djsA",null,null,null,null,null,null,null,null,null,null,null,null,null,null,null,null,null,null,null,null,null,null,null,null,null,null,null,null,null,null,null,null,null,null,null,"YES"]
[null,null,null,null,null,null,null,null,null,null,null,null,null,null,null,null,null,null,null,null,null,null,null,null,null,null,null,null,null,null,null,null,null,null,null,null,null,null,null,null,"NO"]
[null,null,null,null,"1- edku fdjk;k HkRrk ¼ vxj jlhn ds ek/;e ls                                                  NwV ysuh gS rks YES ugh rks No lysDV djsA½","NO",{"$f":"IF(AND(F5=\"\"),\"0\",IF(AND(F5=AO4),\"0\",G32))","v":"0"},"18- vU; vk; /kkjk "]
[null,null,null,null,"2- euksjatu Hkrk /kkjk 16 (ii) ds vUrxZr ",null,null,"19- /kkjk 80CCC - isa'ku Iyku gsrq va'knku"]
[null,null,null,null,"3- O;o;k; dj /kkjk 16 ¼iii½ ds vUrxrZ ",null,null,"20- vU; tek jkf'k ¼/kkjk 80 lh ds vUrxZr½"]
[null,null,null,null,"4- x`g lEifr ls izkIr fdjk;k & vk;",null,null,"21- /kkjk 80CCD(1B) -uohu isa'ku ;kstuk esa vfrfjDr va'knku ¼vf/kdre :- 50]000½"]
[null,null,null,null,"5- x`gdj ",null,null,"22- /kkjk 80D - fpfdRlk chek izhfe;e "]
[null,null,null,null,"6- x`g _.k dh ewy fdLr ;gkW fy[kuh gSaA tks NwV ysuh gSaA",null,null,"23- /kkjk 80DD - fodykax vkfJrksa ds fpfdRlk mipkj "]
{"$rows_left_out":32}
{"sheet":"COMPUTATION","index":3,"n_rows":79,"n_cols":25,"rows_kept":79,"cut":false,"hidden":true,"merged":[[61,12,61,13],[62,0,62,12],[64,11,64,13],[56,2,56,12],[57,1,57,12],[58,1,58,12],[59,1,59,12],[60,0,61,0],[60,1,61,3],[60,4,60,6],[60,7,60,8],[60,10,60,11],[60,12,60,13],[49,5,49,7],[49,9,49,11],[50,1,50,3],[50,5,50,7],[50,9,50,11],[51,1,51,3],[51,5,51,7],[51,9,51,11],[61,4,61,6],[61,7,61,8],[61,10,61,11],[45,1,45,12],[46,1,46,12],[47,0,57,0],[47,1,47,14],[48,1,48,4],[48,5,48,8],[48,9,48,12],[49,1,49,3],[34,0,43,0],[34,1,34,14],[35,1,35,12],[36,1,36,12],[37,1,37,12],[38,1,38,12],[39,1,39,12],[40,1,40,12],[41,1,41,12],[42,1,42,12],[52,1,52,3],[52,5,52,7],[52,9,52,11],[53,1,53,12],[54,1,54,12],[55,1,55,12],[25,2,25,4],[25,8,25,10],[26,2,26,4],[26,8,26,10],[27,2,27,4],[27,8,27,10],[30,17,37,21],[43,1,43,12],[44,1,44,12],[21,8,21,10],[22,2,22,4],[22,8,22,10],[23,2,23,4],[23,8,23,10],[24,2,24,4],[24,8,24,10],[16,1,16,12],[17,0,33,0],[17,1,17,14],[18,1,18,14],[19,2,19,4],[19,8,19,10],[19,13,29,14],[20,2,20,4],[20,8,20,10],[21,2,21,4],[28,2,28,4],[28,8,28,10],[29,1,29,10],[30,1,30,12],[31,1,31,12],[32,1,32,12],[33,1,33,12],[14,1,14,3],[14,4,14,6],[14,9,14,12],[15,1,15,3],[15,4,15,6],[15,10,15,12],[10,13,12,14],[11,1,12,2],[11,3,11,4],[11,5,11,7],[11,8,11,9],[11,10,11,12],[12,3,12,4],[12,5,12,7],[12,8,12,9],[12,10,12,12],[3,17,6,21],[4,1,4,12],[5,1,5,12],[6,0,8,0],[6,1,6,9],[6,10,6,12],[6,13,7,14],[7,1,7,9],[7,10,7,12],[74,2,74,10],[75,2,75,10],[73,2,73,10],[76,2,76,10],[77,2,77,10],[78,2,79,10],[0,0,0,14],[1,2,1,5],[1,6,1,7],[1,8,1,10],[1,11,1,12],[2,1,2,2],[2,3,2,7],[2,9,2,11],[2,13,2,14],[8,1,8,9],[8,10,8,12],[9,1,9,12],[10,0,12,0],[10,1,10,7],[10,8,10,9],[10,10,10,12],[3,1,3,12],[13,1,13,12]]}
[{"$f":"IF(AND(Master!D8=\"\"),\"\",CONCATENATE(\"Office Name :- \",PROPER(Master!D8)))","v":"Office Name :- Government Sr. Secondary School Inderwara , Rani (Pali)"}]
[null,null,"vk;dj x.kuk izi= o\"kZ",null,null,null,"2019-20",null,"¼dj fu/kkZj.k o\"kZ",null,null,"2020-21",null,"½"]
[1,"uke deZpkjh %",null,{"$f":"UPPER(IF(Master!D9=\"\",\"\",Master!D9))","v":"HEERALAL JAT"},null,null,null,null," in %",{"$f":"UPPER(IF(Master!H9=\"\",\"\",Master!H9))","v":"SR TEACHER"},null,null,"PAN :",{"$f":"UPPER(IF(Master!D12=\"\",\"\",Master!D12))","v":"ADTXXXXXX2"}]
[2,"vk; %  o\"kZ&2019&20 esa izkIr dqy osru ¼ dj ;ksX; lqfo/kkvksa ds eqY; lfgr ½",null,null,null,null,null,null,null,null,null,null,null,"#-",{"$f":"'GA 55'!L27+'GA 55'!J27","v":698400},null,"E","ljdkj }kjk tks jkf'k NPS esa tek djkbZ xbZ gSa] og jkf'k ;gkW dqy vk; esa n'kkZ;h xbZ gSaA"]
[3,"x`g fdjk;k] /kkjk 10¼13-A½ ds vUrxrZ ,oa /kkjk 10¼14½ds vUrxrZ vU; Hkrs tks dj eqDÙk gSA ",null,null,null,null,null,null,null,null,null,null,null,"#-",{"$f":"'Extra deduc'!G5+'GA 55'!G27","v":0}]
[4,"                                                              'ks\"k ¼2&3½",null,null,null,null,null,null,null,null,null,null,null,"#-",{"$f":"O4-O5","v":698400}]
[5," ¼i½euksjatu Hkrk /kkjk 16 ¼ii½ ds vUrxrZ ",null,null,null,null,null,null,null,null,{"$f":"'Extra deduc'!G6","v":0}]
[null," ¼ii½ O;o;k; dj /kkjk 16 ¼iii½ ds vUrxrZ ",null,null,null,null,null,null,null,null,{"$f":"'Extra deduc'!G7","v":0}]
[null," ¼iii½ LVs.MMZ fMMsD'ku (Standard Deduction)  50]000 ¼vf/kdre½",null,null,null,null,null,null,null,null,50000,null,null,"#-",{"$f":"SUM(K7:M9)","v":50000}]
[6,"                                                           'ks\"k ¼4&5½",null,null,null,null,null,null,null,null,null,null,null,"#-",{"$f":"O6-O9","v":648400}]
{"$rows_left_out":69}