{"text_format":"1","workbook":"xlsx","n_sheets":6,"sheets":["INTRO","us 89(1)","Form 10E","Control_10E","RULES","Sheet1"],"not_rendered":{"charts":0,"images":2,"macros":1,"external_links":0,"defined_names":4,"comments":0,"pivot_tables":0},"unopened":[],"bounds":{"document_bytes":16777216,"sheet_cells":100000,"rows_first":2000,"rows_last":500,"rows_between":2000,"halvings":0,"cell_chars":16384,"cell_head_chars":4096},"cells_cut":0,"cells_raw":0,"read":"whole","date_system":"1900"}

{"sheet":"INTRO","index":0,"n_rows":21,"n_cols":3,"rows_kept":21,"cut":false,"hidden":false,"merged":[[0,0,15,0],[0,1,0,3],[1,3,16,3],[16,0,16,2],[10,2,14,2],[1,1,1,2],[2,1,2,2],[4,1,4,2]]}
[]
[null,"INCOME TAX ASSESMENT FOR FINANCIAL YEAR 2024-25"]
[null,"HOW TO USE   "]
[null,null,"राजस्थान राज्य कर्मचारियों के  लिए FY 2024-25 के लिए आयकर आकलन के लिए विगत वर्षों के प्राप्त arrear भुगतान के लिए us 89(1) के तहत छूट प्राप्त करने के लिए Form 10 E generate करने  बाबत इस UTILITY का प्रयोग किया जा सकता है । FILE को SAVE करने के लिए अपनी सुविधा से नाम देकर SAVE AS से Excel Macro- Enable Workbook के रूप में Save करें। file को open करते समय Enable Macro करें।यह excel utility केवल मात्र राज्य कार्मिको के income tax assesment के लिए सहायतार्थ तैयार की गई है ।यद्यपि इसे तैयार करने में पूर्ण सावधानी बरती गई है फिर भी किसी भूल चूक के लिए तैयार कर्ता उत्तरदायी नहीं है । किसी भी गणना के लिए त्रुटि पाए जाने पर आयकर विभाग के नियम मान्य होंगे  किसी प्रकार की तकनीकी कमी पाए जाने पर नीचे दिये गए EMAIL द्वारा अवगत कराने का श्रम करावे।(PLEASE USE LATEST VERSION OF THAT IS  OFFICE 2010 AND ABOVE FOR BEST RESULT)"]
[null,"   1. First Enable Macro whenever open file               2 Save as always in  Excel Macro-Enabled Workbook (*.xlsm)    "]
[null,"1 . us 89(1) sheet","इस शीट से संबन्धित निर्देश शीट पर दिये गए है"]
[null,"2 . Form 10E","auto generated"]
[null,"Disclaimer: -","All care has been taken to keep the information upto date and correct and is for educational purpose only. You are encouraged to consult your Accountant or Advisor before taking any decesion based on this calculator"]
[]
[null,null,"                                  सुधार हेतु सुझाव  आमंत्रित  है "]
[]
[]
[]
[]
[]
[null,null,"                                         joshihansraj72@gmail.com"]
[]
[]
[]
[null,"created on 26-10-2024"]
{"$rows_left_out":2}
{"sheet":"us 89(1)","index":1,"n_rows":31,"n_cols":23,"rows_kept":31,"cut":false,"hidden":false,"merged":[[4,1,4,3],[4,4,4,7],[4,8,4,11],[4,12,4,14],[4,16,9,19],[8,1,8,11],[8,12,8,14],[5,1,5,11],[5,12,5,14],[6,1,6,11],[6,12,6,14],[7,1,7,11],[7,12,7,14],[1,1,1,14],[1,16,2,19],[2,1,2,3],[2,4,2,14],[3,1,3,3],[3,4,3,14],[3,16,3,19],[10,16,10,19],[15,16,31,19],[16,1,16,11],[16,12,16,14],[17,1,17,11],[17,12,17,14],[18,1,18,11],[31,1,31,15],[30,1,30,11],[30,12,30,14],[14,1,14,11],[14,12,14,14],[15,1,15,11],[15,12,15,14],[11,16,13,19],[14,16,14,19],[26,1,26,11],[26,12,26,14],[20,1,20,11],[20,12,20,14],[21,1,21,11],[22,1,22,11],[21,12,21,14],[22,12,22,14],[23,1,23,11],[23,12,23,14],[24,1,24,11],[25,1,25,11],[24,12,24,14],[25,12,25,14],[18,12,18,14],[19,1,19,11],[19,12,19,14],[9,1,9,11],[9,12,9,14],[10,1,10,11],[10,12,10,14],[12,1,12,11],[12,12,12,14],[13,1,13,11],[13,12,13,14],[11,1,11,11],[11,12,11,14],[27,1,27,11],[28,1,28,11],[29,1,29,11],[27,12,27,14],[28,12,28,14],[29,12,29,14]]}
[]
[null,"CALCULATION OF RELIEF UNDER SECTION 89 (1)",null,null,null,null,null,null,null,null,null,null,null,null,null,null,"1- loZizFke vius ,fj;j dks xr foÙkh; o\"kksZa ds vuqlkj foHkkftr djsaA"]
[null,"NAME",null,null,"Hans Raj Joshi"]
[null,"ADDRESS",null,null,"GSSS RAJPURA PIPERAN",null,null,null,null,null,null,null,null,null,null,5,null,null,null,null,null,null,"Old Regime"]
[null,"PAN",null,null,"XXXXX1234X",null,null,null,"CATEGORY",null,null,null,null,null,null,null,"2- vc lEcfU/kr foÙkh; o\"kksZa ds QkWeZ 16 vFkok ITR ls dj ;ksX; vk; dks lEcfU/kr lsYl esa Hkjuk gSA",null,null,null,null,null,"New Regime"]
[null,"FINANCIAL YEAR- 2016-17",null,null,null,null,null,null,null,null,null,null,"INCOME ( Rs )"]
[null,"Enter net taxable income for 2016-17 (as per ITR/Form-16) "]
[null,"Enter arrears relates to 2016-17"]
[null,"FINANCIAL YEAR- 2017-18",null,null,null,null,null,null,null,null,null,null,"INCOME ( Rs )"]
[null,"Enter net taxable income for 2017-18 (as per ITR/Form-16) "]
[null,"Enter arrears relates to 2017-18"]
[null,"FINANCIAL YEAR- 2018-19",null,null,null,null,null,null,null,null,null,null,"INCOME ( Rs )",null,null,null,"3- dj ;ksX; vk; og vk; gS ftl ij ml foÙkh; o\"kZ esa fu/kkZfjr vk;dj nj ls vk;dj dh x.kuk dh tkrh gSA "]
[null,"Enter net taxable income for 2018-19 (as per ITR/Form-16) "]
[null,"Enter arrears relates to 2018-19"]
[null,"FINANCIAL YEAR- 2019-20",null,null,null,null,null,null,null,null,null,null,"INCOME ( Rs )"]
[null,"Enter net taxable income for 2019-20 (as per ITR/Form-16) ",null,null,null,null,null,null,null,null,null,null,null,null,null,null,"4- vc bl QkWeZ esa lEcfU/kr foÙkh; o\"kZ  dh dj ;ksX; vk; ,oa ml o\"kZ ls lEcfU/kr ,fj;j dh jkf'k HkjsaA /;ku jgs foÙkh; o\"kZ 2024&25 ds fy, Hkjh x;h dj ;ksX; vk; esa lEiw.kZ ,fj;j dh jkf'k tqMh gksA vc vxyh 'khV 'form10E' esa 'GENERATE FORM 10E' cVu nckdj QkWeZ 10E, Generate djsaA izkIr NwV dh jkf'k dks 'deduction' 'khV esa lsy Q20 esa /kkjk 89(1) ds rgr jkgr esa HkjsaA "]
[null,"Enter arrears relates to 2019-20"]
[null,"FINANCIAL YEAR- 2020-21",null,null,null,null,null,null,null,null,null,null,"INCOME ( Rs )",null,null,"Select Regime Type"]
[null,"Enter net taxable income for 2020-21 (as per ITR/Form-16) "]
[null,"Enter arrears relates to 2020-21"]
{"$rows_left_out":12}
{"sheet":"Form 10E","index":2,"n_rows":48,"n_cols":18,"rows_kept":48,"cut":false,"hidden":false,"merged":[[30,17,30,20],[29,17,29,20],[26,17,27,20],[47,1,48,15],[42,5,43,8],[16,2,16,3],[7,1,7,14],[1,1,1,14],[2,1,2,14],[3,1,3,3],[3,4,3,14],[4,1,4,3],[4,4,4,14],[5,1,5,3],[5,4,5,8],[5,9,5,10],[5,11,5,14],[6,1,6,14],[14,1,14,14],[8,1,8,11],[11,1,11,11],[11,12,11,14],[12,1,12,11],[12,12,12,14],[8,12,8,14],[25,1,25,11],[25,12,25,14],[26,1,26,11],[26,12,26,14],[27,1,27,11],[27,12,27,14],[9,1,9,11],[9,12,9,14],[10,1,10,11],[10,12,10,14],[22,1,22,11],[22,12,22,14],[23,1,23,11],[23,12,23,14],[24,1,24,11],[24,12,24,14],[17,11,17,14],[19,1,19,14],[20,1,20,11],[20,12,20,14],[21,1,21,11],[21,12,21,14],[29,1,29,14],[30,1,30,2],[30,3,30,4],[30,5,30,6],[30,7,30,8],[30,9,30,10],[30,11,30,12],[30,13,30,14],[13,1,13,14],[31,13,31,14],[33,1,33,2],[33,3,33,4],[33,5,33,6],[33,7,33,8],[33,9,33,10],[33,11,33,12],[33,13,33,14],[31,1,31,2],[31,3,31,4],[31,5,31,6],[31,7,31,8],[31,9,31,10],[31,11,31,12],[32,1,32,2],[32,3,32,4],[32,5,32,6],[32,7,32,8],[32,9,32,10],[32,11,32,12],[32,13,32,14],[37,13,37,14],[38,1,38,2],[38,3,38,4],[38,5,38,6],[38,7,38,8],[35,9,35,10],[35,11,35,12],[35,13,35,14],[34,1,34,2],[34,3,34,4],[34,5,34,6],[34,7,34,8],[34,9,34,10],[34,11,34,12],[34,13,34,14],[35,1,35,2],[35,3,35,4],[35,5,35,6],[35,7,35,8],[38,9,38,10],[38,11,38,12],[38,13,38,14],[36,13,36,14],[36,1,36,2],[36,3,36,4],[36,5,36,6],[36,7,36,8],[36,9,36,10],[36,11,36,12],[37,1,37,2],[37,3,37,4],[37,5,37,6],[37,7,37,8],[37,9,37,10],[37,11,37,12],[39,1,39,2],[39,3,39,4],[39,5,39,6],[39,7,39,8],[39,9,39,10],[39,11,39,12],[39,13,39,14],[40,1,40,2],[40,3,40,4],[40,5,40,6],[40,7,40,8],[40,9,40,10],[40,11,40,12],[40,13,40,14]]}
[]
[null,"FORM NO. 10 E (See rule 21AA)"]
[null,"Form for furnishing particulars of income undr scetion 192(2A) for year ending 31st March 2025 for claiming relief under section 89(1) by a Government servant or an employee in a company, co-operative society, local authority, university, institution, association or body."]
[null,"Name",null,null,{"$f":"PROPER(IF('us 89(1)'!E3=\"\",\"\",'us 89(1)'!E3))","v":"Hans Raj Joshi"}]
[null,"Address",null,null,{"$f":"UPPER(IF('us 89(1)'!E4=\"\",\"\",'us 89(1)'!E4))","v":"GSSS RAJPURA PIPERAN"}]
[null,"PAN",null,null,{"$f":"UPPER(IF('us 89(1)'!E5=\"\",\"\",'us 89(1)'!E5))","v":"XXXXX1234X"},null,null,null,null,"Status",null,"Indian Resident "]
[]
[null,"Particulars of Income referred to in rule 21A of the Income tax Rules, 1962, during the previous year relevant to assessment year 2025-26"]
[null,"1. (a) Salary received in arrears or in advance during 2024-25 in accordance with the provision of sub-rule (2) of rule 21A",null,null,null,null,null,null,null,null,null,null,{"$f":"'us 89(1)'!M8+'us 89(1)'!M11+'us 89(1)'!M14+'us 89(1)'!M17+'us 89(1)'!M20+'us 89(1)'!M23+'us 89(1)'!M26+'us 89(1)'!M29","v":58900}]
[null,"(b) Payment in the nature of gratuity in respect of past services, extending over a period of not less than 5 years in accordance with the provisions of sub-rule (3) of rule 21A",null,null,null,null,null,null,null,null,null,null,"Not applicable "]
[null,"(c) Payment in the nature of compensation from the employer or former employer at or in connection with termination of employment after continuous service of not less than 3 years in accordance with the provisions of sub-rule (4) of rule 21A",null,null,null,null,null,null,null,null,null,null,"Not applicable "]
[null,"(d) Payment in commutation of pension in accordance with the provisions of sub-rule (5) of rule 21A",null,null,null,null,null,null,null,null,null,null,"Not applicable "]
[null,"2. Detailed particulars of payments referred to above may be given in Annexure I, II, IIA, III or IV as the case may be ",null,null,null,null,null,null,null,null,null,null,"Annexure- I"]
[null,"Verification "]
[null,"I do hereby declare that what is stated above is true to the best of my knowledge and belief. Verified today "]
[]
[null,"Date:"]
[null,null,null,null,null,null,null,null,null,null,null,"Signature of the employee"]
[]
[null,"ANNEXURE - I"]
{"$rows_left_out":29}
{"sheet":"Control_10E","index":3,"n_rows":38,"n_cols":18,"rows_kept":38,"cut":false,"hidden":true,"merged":[[7,15,7,17],[19,15,19,17],[12,6,12,7],[12,8,12,10],[0,6,0,7],[0,8,0,10],[17,12,17,13],[12,0,12,5],[0,0,0,5],[28,5,29,5],[26,5,27,5],[32,5,33,5],[30,5,31,5]]}
["Tax on income excluding arrears",null,null,null,null,null,"OLD TAX REGIME",null,"NEW TAX REGIME"]
["year","amount","TAX","surcharge","edu. cess","total","Tax","after 87a ","Tax","after 87a "," tax"]
["2016-17",{"$f":"'Form 10E'!D33","v":0},{"$f":"H3","v":0},null,{"$f":"ROUND((C3*0.03),0)","v":0},{"$f":"C3+D3+E3","v":0},{"$f":"IF($B3>1000000, 125000+($B3-1000000)*0.3, IF($B3>500000, 25000+($B3-500000)*0.2, IF($B3>250000, ($B3-250000)*0.1, 0)))","v":0},{"$f":"IF(B3<500001,G3-MIN(G3,5000),G3)","v":0}]
["2017-18",{"$f":"'Form 10E'!D34","v":0},{"$f":"H4","v":0},{"$f":"IF(B4>10000000,C4*0.15,0)","v":0},{"$f":"ROUND((C4*0.03),0)","v":0},0,{"$f":"IF($B4>1000000, 112500+($B4-1000000)*0.3, IF($B4>500000, 12500+($B4-500000)*0.2, IF($B4>250000, ($B4-250000)*0.05, 0)))","v":0},{"$f":"IF($B4<350001,G4-MIN(G4,2500),G4)","v":0},null,null,null,null,1,"21-22"]
["2018-19",{"$f":"'Form 10E'!D35","v":0},{"$f":"H5","v":0},null,{"$f":"ROUND((C5*0.04),0)","v":0},0,{"$f":"IF($B5>1000000, 112500+($B5-1000000)*0.3, IF($B5>500000, 12500+($B5-500000)*0.2, IF($B5>250000, ($B5-250000)*0.05, 0)))","v":0},{"$f":"IF($B5<350001,G5-MIN(G5,2500),G5)","v":0}]
["2019-20",{"$f":"'Form 10E'!D36","v":0},{"$f":"H6","v":0},null,0,0,{"$f":"IF($B6>1000000, 112500+($B6-1000000)*0.3, IF($B6>500000, 12500+($B6-500000)*0.2, IF($B6>250000, ($B6-250000)*0.05, 0)))","v":0},{"$f":"IF(B6<500001,G6-MIN(G6,12500),G6)","v":0},null,null,null,null,"control button 89(1)"]
["2020-21",{"$f":"'Form 10E'!D37","v":0},{"$f":"IF($M$7=2,K7,IF(B7<=500000,H7,G7))","v":0},null,0,0,{"$f":"ROUND(IF(B7<=250000,0,IF(B7<=500000,(B7-250000)*0.05,IF(B7<=1000000,12500+(B7-500000)*0.2,IF(B7>1000000,112500+(B7-1000000)*0.3,\"0\")))),0)","v":0},{"$f":"IF(AND(B7<=500000,G7>=12500),G7-12500,IF(AND(B7<=500000,G7<12500),0,G7))","v":0},{"$f":"ROUND(IF(B7<=250000,0,IF(B7<=500000,(B7-250000)*0.05,IF(B7<=750000,12500+(B7-500000)*0.1,IF(B7<=1000000,37500+(B7-750000)*0.15,IF(B7<=1250000,75000+(B7-1000000)*0.2,IF(B7<=1500000,125000+(B7-1250000)*0.25,IF(B7>1500000,187500+(B7-1500000)*0.3,\"0\"))))))),0)","v":0},{"$f":"IF(AND(B7<=500000,I7>=12500),I7-12500,IF(AND(B7<=500000,I7<12500),0,I7))","v":0},{"$f":"IF(B7<=500000,J7,I7)","v":0},null,2,"20-21"]
["2021-22",{"$f":"'Form 10E'!D38","v":0},{"$f":"IF($M$8=2,K8,IF(B8<=500000,H8,G8))","v":0},null,0,0,{"$f":"ROUND(IF(B8<=250000,0,IF(B8<=500000,(B8-250000)*0.05,IF(B8<=1000000,12500+(B8-500000)*0.2,IF(B8>1000000,112500+(B8-1000000)*0.3,\"0\")))),0)","v":0},{"$f":"IF(AND(B8<=500000,G8>=12500),G8-12500,IF(AND(B8<=500000,G8<12500),0,G8))","v":0},{"$f":"ROUND(IF(B8<=250000,0,IF(B8<=500000,(B8-250000)*0.05,IF(B8<=750000,12500+(B8-500000)*0.1,IF(B8<=1000000,37500+(B8-750000)*0.15,IF(B8<=1250000,75000+(B8-1000000)*0.2,IF(B8<=1500000,125000+(B8-1250000)*0.25,IF(B8>1500000,187500+(B8-1500000)*0.3,\"0\"))))))),0)","v":0},{"$f":"IF(AND(B8<=500000,I8>=12500),I8-12500,IF(AND(B8<=500000,I8<12500),0,I8))","v":0},{"$f":"IF(B8<=500000,J8,I8)","v":0},null,2,"21-22",null,"Marginal Relief"]
["2022-23",{"$f":"'Form 10E'!D39","v":0},{"$f":"IF($M$9=2,K9,IF(B9<=500000,H9,G9))","v":0},null,0,0,{"$f":"ROUND(IF(B9<=250000,0,IF(B9<=500000,(B9-250000)*0.05,IF(B9<=1000000,12500+(B9-500000)*0.2,IF(B9>1000000,112500+(B9-1000000)*0.3,\"0\")))),0)","v":0},{"$f":"IF(AND(B9<=500000,G9>=12500),G9-12500,IF(AND(B9<=500000,G9<12500),0,G9))","v":0},{"$f":"ROUND(IF(B9<=250000,0,IF(B9<=500000,(B9-250000)*0.05,IF(B9<=750000,12500+(B9-500000)*0.1,IF(B9<=1000000,37500+(B9-750000)*0.15,IF(B9<=1250000,75000+(B9-1000000)*0.2,IF(B9<=1500000,125000+(B9-1250000)*0.25,IF(B9>1500000,187500+(B9-1500000)*0.3,\"0\"))))))),0)","v":0},{"$f":"IF(AND(B9<=500000,I9>=12500),I9-12500,IF(AND(B9<=500000,I9<12500),0,I9))","v":0},{"$f":"IF(B9<=500000,J9,I9)","v":0},null,2,"22-23",null,"income>7Lac","tax diff","marginal relief"]
["2023-24",{"$f":"'Form 10E'!D40","v":663570},{"$f":"IF($M$10=2,K10,IF(B10<=500000,H10,G10))","v":0},null,0,0,{"$f":"ROUND(IF(B10<=250000,0,IF(B10<=500000,(B10-250000)*0.05,IF(B10<=1000000,12500+(B10-500000)*0.2,IF(B10>1000000,112500+(B10-1000000)*0.3,\"0\")))),0)","v":45214},{"$f":"IF(AND(B10<=500000,G10>=12500),G10-12500,IF(AND(B10<=500000,G10<12500),0,G10))","v":45214},{"$f":"ROUND(IF(B10<=300000,0,IF(B10<=600000,(B10-300000)*0.05,IF(B10<=900000,15000+(B10-600000)*0.1,IF(B10<=1200000,45000+(B10-900000)*0.15,IF(B10<=1500000,75000+(B10-1000000)*0.2,IF(B10>1500000,150000+(B10-1500000)*0.3,\"0\")))))),0)","v":21357},{"$f":"IF(AND(B10<=700000,I10>=25000),I10-25000,IF(AND(B10<=700000,I10<25000),0,I10))-R10","v":0},{"$f":"IF(OR(B10<=700000,P10<Q10),J10,I10)","v":0},null,2,"23-24",null,{"$f":"IF(B10>700000,B10-700000,0)","v":0},{"$f":"IF(B10>700000,ROUND(IF(B10<=300000,0,IF(B10<=600000,(B10-300000)*0.05,IF(B10<=900000,15000+(B10-600000)*0.1,IF(B10<=1200000,45000+(B10-900000)*0.15,IF(B10<=1500000,75000+(B10-1000000)*0.2,IF(B10>1500000,150000+(B10-1500000)*0.3,\"0\")))))),0),0)","v":0},{"$f":"IF(B10>700000,IF(P10<Q10,Q10-P10,0),0)","v":0}]
["2024-25",{"$f":"'Form 10E'!$M$21","v":670490},{"$f":"IF($M$11=2,K11,IF(B11<=500000,H11,G11))","v":0},null,{"$f":"ROUND((C11*0.04),0)","v":0},{"$f":"C11+D11+E11","v":0},{"$f":"ROUND(IF(B11<=250000,0,IF(B11<=500000,(B11-250000)*0.05,IF(B11<=1000000,12500+(B11-500000)*0.2,IF(B11>1000000,112500+(B11-1000000)*0.3,\"0\")))),0)","v":46598},{"$f":"IF(AND(B11<=500000,G11>=12500),G11-12500,IF(AND(B11<=500000,G11<12500),0,G11))","v":46598},{"$f":"ROUND(IF(B11<=300000,0,IF(B11<=700000,(B11-300000)*0.05,IF(B11<=1000000,20000+(B11-700000)*0.1,IF(B11<=1200000,50000+(B11-1000000)*0.15,IF(B11<=1500000,80000+(B11-1200000)*0.2,IF(B11>1500000,140000+(B11-1500000)*0.3,\"0\")))))),0)","v":18525},{"$f":"IF(AND(B11<=700000,I11>=25000),I11-25000,IF(AND(B11<=700000,I11<25000),0,I11))-R11","v":0},{"$f":"IF(OR(B11<=700000,P11<Q11),J11,I11)","v":0},null,2,"24-25",null,{"$f":"IF(B11>700000,B11-700000,0)","v":0},{"$f":"IF(B11>700000,ROUND(IF(B11<=300000,0,IF(B11<=700000,(B11-300000)*0.05,IF(B11<=1000000,20000+(B11-700000)*0.1,IF(B11<=1200000,50000+(B11-1000000)*0.15,IF(B11<=1500000,80000+(B11-1200000)*0.2,IF(B11>1500000,140000+(B11-1500000)*0.3,\"0\")))))),0),0)","v":0},{"$f":"IF(B11>700000,IF(P11<Q11,Q11-P11,0),0)","v":0}]
[]
["Tax on income including arrears",null,null,null,null,null,"OLD TAX REGIME",null,"NEW TAX REGIME"]
["year","amount","TAX","surcharge","edu. cess","total","Tax","after 87a ","Tax","after 87a "," tax"]
["2016-17",{"$f":"'Form 10E'!H33","v":0},{"$f":"H15","v":0},{"$f":"IF(B15>10000000,C15*0.15,0)","v":0},{"$f":"ROUND((C15*0.03),0)","v":0},{"$f":"C15+D15+E15","v":0},{"$f":"IF($B15>1000000, 125000+($B15-1000000)*0.3, IF($B15>500000, 25000+($B15-500000)*0.2, IF($B15>250000, ($B15-250000)*0.1, 0)))","v":0},{"$f":"IF(B15<500001,G15-MIN(G15,5000),G15)","v":0}]
["2017-18",{"$f":"'Form 10E'!H34","v":0},{"$f":"H16","v":0},{"$f":"IF(B16>10000000,C16*0.15,0)","v":0},{"$f":"ROUND((C16*0.03),0)","v":0},0,{"$f":"IF($B16>1000000, 112500+($B16-1000000)*0.3, IF($B16>500000, 12500+($B16-500000)*0.2, IF($B16>250000, ($B16-250000)*0.05, 0)))","v":0},{"$f":"IF($B16<350001,G16-MIN(G16,2500),G16)","v":0}]
["2018-19",{"$f":"'Form 10E'!H35","v":0},{"$f":"H17","v":0},null,{"$f":"ROUND((C17*0.04),0)","v":0},0,{"$f":"IF($B17>1000000, 112500+($B17-1000000)*0.3, IF($B17>500000, 12500+($B17-500000)*0.2, IF($B17>250000, ($B17-250000)*0.05, 0)))","v":0},{"$f":"IF($B17<350001,G17-MIN(G17,2500),G17)","v":0}]
["2019-20",{"$f":"'Form 10E'!H36","v":0},{"$f":"H18","v":0},null,0,0,{"$f":"IF($B18>1000000, 112500+($B18-1000000)*0.3, IF($B18>500000, 12500+($B18-500000)*0.2, IF($B18>250000, ($B18-250000)*0.05, 0)))","v":0},{"$f":"IF(B18<500001,G18-MIN(G18,12500),G18)","v":0},null,null,null,null,"control button 89(1)"]
["2020-21",{"$f":"'Form 10E'!H37","v":0},{"$f":"IF($M$7=2,K19,IF(B19<=500000,H19,G19))","v":0},null,0,0,{"$f":"ROUND(IF(B19<=250000,0,IF(B19<=500000,(B19-250000)*0.05,IF(B19<=1000000,12500+(B19-500000)*0.2,IF(B19>1000000,112500+(B19-1000000)*0.3,\"0\")))),0)","v":0},{"$f":"IF(AND(B19<=500000,G19>=12500),G19-12500,IF(AND(B19<=500000,G19<12500),0,G19))","v":0},{"$f":"ROUND(IF(B19<=250000,0,IF(B19<=500000,(B19-250000)*0.05,IF(B19<=750000,12500+(B19-500000)*0.1,IF(B19<=1000000,37500+(B19-750000)*0.15,IF(B19<=1250000,75000+(B19-1000000)*0.2,IF(B19<=1500000,125000+(B19-1250000)*0.25,IF(B19>1500000,187500+(B19-1500000)*0.3,\"0\"))))))),0)","v":0},{"$f":"IF(AND(B19<=500000,I19>=12500),I19-12500,IF(AND(B19<=500000,I19<12500),0,I19))","v":0},{"$f":"IF(B19<=500000,J19,I19)","v":0},null,{"$f":"M7","v":2},{"$f":"N7","v":"20-21"}]
["2021-22",{"$f":"'Form 10E'!H38","v":0},{"$f":"IF($M$8=2,K20,IF(B20<=500000,H20,G20))","v":0},null,0,0,{"$f":"ROUND(IF(B20<=250000,0,IF(B20<=500000,(B20-250000)*0.05,IF(B20<=1000000,12500+(B20-500000)*0.2,IF(B20>1000000,112500+(B20-1000000)*0.3,\"0\")))),0)","v":0},{"$f":"IF(AND(B20<=500000,G20>=12500),G20-12500,IF(AND(B20<=500000,G20<12500),0,G20))","v":0},{"$f":"ROUND(IF(B20<=250000,0,IF(B20<=500000,(B20-250000)*0.05,IF(B20<=750000,12500+(B20-500000)*0.1,IF(B20<=1000000,37500+(B20-750000)*0.15,IF(B20<=1250000,75000+(B20-1000000)*0.2,IF(B20<=1500000,125000+(B20-1250000)*0.25,IF(B20>1500000,187500+(B20-1500000)*0.3,\"0\"))))))),0)","v":0},{"$f":"IF(AND(B20<=500000,I20>=12500),I20-12500,IF(AND(B20<=500000,I20<12500),0,I20))","v":0},{"$f":"IF(B20<=500000,J20,I20)","v":0},null,{"$f":"M8","v":2},"21-22",null,"Marginal Relief"]
{"$rows_left_out":19}
{"sheet":"RULES","index":4,"n_rows":129,"n_cols":2,"rows_kept":129,"cut":false,"hidden":true,"merged":[[0,0,0,1]]}
["                  Brief detail of Information and RULES for(Rates,Deductions,Exemption etc.)                                                                             ( Mini Ready Reckoner)"]
[null,"  Select and click any rule to know the brief detail about the taxation Rules & Informations."]
[1,"New Tax  Rates  for Financial-Year 2020-21, Assessment Year 2021-2022 in Old and New Regime"]
[2,"Some  Exempted Receipts / Special allowances &  Perquisite which are not chargable to tax in Old regime"]
[3,"Some Exempted Income ( to be shown while Return filing) "]
[4,"T A X   R U L E S  &  O T H E R   U S E F U L   I N F O R M A T I O N S"]
["I","HRA exemption-u/s 10(13A)"]
["II","Standard deduction u/s 16 (1a) instead of Transport allowance and Medical Reimbursement"]
["III","Reimbursement of Medical bills "]
["IV"," u/s(5) LTA  Exemption "]
["V","Deduction u/s 24  and Relief u/s 80EE or 80EEA on interest on housing loan."]
["VI","u/s 80CCE & 80CCD Maximum Exemption "]
["VII","Rajiv Gandhi Equity Savings Scheme "]
["VIII","u/s 80D Medical Insurance"]
["IX","u/s 80DD Deduction in respect of medical treatment of handicapped dependents"]
["X","u/s 80DDB Deduction in respect of medical treatment for specified ailments or diseases"]
["XI","u/s 80E Interest repayment on education loan"]
["XII","u/s 80G Donations given for certain charities "]
["XIII","u/s 80GG If Assesse is not getting  HRA,  but living in rented house,"]
["XIV","u/s 80U If assesse have a permanent physical disability "]
{"$rows_left_out":110}
{"sheet":"Sheet1","index":5,"n_rows":0,"n_cols":0,"rows_kept":0,"cut":false,"hidden":true,"merged":[]}