{"text_format":"1","workbook":"xlsx","n_sheets":7,"sheets":["Instructions","Master Data","GA55 Check & Edit","Extra Ded ","GA 55 ","COMPUTATION","Form No. 16"],"not_rendered":{"charts":0,"images":24,"macros":1,"external_links":3,"defined_names":13,"comments":3,"pivot_tables":0},"unopened":[],"bounds":{"document_bytes":16777216,"sheet_cells":100000,"rows_first":2000,"rows_last":500,"rows_between":2000,"halvings":0,"cell_chars":16384,"cell_head_chars":4096},"cells_cut":0,"cells_raw":0,"read":"whole","date_system":"1900"}

{"sheet":"Instructions","index":0,"n_rows":28,"n_cols":4,"rows_kept":28,"cut":false,"hidden":false,"merged":[[17,3,18,3],[19,2,19,3],[2,1,2,2],[3,1,5,1],[8,1,8,2],[7,1,7,2],[9,1,9,2],[20,2,21,2],[17,1,17,2],[18,1,18,2],[11,1,11,2],[12,1,12,2],[14,1,14,2],[15,1,15,2],[16,1,16,2]]}
[null,null,"Instructions"]
[]
[null,";g ,Dly izksxzke esjs ije~ iwT; xq:nso Jh Jh 1008 oklqnso th egkjkt o esjs bZ\"V izHkq t;  ctjaxcyh o ikcwth egkjkt dks lefiZr gSaA esjs ekrk & firk o xq:tuksa ds vk'khokZn ls ;g izksxzke f'k{kd cU/kqvksa ds lkFk lHkh foHkkx ds dkfeZdksa dh lsok esa lknj izLrqr gSaA"]
[null,null,"How to use this Programme"]
[null,null,"If you have Hindi font problem, then first you should install Hindi font KRUTI DEV 010  in your computer."]
[null,null,"lcls igys vki jktLFkku lHkh 'kSf{kd osclkbZV ij ,Dly xq: ghjkyky tkV }kjk fufeZr vk;dj x.kuk ,Dly ,Iyhds'ku 2021&22 ds viMsV otZu+ dks MkmuyksM djsasaA blds vykok vki Google ij Heeralal Jat fy[kdj lpZ djsaxs rks Hkh vkidks ist fey tk;sxkA tgka ls vki ;g izksxzke MkmuyksM dj ldrs gSaA mlds ckn ftrusa dkfeZdksa dh vk;dj x.kuk djuh gS] mruh gh ,Dly izksxzke 'khV dks muds uke ls vyx vyx Qkby esa  Save  dj ysosaA izR;sad dkfeZd ds fy, ds fy, ,d QkbZy dks mi;ksx esa ysosaA "]
[null,"t; xq:nso ","vki bl ,Dly izksxzke ij dk;Z djus ls igys bUde VSDl foHkkx ds u;s :Yl o fu;e bUde VSDl foHkkx dh website vFkok ys[kk foK vDVqcj 2020 dkss t:j i<+sA oSls bl ,Dly izksxzke esa iq.kZ lko/kkuh cjrh xbZ gSa] fQj Hkh foHkkx ds fu;e gh loksZijh o fljks/kk;Z gSaA"]
[null,"Most Doable Work",null,"ije~ iwT; xq:nso"]
[null,"vki bl ,Dly izksxzke esa nksa 'khVksa ekLVj MkVk 'khV o ,DLV~zk fMMsD'ku 'khV dks lko/kkuhiwoZd vuykWd lsy tks lQsn dyj esa gSa] dks Hkjuk ¼MkVk fQfyax½ gSaA vkxs dh 'khVs vkWVksa tujsV gSaA os lHkh ykWd gSaA ogk ij vkidks dqN ugh djuk gSaA flQZ A4 lkbZt esa fizUV fudkyuk gSa vkSj ist Hkh lsV fd;k gqvk gSaA"]
[]
[null,"PLEASE ENABLE MACROS FIRST"]
[]
[null,";g ,Dly izksaxzke lHkh dkfeZdksa ds fy, leku :i ls rS;kj fd;k x;k gSA ladyu ,oa x.kuk esa iw.kZ lko/kkuh j[kh xbZ gSA fQj Hkh =qfV ;k fdlh Hkh izdkj dh fofHkUurk dh fLFkfr esa vk;dj foHkkx ds fu;e gh ekU; gSA rS;kjdrkZ dk dksbZ mÙkjnkf;Ro ugha gksxkA",null,"https://youtu.be/MGhyFQKgC3Q"]
[]
[null,"This Programme Developed by:        HEERALAL JAT "]
[null,"Senior Teacher"]
[null,"Mahatma Gandhi Government School (English Medium) BAR , PALI"]
[null,"heeralaljatchandawal@gmail.com",null,"You tube video Link for Macro Excel Software"]
[null,"V./P. - Chandawal Nagar, Teh.- sojat city, Dist.- Pali (Raj) 306306"]
[null,null,"https://www.youtube.com/watch?v=JIltzwkB8Ko"]
[null,"UPDATE ON","Watch the You Tube Video For More Information.","https://youtu.be/JIltzwkB8Ko"]
[]
[]
[null,"2021-11-20","https://youtu.be/MGhyFQKgC3Q","https://www.youtube.com/watch?v=FwBqjLiBd28"]
[]
[null,null,"You Tube Channel"]
[]
[null,null,"https://www.youtube.com/c/Heeralaljat/"]

{"sheet":"Master Data","index":1,"n_rows":50,"n_cols":30,"rows_kept":50,"cut":false,"hidden":false,"merged":[[49,5,49,7],[7,1,7,2],[21,1,21,3],[21,5,21,7],[23,1,23,3],[23,5,23,7],[13,1,13,2],[13,3,13,4],[13,5,13,6],[13,7,13,8],[15,1,15,2],[15,3,15,4],[33,1,33,3],[44,4,44,7],[17,1,17,2],[17,3,17,4],[48,2,48,10],[11,10,11,13],[17,10,17,13],[21,10,23,13],[35,10,36,12],[11,3,11,4],[11,5,11,6],[11,7,11,8],[43,11,44,14],[17,5,17,6],[17,7,17,8],[27,10,29,13],[31,10,31,12],[37,10,37,12],[39,10,39,12],[35,13,36,13],[1,4,1,7],[1,1,1,3],[7,3,7,4],[7,5,7,6],[7,7,7,8],[9,1,9,2],[9,3,9,4],[9,5,9,6],[9,7,9,8],[25,10,25,12],[11,1,11,2],[25,2,25,7],[41,0,42,0],[15,5,15,6],[15,7,15,8],[33,10,33,12],[29,5,29,7],[31,1,31,3],[31,5,31,7],[39,2,39,4],[27,5,27,7],[29,1,29,3],[37,1,37,7],[35,5,35,7],[35,1,35,3],[27,1,27,3],[33,5,33,7],[19,4,19,7],[3,10,3,13],[5,1,5,2],[5,3,5,4],[5,5,5,6],[5,7,5,8],[3,1,3,2],[3,3,3,8]]}
[null,null,null,null,null,null,null,null,null,null,null,null,null,null,null,null,null,null,null,null,null,null,null,null,null,null,null,null,1,"2020-04-01"]
[null,"https://youtu.be/MGhyFQKgC3Q",null,null,"EMPLOYEE  PERSONAL  DETAIL",null,null,null,null,null,null,null,null,null,null,null,null,null,null,"JUN",20,null,null,null,null,null,"2019-08-01",null,2,"2020-05-01"]
[null,null,null,null,null,null,null,null,null,null,null,null,null,null,null,null,null,null,null,null,null,null,null,null,null,null,null,null,3,"2020-06-01"]
[null,"Office Name :-",null,"Mahatma Gandhi Govt. School (English Medium) Bar, PALI",null,null,null,null,null,null,null,null,null,null,null,null,null,null,null,"JUL",null,null,null,1000,null,null,"2019-09-01",null,4,"2020-07-01"]
[null,null,null,null,null,null,null,null,null,null,null,null,null,null,null,null,null,null,null,null,null,null,null,null,null,null,null,null,5,"2020-08-01"]
[null,"Employee Name :-",null,"Heeralal jat",null,"Designation :-",null,"Sr Teacher",null,null,null,null,null,null,null,null,null,null,null,"AUG",null,null,null,620,null,null,"2019-10-01",null,6,"2020-09-01"]
[null,null,null,null,null,null,null,null,null,null,null,null,null,null,null,null,null,null,null,null,null,null,null,null,null,null,null,null,7,"2020-10-01"]
[null,"School Name :-","Posting Place :-","M.G.G.S. Bar",null,"DDO Name :-",null,"Usha Paliya",null,null,null,null,null,null,null,null,null,null,null,"SEP",null,null,null,null,null,null,"2019-11-01",null,8,"2020-11-01"]
[null,null,null,null,null,null,null,null,null,null,null,null,null,null,null,null,null,null,null,null,null,null,null,null,null,null,null,null,9,"2020-12-01"]
[null,"Personal Employee ID :-",null,"RJPAxxxxxxxx4272",null,"UID AADHAR No. :-",null,123465471475,null,null,null,null,null,null,null,null,null,null,null,"OCT",null,null,null,null,null,null,"2019-12-01",null,10,"2021-01-01"]
[null,null,null,null,null,null,null,null,null,null,null,null,null,null,null,null,null,null,null,null,null,null,null,null,null,null,null,null,11,"2021-02-01"]
[null,"PAN No. :-",null,"abcde1234h",null,"TAN NO. :-",null,null,null,null,null,null,null,null,null,null,null,null,null,"NOV",null,null,null,null,null,null,"2020-01-01",null,12]
[]
[null,"GPF No. :-",null,11,null,"SI No. :-",null,123456,null,null,null,null,null,null,null,null,null,null,null,"DEC",null,null,null,null,null,null,"2020-02-01"]
[]
[null,"PRAN No. :-",null,12134545454541,null,"Bank A/C No. :-",null,121212121212121]
[]
[null,"Gazetted / Non-Gazetted",null,"Non-Gazetted",null,"PD Head Select Yes/No :-",null,"No",null,null,"ije~ iwT; xw:nso Jh Jh 1008 oklwnso th egkjkt"]
[]
[null,null,null,null,"EMPLOYEE  PAY  DETAIL"]
[]
[null,"              D;k vkius lefiZr osru fy;k gS \\",null,null,"No",";fn gk¡ rks ekg dks lysDV djsaA",null,null,"SEP",null,"यदि कार्मिक के डीए 28 % हो गया हो तो नीचे ऑप्शन में यह सेलेक्ट करें   ",null,null,null,null,null,null,null,"YES","JAN",8,"GPF","Jaipur (U.A.)",null,"Regular Pay",null,"2019-03-01"]
[]
[null,"         vki fdl vk;q oxZ dh Js.kh esa vkrs gS \\",null,null,"Under 60","           D;k vkidks cksul feyk gS \\  %&",null,null,"Yes",null,null,null,null,null,null,null,null,null,"NO",null,9,"NPS","Ajmer",null,"Fix Pay",null,"2019-04-01"]
[]
[null,null,"vkidksa ftrusa ekg dk cksul feyk gSa ] mu ekg dh la[;kW dksa lysDV djsa    F",null,null,null,null,null,12,null,"Increase DA from July 2021  ",null,null,"Yes"]
[]
[null,"foadykax HkÙkk %&","foadykax HkÙkk %&",null,0,"  vkidks osru fey jgk gS %&",null,null,"Regular Pay",null,"पिछले सेशन 2020-21 में यदि जनवरी 2021 या फरवरी 2021 का वेतन उस वित्तिय वर्ष नहीं मिलकर यदि वर्तमान वित्तीय वर्ष में मिला हो तो माह सलेक्ट करें।",null,null,null,null,null,null,null,null,"MAR",10,null,"Bikaner",null,null,null,"2019-05-01"]
[]
[null,"    7th PAY  HRA izfr'kr esa %&",null,null,8,"%                            GPF / NPS :- ",null,null,"NPS",null,null,null,null,null,null,null,null,null,null,"APR",12,null,"Jodhpur",null,null,null,"2019-06-01"]
[]
[null,"CCA yxrk gSa rks select Yes / No   %&",null,null,"No"," CCA ykxw gks rks CITY lysDV djsa %&",null,null,"Jodhpur",null,"2021-01-01",null,null,"No",null,null,null,null,null,"MAY",16,null,"Kota",null,null,null,"2019-07-01"]
[]
[null,"    7th PAY New HRA @ izfr- ekg ¼1 tqykbZ 21 ls½ %&",null,null,9,"is esfVªDl ds vuqlkj is ysoy lysDV djsa  %&",null,null,11,null,"2021-02-01",null,null,"No"]
[]
[null,"BASIC On 01 March 2020   F",null,null,50800,";fn fofr; o\"kZ 2020&21 esa ewy osru ifjofrZr gqvk gSa rksa fy[ksa ",null,null,null,null,"NPS कार्मिक ने यदि RGHS का ऑप्शन दिया हो तो Yes सेलेक्ट करें :-",null,null,"No"]
[]
[null,";fn ewy osru esa dksbZ ifjorZu gqvk gSa tSlsa%& ,lhih@fQVesaUV ;k vU; dkj.k ls ¼badzhes.V ds vykok½ ¼ekg lysDV djsa½",null,null,null,null,null,null,null,null,"Group Insurance Rate @ :-",null,null,220]
[]
[null,null,"Tax Calculate From Month  :-\n",null,null,"2021-03-01","To Month  :-\n","2022-02-01",null,null,"किसी कारणवश  March-20 का Freeze वेतन इस वितीय वर्ष में मिला है   ",null,null,"No"]
[]
[null,"Wash All.","Handi. All.","CCA","other-1","other-2","SI","GPF / NPS","L.I.C.","RPMF / RGHS","SI Loan","GPF Loan","GPF 2004 (NPS)","GPF-2004 Dedc. Show in US 80c","SI Int."]
[null,null,600,null,null,null,7000,3575,1880,330,null,null,null,"No"]
[null,null,null,null,null,null,null,null,null,null,null,"https://youtu.be/MGhyFQKgC3Q"]
[null,null,null,null,"Income Tax Deduction By Salary"]
[null,"March","April","May","June","July","August","September","October","November","December","January","February"]
[null,0,1500,1500,1500,1500,1500,1500,1500,1500,1500,1500,0]
[]
[null,null,"First Unlock Cell Entry Fill Up Then Click On Go to Next Sheet Button"]
[null,null,null,null,null,"Use  Button For going to Next Sheet H"]

{"sheet":"GA55 Check & Edit","index":2,"n_rows":41,"n_cols":76,"rows_kept":41,"cut":false,"hidden":true,"merged":[[5,15,6,15],[2,3,2,4],[2,5,2,8],[5,28,6,28],[5,30,6,30],[5,20,6,20],[5,21,6,21],[5,22,6,22],[5,25,6,25],[5,16,6,16],[5,17,6,17],[5,18,6,18],[5,26,6,26],[5,27,6,27],[5,23,6,23],[2,18,2,25],[0,19,1,24],[5,2,6,2],[5,29,6,29],[5,3,6,3],[5,4,6,4],[5,5,6,5],[5,6,6,6],[5,7,6,7],[5,19,6,19],[5,8,6,8],[5,9,6,9],[5,10,6,10],[5,11,6,11],[5,12,6,12],[5,13,6,13],[5,14,6,14]]}
[null,null,null,null,null,null,null,null,null,null,null,null,null,null,null,null,null,null,null,"GA 55 Check & Edit sheet पर कार्य करने में मदद हेतु नीचे Youtube Video का लिंक दिया गया है।  H",null,null,null,null,null,null,null,null,null,null,null,null,null,null,null,null,null,null,null,null,null,null,null,null,null,null,null,null,"Gazetted",null,null,{"$f":"IF('Master Data'!I34>9,ROUND(AZ3/31*15,0),IF('Master Data'!D18='GA55 Check & Edit'!AW1,ROUND(AZ3/31*15,0),IF('Master Data'!I34>=5,ROUND(AZ3/31*22,0),AZ3)))","v":23855}]
[]
[null,null,null,"Employee Name :-",null,{"$f":"IF('Master Data'!D6=\"\",\"\",CONCATENATE('Master Data'!D6,\" ,  \",'Master Data'!H6))","v":"Heeralal jat ,  Sr Teacher"},null,null,null,null,null,null,null,null,null,null,null,null,"https://www.youtube.com/watch?v=y7-DiFIbdG0",null,null,null,null,null,null,null,null,null,null,null,null,null,null,null,null,null,null,null,null,null,null,null,null,null,null,null,null,null,null,null,null,{"$f":"AZ15-ROUNDUP(ROUND((AZ15*3%)-(AZ15*3%)*2.9%,-2),0)","v":49300}]
[]
[null,null,1,2,3,4,5,6,7,8,9,10,11,12,13,14,15,16,17,18,19,20,21,22,23,24,25,26,27,28,29,null,null,null,null,null,null,null,{"$f":"'Master Data'!N26","v":"Yes"},"GPF","Yes","Regular Pay","Under 60",null,1000]
[null,null,"S.N.","Month","Basic with Grade Pay","DA","HRA",{"$f":"IF('Master Data'!B42=\"\",\"\",'Master Data'!B42)","v":"Wash All."},{"$f":"IF('Master Data'!C42=\"\",\"\",'Master Data'!C42)","v":"Handi. All."},{"$f":"IF('Master Data'!D42=\"\",\"\",'Master Data'!D42)","v":"CCA"},{"$f":"IF('Master Data'!E42=\"\",\"\",'Master Data'!E42)","v":"other-1"},{"$f":"IF('Master Data'!F42=\"\",\"\",'Master Data'!F42)","v":"other-2"},"Bonus","N.P.S. By Govt.","TOTAL",{"$f":"IF('Master Data'!G42=\"\",\"\",'Master Data'!G42)","v":"SI"},{"$f":"IF('Master Data'!H42=\"\",\"\",'Master Data'!H42)","v":"GPF / NPS"},{"$f":"IF('Master Data'!I42=\"\",\"\",'Master Data'!I42)","v":"L.I.C."},{"$f":"IF('Master Data'!J42=\"\",\"\",'Master Data'!J42)","v":"RPMF / RGHS"},{"$f":"IF('Master Data'!K42=\"\",\"\",'Master Data'!K42)","v":"SI Loan"},{"$f":"IF('Master Data'!L42=\"\",\"\",'Master Data'!L42)","v":"GPF Loan"},{"$f":"IF('Master Data'!M42=\"\",\"\",'Master Data'!M42)","v":"GPF 2004 (NPS)"},{"$f":"IF('Master Data'!N42=\"\",\"\",'Master Data'!O42)","v":"SI Int."},"HITKARI NIDHI","Other ","Income Tax","G.I. + S. Tax","Total Ded.","NET PAY","TV.NO.","Enc.  DATE",null,null,null,null,null,null,null,null,"NPS","No","Fix Pay","Above 60",null,620]
[null,null,null,null,null,null,null,null,null,null,null,null,null,null,null,null,null,null,null,null,null,null,null,null,null,null,null,null,null,null,null,null,null,null,null,null,null,null,null,null,null,null,"Above 80",null,null,null,null,null,null,null,null,null,null,null,null,{"$f":"IF(D6=\"State Service\",ROUND(B10*15/31,0),IF(AND(D6=\"Subordinate\",OR(B6=G5,B6=G6,B6=G7,B6=G8,B6=G9)),ROUND(B10*22/31,0),IF(AND(D6=\"Subordinate\",OR(B6=G10,B6=G11,B6=G12,B6=G13,B6=G14,B6=G15)),ROUND(B10*15/31,0),IF(D6=\"Ministerial\",ROUND(B10*22/31,0),B10))))","v":3}]
[{"$f":"MOD(B8,2)","v":1},{"$f":"IF(LEN(D8)>=3,1,0)","v":1},1,{"$f":"IFERROR(IF(BO12=\"\",\"\",BO12),\"\")","v":"2021-03-01"},{"$f":"IFERROR(IF(D8=\"\",\"\",IF(AND(BQ12=\"\"),\"\",IF(AND('Master Data'!$I$28='GA55 Check & Edit'!$AP$6),VLOOKUP(D8,ram,13,0),VLOOKUP(D8,ram,4,0)))),\"\")","v":50800},{"$f":"IFERROR(IF(D8=\"\",\"\",IF(D8=$AX$24,\"\",IF(AND(D8=$AX$25),$BC$25,IF(AND(D8=$AX$27),\"\",IF(AND(D8=$AX$28),\"\",IF(AND('Master Data'!$I$28='GA55 Check & Edit'!$AP$5),VLOOKUP(D8,ram,7,0),\"\")))))),\"\")","v":8636},{"$f":"IFERROR(IF(D8=\"\",\"\",IF(D8=$AX$24,\"\",IF(AND(D8=$AX$25),\"\",IF(AND(D8=$AX$26),\"\",IF(AND(D8=$AX$27),\"\",IF(AND(D8=$AX$29),\"\",IF(AND('Master Data'!$I$28='GA55 Check & Edit'!$AP$6),\"\",VLOOKUP(D8,ram,8,0)))))))),\"\")","v":4064},{"$f":"IFERROR(IF(D8=\"\",\"\",IF(AND(E8=\"\"),\"\",IF(OR(D8=$AX$24,D8=$AX$25,D8=$AX$26,D8=$AX$27,D8=$AX$28,D8=$AX$29),\"\",IF(AND('Master Data'!$I$28='GA55 Check & Edit'!$AP$5),'Master Data'!$B$43,\"\")))),\"\")","v":0},{"$f":"IFERROR(IF(D8=\"\",\"\",IF(AND(E8=\"\"),\"\",IF(OR(D8=$AX$24,D8=$AX$25,D8=$AX$26,D8=$AX$27,D8=$AX$28,D8=$AX$29),\"\",IF(AND('Master Data'!$I$28='GA55 Check & Edit'!$AP$5,'Master Data'!$E$28='GA55 Check & Edit'!$AO$5),'Master Data'!$C$43,\"0\")))),\"\")","v":"0"},{"$f":"IFERROR(IF(OR('Master Data'!$E$32=$AO$6,'Master Data'!$E$32=\"\"),\"\",IF(D8=\"\",\"\",IF(AND(E8=\"\"),\"\",IF(OR(D8=$AX$24,D8=$AX$25,D8=$AX$26,D8=$AX$27,D8=$AX$28,D8=$AX$29),\"\",IF(AND('Master Data'!$I$28='GA55 Check & Edit'!$AP$6),\"\",IF(AND('Master Data'!$I$32=$AR$9),$AS$6,IF(AND('Master Data'!$I$32=$AR$10),$AS$6,IF(AND('Master Data'!$I$32=$AR$11),$AS$6,IF(AND('Master Data'!$I$32=$AR$12),$AS$6,$AS$5))))))))),\"\")","v":""},{"$f":"IFERROR(IF(D8=\"\",\"\",IF(AND(E8=\"\"),\"\",IF(OR(D8=$AX$24,D8=$AX$25,D8=$AX$26,D8=$AX$27,D8=$AX$28,D8=$AX$29),\"\",IF(AND('Master Data'!$I$28='GA55 Check & Edit'!$AP$5),'Master Data'!$E$43,\"\")))),\"\")","v":0},{"$f":"IFERROR(IF(D8=\"\",\"\",IF(AND(E8=\"\"),\"\",IF(OR(D8=$AX$24,D8=$AX$25,D8=$AX$26,D8=$AX$27,D8=$AX$28,D8=$AX$29),\"\",IF(AND('Master Data'!$I$28='GA55 Check & Edit'!$AP$6),\"\",'Master Data'!$F$43)))),\"\")","v":0},{"$f":"IFERROR(IF(D8=\"\",\"\",IF(AND('Master Data'!$I$28='GA55 Check & Edit'!$AP$6),\"\",IF(AND('Master Data'!$I$24='GA55 Check & Edit'!$AO$6),\"0\",IF(AND(D8=\"Bonus\"),VLOOKUP(D8,ram,4,0),\"\")))),\"\")","v":""},{"$f":"IFERROR(IF(AND(D8=\"\"),\"\",IF(AND(D8=$AX$25,'Master Data'!$I$30='GA55 Check & Edit'!$AN$6),ROUND((E8+F8)*0.1,0),IF(AND(D8=$AX$29,'Master Data'!$I$30='GA55 Check & Edit'!$AN$6),ROUND((F8)*0.1,0),IF(AND(D8=$AX$26,'Master Data'!$I$30='GA55 Check & Edit'!$AN$6),ROUND((F8)*0.1,0),IF(AND(D8=$AX$27,'Master Data'!$I$30='GA55 Check & Edit'!$AN$6),ROUND((E8+F8)*0.1,0),IF(AND('Master Data'!$I$30='GA55 Check & Edit'!$AN$5),\"\",IF(AND('Master Data'!$I$30='GA55 Check & Edit'!$AN$6,'Master Data'!$I$28='GA55 Check & Edit'!$AP$6),ROUND((E8)*0.1,0),ROUND((E8+F8)*0.1,0)))))))),\"\")","v":5944},{"$f":"IF(D8=\"\",\"\",IF('Master Data'!$H$18='GA55 Check & Edit'!$AO$5,SUM(E8:N8),SUM(E8:M8)))","v":63500},{"$f":"IFERROR(IF(OR('Master Data'!$I$28='GA55 Check & Edit'!$AP$6,D8=\"\"),\"\",IF(AND(D8=$AX$24),\"\",IF(AND(D8=$AX$25),\"\",IF(AND(D8=$AX$26),\"\",IF(AND(D8=$AX$27),\"\",IF(AND(D8=$AX$28),\"\",IF(AND(D8=$AX$29),\"\",IF(AND(E8=\"\"),\"\",VLOOKUP(D8,ram,11,0))))))))),\"\")","v":7000},{"$f":"IFERROR(IF(AND(D8=\"\",E8=\"\"),\"\",IF(AND(D8=$AX$25,'Master Data'!$I$30='GA55 Check & Edit'!$AN$6),ROUND((E8+F8)*0.1,0),IF(AND(D8=$AX$29,'Master Data'!$I$30='GA55 Check & Edit'!$AN$6),ROUND((F8)*0.1,0),IF(AND(D8=$AX$26,'Master Data'!$I$30='GA55 Check & Edit'!$AN$6),ROUND((F8)*0.1,0),IF(AND(D8=$AX$27,'Master Data'!$I$30='GA55 Check & Edit'!$AN$6),ROUND((E8+F8)*0.1,0),IF(AND('Master Data'!$I$30='GA55 Check & Edit'!$AN$6,'Master Data'!$I$28='GA55 Check & Edit'!$AP$6),ROUND((E8)*0.1,0),IF(AND('Master Data'!$I$30='GA55 Check & Edit'!$AN$6,'Master Data'!$I$28='GA55 Check & Edit'!$AP$5),ROUND((E8+F8)*0.1,0),IF(AND('Master Data'!$I$30='GA55 Check & Edit'!$AN$5,'Master Data'!$I$28='GA55 Check & Edit'!$AP$5),VLOOKUP(D8,ram,12,0))))))))),\"\")","v":5944},{"$f":"IFERROR(IF(OR('Master Data'!$I$28='GA55 Check & Edit'!$AP$6,D8=\"\"),\"\",IF(AND(D8=$AX$24),\"\",IF(AND(D8=$AX$25),\"\",IF(AND(D8=$AX$26),\"\",IF(AND(D8=$AX$27),\"\",IF(AND(D8=$AX$28),\"\",IF(AND(D8=$AX$29),\"\",IF(AND(D8=$AX$32),\"\",IF(AND(E8=\"\"),\"\",'Master Data'!$I$43))))))))),\"\")","v":1880},{"$f":"IFERROR(IF(OR('Master Data'!$I$28='GA55 Check & Edit'!$AP$6),\"\",IF(D8=\"\",\"\",IF(E8=\"\",\"\",IF(AND(D8=$AX$24),\"\",IF(AND(D8=$AX$25),\"\",IF(AND(D8=$AX$26),\"\",IF(AND(D8=$AX$27),\"\",IF(AND(D8=$AX$28),\"\",IF(AND(D8=$AX$29),\"\",VLOOKUP(D8,ram,10,0)))))))))),\"\")","v":0},{"$f":"IFERROR(IF(OR('Master Data'!$I$28='GA55 Check & Edit'!$AP$6,D8=\"\"),\"\",IF(AND(D8=$AX$24),\"\",IF(AND(D8=$AX$25),\"\",IF(AND(D8=$AX$26),\"\",IF(AND(D8=$AX$27),\"\",IF(AND(D8=$AX$28),\"\",IF(AND(D8=$AX$29),\"\",IF(AND(E8=\"\"),\"\",'Master Data'!$K$43)))))))),\"\")","v":0},{"$f":"IFERROR(IF(OR('Master Data'!$I$28='GA55 Check & Edit'!$AP$6,D8=\"\"),\"\",IF(AND(D8=$AX$24),\"\",IF(AND(D8=$AX$25),\"\",IF(AND(D8=$AX$26),\"\",IF(AND(D8=$AX$27),\"\",IF(AND(D8=$AX$28),\"\",IF(AND(D8=$AX$29),\"\",IF(AND(E8=\"\"),\"\",'Master Data'!$L$43)))))))),\"\")","v":0},{"$f":"IFERROR(IF(OR('Master Data'!$I$28='GA55 Check & Edit'!$AP$6,D8=\"\"),\"\",IF(AND(D8=$AX$24,'Master Data'!$I$28='GA55 Check & Edit'!$AP$5,'Master Data'!$I$30='GA55 Check & Edit'!$AN$6),ROUND(M8*50%,0),IF(AND(D8=$AX$25),\"\",IF(AND(D8=$AX$26,'Master Data'!$I$28='GA55 Check & Edit'!$AP$5,'Master Data'!$I$30='GA55 Check & Edit'!$AN$6),SUM(F8-N8),IF(AND(D8=$AX$27),\"\",IF(AND(D8=$AX$28),\"\",IF(AND(D8=$AX$29,'Master Data'!$I$28='GA55 Check & Edit'!$AP$5,'Master Data'!$I$30='GA55 Check & Edit'!$AN$6),SUM(F8-N8),IF(AND(E8=\"\"),\"\",'Master Data'!$M$43)))))))),\"\")","v":0},{"$f":"IFERROR(IF(OR('Master Data'!$I$28='GA55 Check & Edit'!$AP$6,D8=\"\"),\"\",IF(AND(D8=$AX$24),\"\",IF(AND(D8=$AX$25),\"\",IF(AND(D8=$AX$26),\"\",IF(AND(D8=$AX$27),\"\",IF(AND(D8=$AX$28),\"\",IF(AND(D8=$AX$29),\"\",IF(AND(E8=\"\"),\"\",'Master Data'!$O$43)))))))),\"\")","v":0},{"$f":"IFERROR(IF(OR('Master Data'!$I$28='GA55 Check & Edit'!$AP$6,D8=\"\"),\"\",IF(AND(E8=\"\"),\"\",IF(AND('GA55 Check & Edit'!D8='GA55 Check & Edit'!$AT$17,'Master Data'!$D$18=\"Gazetted\"),500,IF(AND('GA55 Check & Edit'!D8='GA55 Check & Edit'!$AT$17,'Master Data'!$D$18=\"Non-Gazetted\"),250,\"\")))),\"\")","v":""},{"$f":"IFERROR(IF(D8=\"\",\"\",IF(AND(E8=\"\"),\"\",IF(AND(D8=$AX$24),\"\",IF(AND(D8=$AX$25),\"\",IF(AND(D8=$AX$26),\"\",IF(AND(D8=$AX$27),\"\",IF(AND(D8=$AX$28),\"\",IF(AND(D8=$AX$29),\"\",IF(OR('Master Data'!$I$28='GA55 Check & Edit'!$AP$6,D8=\"\"),\"\",$Y$7))))))))),\"\")","v":0},{"$f":"IFERROR(IF(OR('Master Data'!$I$28='GA55 Check & Edit'!$AP$6),\"\",IF(D8=\"\",\"\",IF(E8=\"\",\"\",VLOOKUP(D8,ram,9,0)))),\"\")","v":0},{"$f":"IFERROR(IF(OR('Master Data'!$I$28='GA55 Check & Edit'!$AP$6,D8=\"\",'Master Data'!$N$38=\"\"),\"\",IF(AND(E8=\"\"),\"\",IF('GA55 Check & Edit'!D8='GA55 Check & Edit'!$AT$9,'Master Data'!$N$38,\"\"))),\"\")","v":""},{"$f":"IFERROR(IF(D8=\"\",\"\",IF(AND(O8=\"\"),\"\",IF(AND(N8=\"\"),SUM(P8:AA8),IF(AND('Master Data'!$H$18='GA55 Check & Edit'!$AO$5,'Master Data'!$I$30='GA55 Check & Edit'!$AN$6),SUM(P8:AA8)+N8,SUM(P8:AA8))))),\"0\")","v":14824},{"$f":"IFERROR(IF(AND(E8=\"\",O8=\"\",AB8=\"\"),\"\",SUM(O8-AB8)),\"\")","v":48676},null,null,null,null,null,null,null,null,null,null,null,null,null,null,"Jaipur (U.A.)","JAN","2021-03-01","L-1",null,null,"2020-03-01"]
[{"$f":"MOD(B9,2)","v":0},{"$f":"IF(LEN(D9)>=3,B8+1,0)","v":2},2,{"$f":"IFERROR(IF(BO13=\"\",\"\",BO13),\"\")","v":"2021-04-01"},{"$f":"IFERROR(IF(D9=\"\",\"\",IF(AND(BQ13=\"\"),\"\",IF(AND('Master Data'!$I$28='GA55 Check & Edit'!$AP$6),VLOOKUP(D9,ram,13,0),VLOOKUP(D9,ram,4,0)))),\"\")","v":50800},{"$f":"IFERROR(IF(D9=\"\",\"\",IF(D9=$AX$24,\"\",IF(AND(D9=$AX$25),$BC$25,IF(AND(D9=$AX$27),\"\",IF(AND(D9=$AX$28),\"\",IF(AND('Master Data'!$I$28='GA55 Check & Edit'!$AP$5),VLOOKUP(D9,ram,7,0),\"\")))))),\"\")","v":8636},{"$f":"IFERROR(IF(D9=\"\",\"\",IF(D9=$AX$24,\"\",IF(AND(D9=$AX$25),\"\",IF(AND(D9=$AX$26),\"\",IF(AND(D9=$AX$27),\"\",IF(AND(D9=$AX$29),\"\",IF(AND('Master Data'!$I$28='GA55 Check & Edit'!$AP$6),\"\",VLOOKUP(D9,ram,8,0)))))))),\"\")","v":4064},{"$f":"IFERROR(IF(D9=\"\",\"\",IF(AND(E9=\"\"),\"\",IF(OR(D9=$AX$24,D9=$AX$25,D9=$AX$26,D9=$AX$27,D9=$AX$28,D9=$AX$29),\"\",IF(AND('Master Data'!$I$28='GA55 Check & Edit'!$AP$5),'Master Data'!$B$43,\"\")))),\"\")","v":0},{"$f":"IFERROR(IF(D9=\"\",\"\",IF(AND(E9=\"\"),\"\",IF(OR(D9=$AX$24,D9=$AX$25,D9=$AX$26,D9=$AX$27,D9=$AX$28,D9=$AX$29),\"\",IF(AND('Master Data'!$I$28='GA55 Check & Edit'!$AP$5,'Master Data'!$E$28='GA55 Check & Edit'!$AO$5),'Master Data'!$C$43,\"0\")))),\"\")","v":"0"},{"$f":"IFERROR(IF(OR('Master Data'!$E$32=$AO$6,'Master Data'!$E$32=\"\"),\"\",IF(D9=\"\",\"\",IF(AND(E9=\"\"),\"\",IF(OR(D9=$AX$24,D9=$AX$25,D9=$AX$26,D9=$AX$27,D9=$AX$28,D9=$AX$29),\"\",IF(AND('Master Data'!$I$28='GA55 Check & Edit'!$AP$6),\"\",IF(AND('Master Data'!$I$32=$AR$9),$AS$6,IF(AND('Master Data'!$I$32=$AR$10),$AS$6,IF(AND('Master Data'!$I$32=$AR$11),$AS$6,IF(AND('Master Data'!$I$32=$AR$12),$AS$6,$AS$5))))))))),\"\")","v":""},{"$f":"IFERROR(IF(D9=\"\",\"\",IF(AND(E9=\"\"),\"\",IF(OR(D9=$AX$24,D9=$AX$25,D9=$AX$26,D9=$AX$27,D9=$AX$28,D9=$AX$29),\"\",IF(AND('Master Data'!$I$28='GA55 Check & Edit'!$AP$5),'Master Data'!$E$43,\"\")))),\"\")","v":0},{"$f":"IFERROR(IF(D9=\"\",\"\",IF(AND(E9=\"\"),\"\",IF(OR(D9=$AX$24,D9=$AX$25,D9=$AX$26,D9=$AX$27,D9=$AX$28,D9=$AX$29),\"\",IF(AND('Master Data'!$I$28='GA55 Check & Edit'!$AP$6),\"\",'Master Data'!$F$43)))),\"\")","v":0},{"$f":"IFERROR(IF(D9=\"\",\"\",IF(AND('Master Data'!$I$28='GA55 Check & Edit'!$AP$6),\"\",IF(AND('Master Data'!$I$24='GA55 Check & Edit'!$AO$6),\"\",IF(AND(D9=\"Bonus\"),VLOOKUP(D9,ram,4,0),\"\")))),\"\")","v":""},{"$f":"IFERROR(IF(AND(D9=\"\"),\"\",IF(AND(D9=$AX$25,'Master Data'!$I$30='GA55 Check & Edit'!$AN$6),ROUND((E9+F9)*0.1,0),IF(AND(D9=$AX$29,'Master Data'!$I$30='GA55 Check & Edit'!$AN$6),ROUND((F9)*0.1,0),IF(AND(D9=$AX$26,'Master Data'!$I$30='GA55 Check & Edit'!$AN$6),ROUND((F9)*0.1,0),IF(AND(D9=$AX$27,'Master Data'!$I$30='GA55 Check & Edit'!$AN$6),ROUND((E9+F9)*0.1,0),IF(AND('Master Data'!$I$30='GA55 Check & Edit'!$AN$5),\"\",IF(AND('Master Data'!$I$30='GA55 Check & Edit'!$AN$6,'Master Data'!$I$28='GA55 Check & Edit'!$AP$6),ROUND((E9)*0.1,0),ROUND((E9+F9)*0.1,0)))))))),\"\")","v":5944},{"$f":"IF(D9=\"\",\"\",IF('Master Data'!$H$18='GA55 Check & Edit'!$AO$5,SUM(E9:N9),SUM(E9:M9)))","v":63500},{"$f":"IFERROR(IF(OR('Master Data'!$I$28='GA55 Check & Edit'!$AP$6,D9=\"\"),\"\",IF(AND(D9=$AX$24),\"\",IF(AND(D9=$AX$25),\"\",IF(AND(D9=$AX$26),\"\",IF(AND(D9=$AX$27),\"\",IF(AND(D9=$AX$28),\"\",IF(AND(D9=$AX$29),\"\",IF(AND(E9=\"\"),\"\",VLOOKUP(D9,ram,11,0))))))))),\"\")","v":7000},{"$f":"IFERROR(IF(AND(D9=\"\",E9=\"\"),\"\",IF(AND(D9=$AX$25,'Master Data'!$I$30='GA55 Check & Edit'!$AN$6),ROUND((E9+F9)*0.1,0),IF(AND(D9=$AX$29,'Master Data'!$I$30='GA55 Check & Edit'!$AN$6),ROUND((F9)*0.1,0),IF(AND(D9=$AX$26,'Master Data'!$I$30='GA55 Check & Edit'!$AN$6),ROUND((F9)*0.1,0),IF(AND(D9=$AX$27,'Master Data'!$I$30='GA55 Check & Edit'!$AN$6),ROUND((E9+F9)*0.1,0),IF(AND('Master Data'!$I$30='GA55 Check & Edit'!$AN$6,'Master Data'!$I$28='GA55 Check & Edit'!$AP$6),ROUND((E9)*0.1,0),IF(AND('Master Data'!$I$30='GA55 Check & Edit'!$AN$6,'Master Data'!$I$28='GA55 Check & Edit'!$AP$5),ROUND((E9+F9)*0.1,0),IF(AND('Master Data'!$I$30='GA55 Check & Edit'!$AN$5,'Master Data'!$I$28='GA55 Check & Edit'!$AP$5),VLOOKUP(D9,ram,12,0))))))))),\"\")","v":5944},{"$f":"IFERROR(IF(OR('Master Data'!$I$28='GA55 Check & Edit'!$AP$6,D9=\"\"),\"\",IF(AND(D9=$AX$24),\"\",IF(AND(D9=$AX$25),\"\",IF(AND(D9=$AX$26),\"\",IF(AND(D9=$AX$27),\"\",IF(AND(D9=$AX$28),\"\",IF(AND(D9=$AX$29),\"\",IF(AND(D9=$AX$32),\"\",IF(AND(E9=\"\"),\"\",'Master Data'!$I$43))))))))),\"\")","v":1880},{"$f":"IFERROR(IF(OR('Master Data'!$I$28='GA55 Check & Edit'!$AP$6),\"\",IF(D9=\"\",\"\",IF(E9=\"\",\"\",IF(AND(D9=$AX$24),\"\",IF(AND(D9=$AX$25),\"\",IF(AND(D9=$AX$26),\"\",IF(AND(D9=$AX$27),\"\",IF(AND(D9=$AX$28),\"\",IF(AND(D9=$AX$29),\"\",VLOOKUP(D9,ram,10,0)))))))))),\"\")","v":0},{"$f":"IFERROR(IF(OR('Master Data'!$I$28='GA55 Check & Edit'!$AP$6,D9=\"\"),\"\",IF(AND(D9=$AX$24),\"\",IF(AND(D9=$AX$25),\"\",IF(AND(D9=$AX$26),\"\",IF(AND(D9=$AX$27),\"\",IF(AND(D9=$AX$28),\"\",IF(AND(D9=$AX$29),\"\",IF(AND(E9=\"\"),\"\",'Master Data'!$K$43)))))))),\"\")","v":0},{"$f":"IFERROR(IF(OR('Master Data'!$I$28='GA55 Check & Edit'!$AP$6,D9=\"\"),\"\",IF(AND(D9=$AX$24),\"\",IF(AND(D9=$AX$25),\"\",IF(AND(D9=$AX$26),\"\",IF(AND(D9=$AX$27),\"\",IF(AND(D9=$AX$28),\"\",IF(AND(D9=$AX$29),\"\",IF(AND(E9=\"\"),\"\",'Master Data'!$L$43)))))))),\"\")","v":0},{"$f":"IFERROR(IF(OR('Master Data'!$I$28='GA55 Check & Edit'!$AP$6,D9=\"\"),\"\",IF(AND(D9=$AX$24,'Master Data'!$I$28='GA55 Check & Edit'!$AP$5,'Master Data'!$I$30='GA55 Check & Edit'!$AN$6),ROUND(M9*50%,0),IF(AND(D9=$AX$25),\"\",IF(AND(D9=$AX$26,'Master Data'!$I$28='GA55 Check & Edit'!$AP$5,'Master Data'!$I$30='GA55 Check & Edit'!$AN$6),SUM(F9-N9),IF(AND(D9=$AX$27),\"\",IF(AND(D9=$AX$28),\"\",IF(AND(D9=$AX$29,'Master Data'!$I$28='GA55 Check & Edit'!$AP$5,'Master Data'!$I$30='GA55 Check & Edit'!$AN$6),SUM(F9-N9),IF(AND(E9=\"\"),\"\",'Master Data'!$M$43)))))))),\"\")","v":0},{"$f":"IFERROR(IF(OR('Master Data'!$I$28='GA55 Check & Edit'!$AP$6,D9=\"\"),\"\",IF(AND(D9=$AX$24),\"\",IF(AND(D9=$AX$25),\"\",IF(AND(D9=$AX$26),\"\",IF(AND(D9=$AX$27),\"\",IF(AND(D9=$AX$28),\"\",IF(AND(D9=$AX$29),\"\",IF(AND(E9=\"\"),\"\",'Master Data'!$O$43)))))))),\"\")","v":0},{"$f":"IFERROR(IF(OR('Master Data'!$I$28='GA55 Check & Edit'!$AP$6,D9=\"\"),\"\",IF(AND(E9=\"\"),\"\",IF(AND('GA55 Check & Edit'!D9='GA55 Check & Edit'!$AT$17,'Master Data'!$D$18=\"Gazetted\"),500,IF(AND('GA55 Check & Edit'!D9='GA55 Check & Edit'!$AT$17,'Master Data'!$D$18=\"Non-Gazetted\"),250,\"\")))),\"\")","v":""},{"$f":"IFERROR(IF(D9=\"\",\"\",IF(AND(E9=\"\"),\"\",IF(AND(D9=$AX$24),\"\",IF(AND(D9=$AX$25),\"\",IF(AND(D9=$AX$26),\"\",IF(AND(D9=$AX$27),\"\",IF(AND(D9=$AX$28),\"\",IF(AND(D9=$AX$29),\"\",IF(OR('Master Data'!$I$28='GA55 Check & Edit'!$AP$6,D9=\"\"),\"\",$Y$7))))))))),\"\")","v":0},{"$f":"IFERROR(IF(OR('Master Data'!$I$28='GA55 Check & Edit'!$AP$6),\"\",IF(D9=\"\",\"\",IF(E9=\"\",\"\",VLOOKUP(D9,ram,9,0)))),\"\")","v":1500},{"$f":"IFERROR(IF(OR('Master Data'!$I$28='GA55 Check & Edit'!$AP$6,D9=\"\",'Master Data'!$N$38=\"\"),\"\",IF(AND(E9=\"\"),\"\",IF('GA55 Check & Edit'!D9='GA55 Check & Edit'!$AT$9,'Master Data'!$N$38,\"\"))),\"\")","v":220},{"$f":"IFERROR(IF(D9=\"\",\"\",IF(AND(O9=\"\"),\"\",IF(AND(N9=\"\"),SUM(P9:AA9),IF(AND('Master Data'!$H$18='GA55 Check & Edit'!$AO$5,'Master Data'!$I$30='GA55 Check & Edit'!$AN$6),SUM(P9:AA9)+N9,SUM(P9:AA9))))),\"0\")","v":16544},{"$f":"IFERROR(IF(AND(E9=\"\",O9=\"\",AB9=\"\"),\"\",SUM(O9-AB9)),\"\")","v":46956},null,null,null,null,null,null,null,null,null,null,null,null,null,null,"Ajmer","FEB","2021-04-01","L-2",null,null,null,null,"2022-02-28",null,null,{"$f":"IF('Master Data'!I34>9,ROUND('Master Data'!$E$36/31*15,0),IF('Master Data'!E34='GA55 Check & Edit'!AO5,ROUND('Master Data'!$E$36/31*15,0),IF('Master Data'!I34>=5,ROUND('Master Data'!$E$36/31*22,0),IF('Master Data'!D18='GA55 Check & Edit'!AO5,ROUND('Master Data'!$E$36/31*22,0),'Master Data'!E36))))","v":24581}]
[1,{"$f":"IF(LEN(D10)>=3,B9+1,0)","v":3},{"$f":"IF(B10=0,\"\",B10)","v":3},"2021-05-01",{"$f":"IFERROR(IF(D10=\"\",\"\",IF(AND(BQ14=\"\"),\"\",IF(AND('Master Data'!$I$28='GA55 Check & Edit'!$AP$6),VLOOKUP(D10,ram,13,0),VLOOKUP(D10,ram,4,0)))),\"\")","v":50800},{"$f":"IFERROR(IF(D10=\"\",\"\",IF(D10=$AX$24,\"\",IF(AND(D10=$AX$25),$BC$25,IF(AND(D10=$AX$27),\"\",IF(AND(D10=$AX$28),\"\",IF(AND('Master Data'!$I$28='GA55 Check & Edit'!$AP$5),VLOOKUP(D10,ram,7,0),\"\")))))),\"\")","v":8636},{"$f":"IFERROR(IF(D10=\"\",\"\",IF(D10=$AX$24,\"\",IF(AND(D10=$AX$25),\"\",IF(AND(D10=$AX$26),\"\",IF(AND(D10=$AX$27),\"\",IF(AND(D10=$AX$29),\"\",IF(AND('Master Data'!$I$28='GA55 Check & Edit'!$AP$6),\"\",VLOOKUP(D10,ram,8,0)))))))),\"\")","v":4064},{"$f":"IFERROR(IF(D10=\"\",\"\",IF(AND(E10=\"\"),\"\",IF(OR(D10=$AX$24,D10=$AX$25,D10=$AX$26,D10=$AX$27,D10=$AX$28,D10=$AX$29),\"\",IF(AND('Master Data'!$I$28='GA55 Check & Edit'!$AP$5),'Master Data'!$B$43,\"\")))),\"\")","v":0},{"$f":"IFERROR(IF(D10=\"\",\"\",IF(AND(E10=\"\"),\"\",IF(OR(D10=$AX$24,D10=$AX$25,D10=$AX$26,D10=$AX$27,D10=$AX$28,D10=$AX$29),\"\",IF(AND('Master Data'!$I$28='GA55 Check & Edit'!$AP$5,'Master Data'!$E$28='GA55 Check & Edit'!$AO$5),'Master Data'!$C$43,\"0\")))),\"\")","v":"0"},{"$f":"IFERROR(IF(OR('Master Data'!$E$32=$AO$6,'Master Data'!$E$32=\"\"),\"\",IF(D10=\"\",\"\",IF(AND(E10=\"\"),\"\",IF(OR(D10=$AX$24,D10=$AX$25,D10=$AX$26,D10=$AX$27,D10=$AX$28,D10=$AX$29),\"\",IF(AND('Master Data'!$I$28='GA55 Check & Edit'!$AP$6),\"\",IF(AND('Master Data'!$I$32=$AR$9),$AS$6,IF(AND('Master Data'!$I$32=$AR$10),$AS$6,IF(AND('Master Data'!$I$32=$AR$11),$AS$6,IF(AND('Master Data'!$I$32=$AR$12),$AS$6,$AS$5))))))))),\"\")","v":""},{"$f":"IFERROR(IF(D10=\"\",\"\",IF(AND(E10=\"\"),\"\",IF(OR(D10=$AX$24,D10=$AX$25,D10=$AX$26,D10=$AX$27,D10=$AX$28,D10=$AX$29),\"\",IF(AND('Master Data'!$I$28='GA55 Check & Edit'!$AP$5),'Master Data'!$E$43,\"\")))),\"\")","v":0},{"$f":"IFERROR(IF(D10=\"\",\"\",IF(AND(E10=\"\"),\"\",IF(OR(D10=$AX$24,D10=$AX$25,D10=$AX$26,D10=$AX$27,D10=$AX$28,D10=$AX$29),\"\",IF(AND('Master Data'!$I$28='GA55 Check & Edit'!$AP$6),\"\",'Master Data'!$F$43)))),\"\")","v":0},{"$f":"IFERROR(IF(D10=\"\",\"\",IF(AND('Master Data'!$I$28='GA55 Check & Edit'!$AP$6),\"\",IF(AND('Master Data'!$I$24='GA55 Check & Edit'!$AO$6),\"\",IF(AND(D10=\"Bonus\"),VLOOKUP(D10,ram,4,0),\"\")))),\"\")","v":""},{"$f":"IFERROR(IF(AND(D10=\"\"),\"\",IF(AND(D10=$AX$25,'Master Data'!$I$30='GA55 Check & Edit'!$AN$6),ROUND((E10+F10)*0.1,0),IF(AND(D10=$AX$29,'Master Data'!$I$30='GA55 Check & Edit'!$AN$6),ROUND((F10)*0.1,0),IF(AND(D10=$AX$26,'Master Data'!$I$30='GA55 Check & Edit'!$AN$6),ROUND((F10)*0.1,0),IF(AND(D10=$AX$27,'Master Data'!$I$30='GA55 Check & Edit'!$AN$6),ROUND((E10+F10)*0.1,0),IF(AND('Master Data'!$I$30='GA55 Check & Edit'!$AN$5),\"\",IF(AND('Master Data'!$I$30='GA55 Check & Edit'!$AN$6,'Master Data'!$I$28='GA55 Check & Edit'!$AP$6),ROUND((E10)*0.1,0),ROUND((E10+F10)*0.1,0)))))))),\"\")","v":5944},{"$f":"IF(D10=\"\",\"\",IF('Master Data'!$H$18='GA55 Check & Edit'!$AO$5,SUM(E10:N10),SUM(E10:M10)))","v":63500},{"$f":"IFERROR(IF(OR('Master Data'!$I$28='GA55 Check & Edit'!$AP$6,D10=\"\"),\"\",IF(AND(D10=$AX$24),\"\",IF(AND(D10=$AX$25),\"\",IF(AND(D10=$AX$26),\"\",IF(AND(D10=$AX$27),\"\",IF(AND(D10=$AX$28),\"\",IF(AND(D10=$AX$29),\"\",IF(AND(E10=\"\"),\"\",VLOOKUP(D10,ram,11,0))))))))),\"\")","v":7000},{"$f":"IFERROR(IF(AND(D10=\"\",E10=\"\"),\"\",IF(AND(D10=$AX$25,'Master Data'!$I$30='GA55 Check & Edit'!$AN$6),ROUND((E10+F10)*0.1,0),IF(AND(D10=$AX$29,'Master Data'!$I$30='GA55 Check & Edit'!$AN$6),ROUND((F10)*0.1,0),IF(AND(D10=$AX$26,'Master Data'!$I$30='GA55 Check & Edit'!$AN$6),ROUND((F10)*0.1,0),IF(AND(D10=$AX$27,'Master Data'!$I$30='GA55 Check & Edit'!$AN$6),ROUND((E10+F10)*0.1,0),IF(AND('Master Data'!$I$30='GA55 Check & Edit'!$AN$6,'Master Data'!$I$28='GA55 Check & Edit'!$AP$6),ROUND((E10)*0.1,0),IF(AND('Master Data'!$I$30='GA55 Check & Edit'!$AN$6,'Master Data'!$I$28='GA55 Check & Edit'!$AP$5),ROUND((E10+F10)*0.1,0),IF(AND('Master Data'!$I$30='GA55 Check & Edit'!$AN$5,'Master Data'!$I$28='GA55 Check & Edit'!$AP$5),VLOOKUP(D10,ram,12,0))))))))),\"\")","v":5944},{"$f":"IFERROR(IF(OR('Master Data'!$I$28='GA55 Check & Edit'!$AP$6,D10=\"\"),\"\",IF(AND(D10=$AX$24),\"\",IF(AND(D10=$AX$25),\"\",IF(AND(D10=$AX$26),\"\",IF(AND(D10=$AX$27),\"\",IF(AND(D10=$AX$28),\"\",IF(AND(D10=$AX$29),\"\",IF(AND(D10=$AX$32),\"\",IF(AND(E10=\"\"),\"\",'Master Data'!$I$43))))))))),\"\")","v":1880},{"$f":"IFERROR(IF(OR('Master Data'!$I$28='GA55 Check & Edit'!$AP$6),\"\",IF(D10=\"\",\"\",IF(E10=\"\",\"\",IF(AND(D10=$AX$24),\"\",IF(AND(D10=$AX$25),\"\",IF(AND(D10=$AX$26),\"\",IF(AND(D10=$AX$27),\"\",IF(AND(D10=$AX$28),\"\",IF(AND(D10=$AX$29),\"\",VLOOKUP(D10,ram,10,0)))))))))),\"\")","v":0},{"$f":"IFERROR(IF(OR('Master Data'!$I$28='GA55 Check & Edit'!$AP$6,D10=\"\"),\"\",IF(AND(D10=$AX$24),\"\",IF(AND(D10=$AX$25),\"\",IF(AND(D10=$AX$26),\"\",IF(AND(D10=$AX$27),\"\",IF(AND(D10=$AX$28),\"\",IF(AND(D10=$AX$29),\"\",IF(AND(E10=\"\"),\"\",'Master Data'!$K$43)))))))),\"\")","v":0},{"$f":"IFERROR(IF(OR('Master Data'!$I$28='GA55 Check & Edit'!$AP$6,D10=\"\"),\"\",IF(AND(D10=$AX$24),\"\",IF(AND(D10=$AX$25),\"\",IF(AND(D10=$AX$26),\"\",IF(AND(D10=$AX$27),\"\",IF(AND(D10=$AX$28),\"\",IF(AND(D10=$AX$29),\"\",IF(AND(E10=\"\"),\"\",'Master Data'!$L$43)))))))),\"\")","v":0},{"$f":"IFERROR(IF(OR('Master Data'!$I$28='GA55 Check & Edit'!$AP$6,D10=\"\"),\"\",IF(AND(D10=$AX$24,'Master Data'!$I$28='GA55 Check & Edit'!$AP$5,'Master Data'!$I$30='GA55 Check & Edit'!$AN$6),ROUND(M10*50%,0),IF(AND(D10=$AX$25),\"\",IF(AND(D10=$AX$26,'Master Data'!$I$28='GA55 Check & Edit'!$AP$5,'Master Data'!$I$30='GA55 Check & Edit'!$AN$6),SUM(F10-N10),IF(AND(D10=$AX$27),\"\",IF(AND(D10=$AX$28),\"\",IF(AND(D10=$AX$29,'Master Data'!$I$28='GA55 Check & Edit'!$AP$5,'Master Data'!$I$30='GA55 Check & Edit'!$AN$6),SUM(F10-N10),IF(AND(E10=\"\"),\"\",'Master Data'!$M$43)))))))),\"\")","v":0},{"$f":"IFERROR(IF(OR('Master Data'!$I$28='GA55 Check & Edit'!$AP$6,D10=\"\"),\"\",IF(AND(D10=$AX$24),\"\",IF(AND(D10=$AX$25),\"\",IF(AND(D10=$AX$26),\"\",IF(AND(D10=$AX$27),\"\",IF(AND(D10=$AX$28),\"\",IF(AND(D10=$AX$29),\"\",IF(AND(E10=\"\"),\"\",'Master Data'!$O$43)))))))),\"\")","v":0},{"$f":"IFERROR(IF(OR('Master Data'!$I$28='GA55 Check & Edit'!$AP$6,D10=\"\"),\"\",IF(AND(E10=\"\"),\"\",IF(AND('GA55 Check & Edit'!D10='GA55 Check & Edit'!$AT$17,'Master Data'!$D$18=\"Gazetted\"),500,IF(AND('GA55 Check & Edit'!D10='GA55 Check & Edit'!$AT$17,'Master Data'!$D$18=\"Non-Gazetted\"),250,\"\")))),\"\")","v":""},{"$f":"IFERROR(IF(D10=\"\",\"\",IF(AND(E10=\"\"),\"\",IF(AND(D10=$AX$24),\"\",IF(AND(D10=$AX$25),\"\",IF(AND(D10=$AX$26),\"\",IF(AND(D10=$AX$27),\"\",IF(AND(D10=$AX$28),\"\",IF(AND(D10=$AX$29),\"\",IF(OR('Master Data'!$I$28='GA55 Check & Edit'!$AP$6,D10=\"\"),\"\",$Y$7))))))))),\"\")","v":0},{"$f":"IFERROR(IF(OR('Master Data'!$I$28='GA55 Check & Edit'!$AP$6),\"\",IF(D10=\"\",\"\",IF(E10=\"\",\"\",VLOOKUP(D10,ram,9,0)))),\"\")","v":1500},{"$f":"IFERROR(IF(OR('Master Data'!$I$28='GA55 Check & Edit'!$AP$6,D10=\"\",'Master Data'!$N$38=\"\"),\"\",IF(AND(E10=\"\"),\"\",IF('GA55 Check & Edit'!D10='GA55 Check & Edit'!$AT$9,'Master Data'!$N$38,\"\"))),\"\")","v":""},{"$f":"IFERROR(IF(D10=\"\",\"\",IF(AND(O10=\"\"),\"\",IF(AND(N10=\"\"),SUM(P10:AA10),IF(AND('Master Data'!$H$18='GA55 Check & Edit'!$AO$5,'Master Data'!$I$30='GA55 Check & Edit'!$AN$6),SUM(P10:AA10)+N10,SUM(P10:AA10))))),\"0\")","v":16324},47176,null,null,null,null,null,null,null,null,null,null,null,null,null,null,"Bikaner","MAR","2021-05-01","L-3",null,"JAN","2021-01-01",null,null,{"$f":"IF(AND('Master Data'!$E$36=\"\"),\"\",'Master Data'!$E$36)","v":50800},{"$f":"IF(AND(AX10<$AZ$16),\"\",IF(AND(AX10>$AZ$17),\"\",BA10))","v":""},{"$f":"IF(AND('Master Data'!$E$36=\"\"),\"\",ROUND(17%*BA10,0))","v":8636},{"$f":"IF(BB10=\"\",\"\",BC10)","v":""},null,null,{"$f":"IFERROR(IF(AND('Master Data'!$I$28='GA55 Check & Edit'!$AP$6),\"\",IF(AND('Master Data'!$I$30='GA55 Check & Edit'!$AN$6,'Master Data'!$N$36='GA55 Check & Edit'!$AO$6),\"\",IF(AND('Master Data'!$I$30='GA55 Check & Edit'!$AN$5),IF($AZ$15<18001,265,IF($AZ$15<33501,440,IF($AZ$15<54001,658,875)))))),0)","v":""},{"$f":"IFERROR(IF(OR('Master Data'!$I$28='GA55 Check & Edit'!$AP$6),\"\",'Master Data'!$G$43),\"\")","v":7000},{"$f":"IFERROR(IF(AND('Master Data'!$I$30='GA55 Check & Edit'!$AN$6),ROUND((E9)*0.1,0),IF(AND('Master Data'!$I$28='GA55 Check & Edit'!$AP$6),ROUND((E9+F9)*0.1,0),'Master Data'!$H$43)),\"\")","v":5080},{"$f":"BA10","v":50800},null,{"$f":"MONTH(AZ17)","v":2},null,null,null,null,null,null,{"$f":"D8","v":"2021-03-01"}]
[0,4,4,"2021-06-01",{"$f":"IFERROR(IF(D11=\"\",\"\",IF(AND(BQ15=\"\"),\"\",IF(AND('Master Data'!$I$28='GA55 Check & Edit'!$AP$6),VLOOKUP(D11,ram,13,0),VLOOKUP(D11,ram,4,0)))),\"\")","v":50800},{"$f":"IFERROR(IF(D11=\"\",\"\",IF(D11=$AX$24,\"\",IF(AND(D11=$AX$25),$BC$25,IF(AND(D11=$AX$27),\"\",IF(AND(D11=$AX$28),\"\",IF(AND('Master Data'!$I$28='GA55 Check & Edit'!$AP$5),VLOOKUP(D11,ram,7,0),\"\")))))),\"\")","v":8636},{"$f":"IFERROR(IF(D11=\"\",\"\",IF(D11=$AX$24,\"\",IF(AND(D11=$AX$25),\"\",IF(AND(D11=$AX$26),\"\",IF(AND(D11=$AX$27),\"\",IF(AND(D11=$AX$29),\"\",IF(AND('Master Data'!$I$28='GA55 Check & Edit'!$AP$6),\"\",VLOOKUP(D11,ram,8,0)))))))),\"\")","v":4064},{"$f":"IFERROR(IF(D11=\"\",\"\",IF(AND(E11=\"\"),\"\",IF(OR(D11=$AX$24,D11=$AX$25,D11=$AX$26,D11=$AX$27,D11=$AX$28,D11=$AX$29),\"\",IF(AND('Master Data'!$I$28='GA55 Check & Edit'!$AP$5),'Master Data'!$B$43,\"\")))),\"\")","v":0},{"$f":"IFERROR(IF(D11=\"\",\"\",IF(AND(E11=\"\"),\"\",IF(OR(D11=$AX$24,D11=$AX$25,D11=$AX$26,D11=$AX$27,D11=$AX$28,D11=$AX$29),\"\",IF(AND('Master Data'!$I$28='GA55 Check & Edit'!$AP$5,'Master Data'!$E$28='GA55 Check & Edit'!$AO$5),'Master Data'!$C$43,\"0\")))),\"\")","v":"0"},{"$f":"IFERROR(IF(OR('Master Data'!$E$32=$AO$6,'Master Data'!$E$32=\"\"),\"\",IF(D11=\"\",\"\",IF(AND(E11=\"\"),\"\",IF(OR(D11=$AX$24,D11=$AX$25,D11=$AX$26,D11=$AX$27,D11=$AX$28,D11=$AX$29),\"\",IF(AND('Master Data'!$I$28='GA55 Check & Edit'!$AP$6),\"\",IF(AND('Master Data'!$I$32=$AR$9),$AS$6,IF(AND('Master Data'!$I$32=$AR$10),$AS$6,IF(AND('Master Data'!$I$32=$AR$11),$AS$6,IF(AND('Master Data'!$I$32=$AR$12),$AS$6,$AS$5))))))))),\"\")","v":""},{"$f":"IFERROR(IF(D11=\"\",\"\",IF(AND(E11=\"\"),\"\",IF(OR(D11=$AX$24,D11=$AX$25,D11=$AX$26,D11=$AX$27,D11=$AX$28,D11=$AX$29),\"\",IF(AND('Master Data'!$I$28='GA55 Check & Edit'!$AP$5),'Master Data'!$E$43,\"\")))),\"\")","v":0},{"$f":"IFERROR(IF(D11=\"\",\"\",IF(AND(E11=\"\"),\"\",IF(OR(D11=$AX$24,D11=$AX$25,D11=$AX$26,D11=$AX$27,D11=$AX$28,D11=$AX$29),\"\",IF(AND('Master Data'!$I$28='GA55 Check & Edit'!$AP$6),\"\",'Master Data'!$F$43)))),\"\")","v":0},{"$f":"IFERROR(IF(D11=\"\",\"\",IF(AND('Master Data'!$I$28='GA55 Check & Edit'!$AP$6),\"\",IF(AND('Master Data'!$I$24='GA55 Check & Edit'!$AO$6),\"\",IF(AND(D11=\"Bonus\"),VLOOKUP(D11,ram,4,0),\"\")))),\"\")","v":""},{"$f":"IFERROR(IF(AND(D11=\"\"),\"\",IF(AND(D11=$AX$25,'Master Data'!$I$30='GA55 Check & Edit'!$AN$6),ROUND((E11+F11)*0.1,0),IF(AND(D11=$AX$29,'Master Data'!$I$30='GA55 Check & Edit'!$AN$6),ROUND((F11)*0.1,0),IF(AND(D11=$AX$26,'Master Data'!$I$30='GA55 Check & Edit'!$AN$6),ROUND((F11)*0.1,0),IF(AND(D11=$AX$27,'Master Data'!$I$30='GA55 Check & Edit'!$AN$6),ROUND((E11+F11)*0.1,0),IF(AND('Master Data'!$I$30='GA55 Check & Edit'!$AN$5),\"\",IF(AND('Master Data'!$I$30='GA55 Check & Edit'!$AN$6,'Master Data'!$I$28='GA55 Check & Edit'!$AP$6),ROUND((E11)*0.1,0),ROUND((E11+F11)*0.1,0)))))))),\"\")","v":5944},{"$f":"IF(D11=\"\",\"\",IF('Master Data'!$H$18='GA55 Check & Edit'!$AO$5,SUM(E11:N11),SUM(E11:M11)))","v":63500},{"$f":"IFERROR(IF(OR('Master Data'!$I$28='GA55 Check & Edit'!$AP$6,D11=\"\"),\"\",IF(AND(D11=$AX$24),\"\",IF(AND(D11=$AX$25),\"\",IF(AND(D11=$AX$26),\"\",IF(AND(D11=$AX$27),\"\",IF(AND(D11=$AX$28),\"\",IF(AND(D11=$AX$29),\"\",IF(AND(E11=\"\"),\"\",VLOOKUP(D11,ram,11,0))))))))),\"\")","v":7000},{"$f":"IFERROR(IF(AND(D11=\"\",E11=\"\"),\"\",IF(AND(D11=$AX$25,'Master Data'!$I$30='GA55 Check & Edit'!$AN$6),ROUND((E11+F11)*0.1,0),IF(AND(D11=$AX$29,'Master Data'!$I$30='GA55 Check & Edit'!$AN$6),ROUND((F11)*0.1,0),IF(AND(D11=$AX$26,'Master Data'!$I$30='GA55 Check & Edit'!$AN$6),ROUND((F11)*0.1,0),IF(AND(D11=$AX$27,'Master Data'!$I$30='GA55 Check & Edit'!$AN$6),ROUND((E11+F11)*0.1,0),IF(AND('Master Data'!$I$30='GA55 Check & Edit'!$AN$6,'Master Data'!$I$28='GA55 Check & Edit'!$AP$6),ROUND((E11)*0.1,0),IF(AND('Master Data'!$I$30='GA55 Check & Edit'!$AN$6,'Master Data'!$I$28='GA55 Check & Edit'!$AP$5),ROUND((E11+F11)*0.1,0),IF(AND('Master Data'!$I$30='GA55 Check & Edit'!$AN$5,'Master Data'!$I$28='GA55 Check & Edit'!$AP$5),VLOOKUP(D11,ram,12,0))))))))),\"\")","v":5944},{"$f":"IFERROR(IF(OR('Master Data'!$I$28='GA55 Check & Edit'!$AP$6,D11=\"\"),\"\",IF(AND(D11=$AX$24),\"\",IF(AND(D11=$AX$25),\"\",IF(AND(D11=$AX$26),\"\",IF(AND(D11=$AX$27),\"\",IF(AND(D11=$AX$28),\"\",IF(AND(D11=$AX$29),\"\",IF(AND(D11=$AX$32),\"\",IF(AND(E11=\"\"),\"\",'Master Data'!$I$43))))))))),\"\")","v":1880},{"$f":"IFERROR(IF(OR('Master Data'!$I$28='GA55 Check & Edit'!$AP$6),\"\",IF(D11=\"\",\"\",IF(E11=\"\",\"\",IF(AND(D11=$AX$24),\"\",IF(AND(D11=$AX$25),\"\",IF(AND(D11=$AX$26),\"\",IF(AND(D11=$AX$27),\"\",IF(AND(D11=$AX$28),\"\",IF(AND(D11=$AX$29),\"\",VLOOKUP(D11,ram,10,0)))))))))),\"\")","v":0},{"$f":"IFERROR(IF(OR('Master Data'!$I$28='GA55 Check & Edit'!$AP$6,D11=\"\"),\"\",IF(AND(D11=$AX$24),\"\",IF(AND(D11=$AX$25),\"\",IF(AND(D11=$AX$26),\"\",IF(AND(D11=$AX$27),\"\",IF(AND(D11=$AX$28),\"\",IF(AND(D11=$AX$29),\"\",IF(AND(E11=\"\"),\"\",'Master Data'!$K$43)))))))),\"\")","v":0},{"$f":"IFERROR(IF(OR('Master Data'!$I$28='GA55 Check & Edit'!$AP$6,D11=\"\"),\"\",IF(AND(D11=$AX$24),\"\",IF(AND(D11=$AX$25),\"\",IF(AND(D11=$AX$26),\"\",IF(AND(D11=$AX$27),\"\",IF(AND(D11=$AX$28),\"\",IF(AND(D11=$AX$29),\"\",IF(AND(E11=\"\"),\"\",'Master Data'!$L$43)))))))),\"\")","v":0},{"$f":"IFERROR(IF(OR('Master Data'!$I$28='GA55 Check & Edit'!$AP$6,D11=\"\"),\"\",IF(AND(D11=$AX$24,'Master Data'!$I$28='GA55 Check & Edit'!$AP$5,'Master Data'!$I$30='GA55 Check & Edit'!$AN$6),ROUND(M11*50%,0),IF(AND(D11=$AX$25),\"\",IF(AND(D11=$AX$26,'Master Data'!$I$28='GA55 Check & Edit'!$AP$5,'Master Data'!$I$30='GA55 Check & Edit'!$AN$6),SUM(F11-N11),IF(AND(D11=$AX$27),\"\",IF(AND(D11=$AX$28),\"\",IF(AND(D11=$AX$29,'Master Data'!$I$28='GA55 Check & Edit'!$AP$5,'Master Data'!$I$30='GA55 Check & Edit'!$AN$6),SUM(F11-N11),IF(AND(E11=\"\"),\"\",'Master Data'!$M$43)))))))),\"\")","v":0},{"$f":"IFERROR(IF(OR('Master Data'!$I$28='GA55 Check & Edit'!$AP$6,D11=\"\"),\"\",IF(AND(D11=$AX$24),\"\",IF(AND(D11=$AX$25),\"\",IF(AND(D11=$AX$26),\"\",IF(AND(D11=$AX$27),\"\",IF(AND(D11=$AX$28),\"\",IF(AND(D11=$AX$29),\"\",IF(AND(E11=\"\"),\"\",'Master Data'!$O$43)))))))),\"\")","v":0},{"$f":"IFERROR(IF(OR('Master Data'!$I$28='GA55 Check & Edit'!$AP$6,D11=\"\"),\"\",IF(AND(E11=\"\"),\"\",IF(AND('GA55 Check & Edit'!D11='GA55 Check & Edit'!$AT$17,'Master Data'!$D$18=\"Gazetted\"),500,IF(AND('GA55 Check & Edit'!D11='GA55 Check & Edit'!$AT$17,'Master Data'!$D$18=\"Non-Gazetted\"),250,\"\")))),\"\")","v":""},{"$f":"IFERROR(IF(D11=\"\",\"\",IF(AND(E11=\"\"),\"\",IF(AND(D11=$AX$24),\"\",IF(AND(D11=$AX$25),\"\",IF(AND(D11=$AX$26),\"\",IF(AND(D11=$AX$27),\"\",IF(AND(D11=$AX$28),\"\",IF(AND(D11=$AX$29),\"\",IF(OR('Master Data'!$I$28='GA55 Check & Edit'!$AP$6,D11=\"\"),\"\",$Y$7))))))))),\"\")","v":0},{"$f":"IFERROR(IF(OR('Master Data'!$I$28='GA55 Check & Edit'!$AP$6),\"\",IF(D11=\"\",\"\",IF(E11=\"\",\"\",VLOOKUP(D11,ram,9,0)))),\"\")","v":1500},{"$f":"IFERROR(IF(OR('Master Data'!$I$28='GA55 Check & Edit'!$AP$6,D11=\"\",'Master Data'!$N$38=\"\"),\"\",IF(AND(E11=\"\"),\"\",IF('GA55 Check & Edit'!D11='GA55 Check & Edit'!$AT$9,'Master Data'!$N$38,\"\"))),\"\")","v":""},{"$f":"IFERROR(IF(D11=\"\",\"\",IF(AND(O11=\"\"),\"\",IF(AND(N11=\"\"),SUM(P11:AA11),IF(AND('Master Data'!$H$18='GA55 Check & Edit'!$AO$5,'Master Data'!$I$30='GA55 Check & Edit'!$AN$6),SUM(P11:AA11)+N11,SUM(P11:AA11))))),\"0\")","v":16324},47176,null,null,null,null,null,null,null,null,null,null,null,null,null,null,"Jodhpur","APR","2021-06-01","L-4",null,"FEB","2021-02-01",null,null,{"$f":"IF(AND('Master Data'!$E$36=\"\"),\"\",'Master Data'!$E$36)","v":50800},{"$f":"IF(AND(AX11<$AZ$16),\"\",IF(AND(AX11>$AZ$17),\"\",BA11))","v":""},{"$f":"IF(AND('Master Data'!$E$36=\"\"),\"\",ROUND(17%*BA11,0))","v":8636},{"$f":"IF(BB11=\"\",\"\",BC11)","v":""},null,null,{"$f":"IF(AND('Master Data'!$I$28='GA55 Check & Edit'!$AP$6),\"\",IF(AND('Master Data'!$I$30='GA55 Check & Edit'!$AN$6,'Master Data'!$N$36='GA55 Check & Edit'!$AO$6),\"\",IF(AND('Master Data'!$I$30='GA55 Check & Edit'!$AN$5),IF($AZ$15<18001,265,IF($AZ$15<33501,440,IF($AZ$15<54001,658,875))))))","v":""},{"$f":"IFERROR(IF(OR('Master Data'!$I$28='GA55 Check & Edit'!$AP$6),\"\",'Master Data'!$G$43),\"\")","v":7000},{"$f":"IFERROR(IF(AND('Master Data'!$I$30='GA55 Check & Edit'!$AN$6),ROUND((E9)*0.1,0),IF(AND('Master Data'!$I$28='GA55 Check & Edit'!$AP$6),ROUND((E9+F9)*0.1,0),'Master Data'!$H$43)),\"\")","v":5080},{"$f":"BA11","v":50800}]
[1,{"$f":"IF(LEN(D12)>=3,B11+1,0)","v":5},{"$f":"IF(B12=0,\"\",B12)","v":5},"2021-07-01",{"$f":"IFERROR(IF(D12=\"\",\"\",IF(AND(BQ16=\"\"),\"\",IF(AND('Master Data'!$I$28='GA55 Check & Edit'!$AP$6),VLOOKUP(D12,ram,13,0),VLOOKUP(D12,ram,4,0)))),\"\")","v":52300},{"$f":"IFERROR(IF(D12=\"\",\"\",IF(D12=$AX$24,\"\",IF(AND(D12=$AX$25),$BC$25,IF(AND(D12=$AX$27),\"\",IF(AND(D12=$AX$28),\"\",IF(AND('Master Data'!$I$28='GA55 Check & Edit'!$AP$5),VLOOKUP(D12,ram,7,0),\"\")))))),\"\")","v":14644},{"$f":"IFERROR(IF(D12=\"\",\"\",IF(D12=$AX$24,\"\",IF(AND(D12=$AX$25),\"\",IF(AND(D12=$AX$26),\"\",IF(AND(D12=$AX$27),\"\",IF(AND(D12=$AX$29),\"\",IF(AND('Master Data'!$I$28='GA55 Check & Edit'!$AP$6),\"\",VLOOKUP(D12,ram,8,0)))))))),\"\")","v":4184},{"$f":"IFERROR(IF(D12=\"\",\"\",IF(AND(E12=\"\"),\"\",IF(OR(D12=$AX$24,D12=$AX$25,D12=$AX$26,D12=$AX$27,D12=$AX$28,D12=$AX$29),\"\",IF(AND('Master Data'!$I$28='GA55 Check & Edit'!$AP$5),'Master Data'!$B$43,\"\")))),\"\")","v":0},{"$f":"IFERROR(IF(D12=\"\",\"\",IF(AND(E12=\"\"),\"\",IF(OR(D12=$AX$24,D12=$AX$25,D12=$AX$26,D12=$AX$27,D12=$AX$28,D12=$AX$29),\"\",IF(AND('Master Data'!$I$28='GA55 Check & Edit'!$AP$5,'Master Data'!$E$28='GA55 Check & Edit'!$AO$5),'Master Data'!$C$43,\"0\")))),\"\")","v":"0"},{"$f":"IFERROR(IF(OR('Master Data'!$E$32=$AO$6,'Master Data'!$E$32=\"\"),\"\",IF(D12=\"\",\"\",IF(AND(E12=\"\"),\"\",IF(OR(D12=$AX$24,D12=$AX$25,D12=$AX$26,D12=$AX$27,D12=$AX$28,D12=$AX$29),\"\",IF(AND('Master Data'!$I$28='GA55 Check & Edit'!$AP$6),\"\",IF(AND('Master Data'!$I$32=$AR$9),$AS$6,IF(AND('Master Data'!$I$32=$AR$10),$AS$6,IF(AND('Master Data'!$I$32=$AR$11),$AS$6,IF(AND('Master Data'!$I$32=$AR$12),$AS$6,$AS$5))))))))),\"\")","v":""},{"$f":"IFERROR(IF(D12=\"\",\"\",IF(AND(E12=\"\"),\"\",IF(OR(D12=$AX$24,D12=$AX$25,D12=$AX$26,D12=$AX$27,D12=$AX$28,D12=$AX$29),\"\",IF(AND('Master Data'!$I$28='GA55 Check & Edit'!$AP$5),'Master Data'!$E$43,\"\")))),\"\")","v":0},{"$f":"IFERROR(IF(D12=\"\",\"\",IF(AND(E12=\"\"),\"\",IF(OR(D12=$AX$24,D12=$AX$25,D12=$AX$26,D12=$AX$27,D12=$AX$28,D12=$AX$29),\"\",IF(AND('Master Data'!$I$28='GA55 Check & Edit'!$AP$6),\"\",'Master Data'!$F$43)))),\"\")","v":0},{"$f":"IFERROR(IF(D12=\"\",\"\",IF(AND('Master Data'!$I$28='GA55 Check & Edit'!$AP$6),\"\",IF(AND('Master Data'!$I$24='GA55 Check & Edit'!$AO$6),\"\",IF(AND(D12=\"Bonus\"),VLOOKUP(D12,ram,4,0),\"\")))),\"\")","v":""},{"$f":"IFERROR(IF(AND(D12=\"\"),\"\",IF(AND(D12=$AX$25,'Master Data'!$I$30='GA55 Check & Edit'!$AN$6),ROUND((E12+F12)*0.1,0),IF(AND(D12=$AX$29,'Master Data'!$I$30='GA55 Check & Edit'!$AN$6),ROUND((F12)*0.1,0),IF(AND(D12=$AX$26,'Master Data'!$I$30='GA55 Check & Edit'!$AN$6),ROUND((F12)*0.1,0),IF(AND(D12=$AX$27,'Master Data'!$I$30='GA55 Check & Edit'!$AN$6),ROUND((E12+F12)*0.1,0),IF(AND('Master Data'!$I$30='GA55 Check & Edit'!$AN$5),\"\",IF(AND('Master Data'!$I$30='GA55 Check & Edit'!$AN$6,'Master Data'!$I$28='GA55 Check & Edit'!$AP$6),ROUND((E12)*0.1,0),ROUND((E12+F12)*0.1,0)))))))),\"\")","v":6694},{"$f":"IF(D12=\"\",\"\",IF('Master Data'!$H$18='GA55 Check & Edit'!$AO$5,SUM(E12:N12),SUM(E12:M12)))","v":71128},{"$f":"IFERROR(IF(OR('Master Data'!$I$28='GA55 Check & Edit'!$AP$6,D12=\"\"),\"\",IF(AND(D12=$AX$24),\"\",IF(AND(D12=$AX$25),\"\",IF(AND(D12=$AX$26),\"\",IF(AND(D12=$AX$27),\"\",IF(AND(D12=$AX$28),\"\",IF(AND(D12=$AX$29),\"\",IF(AND(E12=\"\"),\"\",VLOOKUP(D12,ram,11,0))))))))),\"\")","v":7000},{"$f":"IFERROR(IF(AND(D12=\"\",E12=\"\"),\"\",IF(AND(D12=$AX$25,'Master Data'!$I$30='GA55 Check & Edit'!$AN$6),ROUND((E12+F12)*0.1,0),IF(AND(D12=$AX$29,'Master Data'!$I$30='GA55 Check & Edit'!$AN$6),ROUND((F12)*0.1,0),IF(AND(D12=$AX$26,'Master Data'!$I$30='GA55 Check & Edit'!$AN$6),ROUND((F12)*0.1,0),IF(AND(D12=$AX$27,'Master Data'!$I$30='GA55 Check & Edit'!$AN$6),ROUND((E12+F12)*0.1,0),IF(AND('Master Data'!$I$30='GA55 Check & Edit'!$AN$6,'Master Data'!$I$28='GA55 Check & Edit'!$AP$6),ROUND((E12)*0.1,0),IF(AND('Master Data'!$I$30='GA55 Check & Edit'!$AN$6,'Master Data'!$I$28='GA55 Check & Edit'!$AP$5),ROUND((E12+F12)*0.1,0),IF(AND('Master Data'!$I$30='GA55 Check & Edit'!$AN$5,'Master Data'!$I$28='GA55 Check & Edit'!$AP$5),VLOOKUP(D12,ram,12,0))))))))),\"\")","v":6694},{"$f":"IFERROR(IF(OR('Master Data'!$I$28='GA55 Check & Edit'!$AP$6,D12=\"\"),\"\",IF(AND(D12=$AX$24),\"\",IF(AND(D12=$AX$25),\"\",IF(AND(D12=$AX$26),\"\",IF(AND(D12=$AX$27),\"\",IF(AND(D12=$AX$28),\"\",IF(AND(D12=$AX$29),\"\",IF(AND(D12=$AX$32),\"\",IF(AND(E12=\"\"),\"\",'Master Data'!$I$43))))))))),\"\")","v":1880},{"$f":"IFERROR(IF(OR('Master Data'!$I$28='GA55 Check & Edit'!$AP$6),\"\",IF(D12=\"\",\"\",IF(E12=\"\",\"\",IF(AND(D12=$AX$24),\"\",IF(AND(D12=$AX$25),\"\",IF(AND(D12=$AX$26),\"\",IF(AND(D12=$AX$27),\"\",IF(AND(D12=$AX$28),\"\",IF(AND(D12=$AX$29),\"\",VLOOKUP(D12,ram,10,0)))))))))),\"\")","v":0},{"$f":"IFERROR(IF(OR('Master Data'!$I$28='GA55 Check & Edit'!$AP$6,D12=\"\"),\"\",IF(AND(D12=$AX$24),\"\",IF(AND(D12=$AX$25),\"\",IF(AND(D12=$AX$26),\"\",IF(AND(D12=$AX$27),\"\",IF(AND(D12=$AX$28),\"\",IF(AND(D12=$AX$29),\"\",IF(AND(E12=\"\"),\"\",'Master Data'!$K$43)))))))),\"\")","v":0},{"$f":"IFERROR(IF(OR('Master Data'!$I$28='GA55 Check & Edit'!$AP$6,D12=\"\"),\"\",IF(AND(D12=$AX$24),\"\",IF(AND(D12=$AX$25),\"\",IF(AND(D12=$AX$26),\"\",IF(AND(D12=$AX$27),\"\",IF(AND(D12=$AX$28),\"\",IF(AND(D12=$AX$29),\"\",IF(AND(E12=\"\"),\"\",'Master Data'!$L$43)))))))),\"\")","v":0},{"$f":"IFERROR(IF(OR('Master Data'!$I$28='GA55 Check & Edit'!$AP$6,D12=\"\"),\"\",IF(AND(D12=$AX$24,'Master Data'!$I$28='GA55 Check & Edit'!$AP$5,'Master Data'!$I$30='GA55 Check & Edit'!$AN$6),ROUND(M12*50%,0),IF(AND(D12=$AX$25),\"\",IF(AND(D12=$AX$26,'Master Data'!$I$28='GA55 Check & Edit'!$AP$5,'Master Data'!$I$30='GA55 Check & Edit'!$AN$6),SUM(F12-N12),IF(AND(D12=$AX$27),\"\",IF(AND(D12=$AX$28),\"\",IF(AND(D12=$AX$29,'Master Data'!$I$28='GA55 Check & Edit'!$AP$5,'Master Data'!$I$30='GA55 Check & Edit'!$AN$6),SUM(F12-N12),IF(AND(E12=\"\"),\"\",'Master Data'!$M$43)))))))),\"\")","v":0},{"$f":"IFERROR(IF(OR('Master Data'!$I$28='GA55 Check & Edit'!$AP$6,D12=\"\"),\"\",IF(AND(D12=$AX$24),\"\",IF(AND(D12=$AX$25),\"\",IF(AND(D12=$AX$26),\"\",IF(AND(D12=$AX$27),\"\",IF(AND(D12=$AX$28),\"\",IF(AND(D12=$AX$29),\"\",IF(AND(E12=\"\"),\"\",'Master Data'!$O$43)))))))),\"\")","v":0},{"$f":"IFERROR(IF(OR('Master Data'!$I$28='GA55 Check & Edit'!$AP$6,D12=\"\"),\"\",IF(AND(E12=\"\"),\"\",IF(AND('GA55 Check & Edit'!D12='GA55 Check & Edit'!$AT$17,'Master Data'!$D$18=\"Gazetted\"),500,IF(AND('GA55 Check & Edit'!D12='GA55 Check & Edit'!$AT$17,'Master Data'!$D$18=\"Non-Gazetted\"),250,\"\")))),\"\")","v":""},{"$f":"IFERROR(IF(D12=\"\",\"\",IF(AND(E12=\"\"),\"\",IF(AND(D12=$AX$24),\"\",IF(AND(D12=$AX$25),\"\",IF(AND(D12=$AX$26),\"\",IF(AND(D12=$AX$27),\"\",IF(AND(D12=$AX$28),\"\",IF(AND(D12=$AX$29),\"\",IF(OR('Master Data'!$I$28='GA55 Check & Edit'!$AP$6,D12=\"\"),\"\",$Y$7))))))))),\"\")","v":0},{"$f":"IFERROR(IF(OR('Master Data'!$I$28='GA55 Check & Edit'!$AP$6),\"\",IF(D12=\"\",\"\",IF(E12=\"\",\"\",VLOOKUP(D12,ram,9,0)))),\"\")","v":1500},{"$f":"IFERROR(IF(OR('Master Data'!$I$28='GA55 Check & Edit'!$AP$6,D12=\"\",'Master Data'!$N$38=\"\"),\"\",IF(AND(E12=\"\"),\"\",IF('GA55 Check & Edit'!D12='GA55 Check & Edit'!$AT$9,'Master Data'!$N$38,\"\"))),\"\")","v":""},{"$f":"IFERROR(IF(D12=\"\",\"\",IF(AND(O12=\"\"),\"\",IF(AND(N12=\"\"),SUM(P12:AA12),IF(AND('Master Data'!$H$18='GA55 Check & Edit'!$AO$5,'Master Data'!$I$30='GA55 Check & Edit'!$AN$6),SUM(P12:AA12)+N12,SUM(P12:AA12))))),\"0\")","v":17074},54054,null,null,null,null,null,null,null,null,null,null,null,null,null,null,"Kota","MAY","2021-07-01","L-5",null,"MAR","2021-03-01",3,null,{"$f":"IF(AND('Master Data'!$E$36=\"\"),\"\",IF(AND('Master Data'!$I$28='GA55 Check & Edit'!$AP$6),'GA55 Check & Edit'!$AZ$15,BU12))","v":50800},{"$f":"IF(AND(AX12<$AZ$16),\"\",IF(AND(AX12>$AZ$17),\"\",BA12))","v":50800},{"$f":"IF(AND('Master Data'!$E$36=\"\"),\"\",ROUND(17%*BA12,0))","v":8636},{"$f":"IF(BB12=\"\",\"\",BC12)","v":8636},{"$f":"IFERROR(IF(AND('Master Data'!$E$36=\"\"),\"\",ROUND('Master Data'!$E$30%*BB12,0)),\"\")","v":4064},{"$f":"'Master Data'!B47","v":0},{"$f":"IF(AND('Master Data'!$I$28='GA55 Check & Edit'!$AP$6),\"\",IF(AND('Master Data'!$I$30='GA55 Check & Edit'!$AN$6,'Master Data'!$N$36='GA55 Check & Edit'!$AO$6),0,IF(AND('Master Data'!$I$30='GA55 Check & Edit'!$AN$6,'Master Data'!$N$36='GA55 Check & Edit'!$AO$5),'Master Data'!$J$43,IF(AND('Master Data'!$I$30='GA55 Check & Edit'!$AN$5),IF($AZ$15<18001,265,IF($AZ$15<33501,440,IF($AZ$15<54001,658,875)))))))","v":0},{"$f":"IFERROR(IF(OR('Master Data'!$I$28='GA55 Check & Edit'!$AP$6),\"\",'Master Data'!$G$43),\"\")","v":7000},{"$f":"IFERROR(IF(AND('Master Data'!$I$30='GA55 Check & Edit'!$AN$6),ROUND((E8)*0.1,0),IF(AND('Master Data'!$I$28='GA55 Check & Edit'!$AP$6),ROUND((E8+F8)*0.1,0),'Master Data'!$H$43)),\"\")","v":5080},{"$f":"BA12","v":50800},"2021-03-01",{"$f":"IFERROR(IF('Master Data'!$E$36=\"\",\"\",IF('Master Data'!$F$40=\"\",\"\",IF(AND($AZ$17>$AZ$9),\"\",DATE(YEAR(AZ16),MONTH(AZ16),DAY(AZ16))))),\"\")","v":"2021-03-01"},{"$f":"IFERROR(IF('Master Data'!$E$36=\"\",\"\",IF('Master Data'!$F$40=\"\",\"\",IF(AND($AZ$17>$AZ$9),\"\",DATE(YEAR(AZ16),MONTH(AZ16),DAY(AZ16))))),\"\")","v":"2021-03-01"},{"$f":"IF(AND(BM12=\"\"),\"\",IF(AND(BM12=$BK$12),$BK$12,IF(AND(BM12=$BK$13),$BK$13,IF(AND(BM12=$BK$14),$BK$14,IF(AND(BM12=$BK$15),$BK$15,IF(AND(BM12=$BK$16),$BK$16,IF(AND(BM12=$BK$17),$BK$17,IF(AND(BM12=$BK$18),$BK$18,IF(AND(BM12=$BK$19),$BK$19,IF(AND(BM12=$BK$20),$BK$20,IF(AND(BM12=$BK$21),$BK$21,IF(AND(BM12=$BK$22),$BK$22,IF(AND(BM12=$BK$23),$BK$23,IF(AND(BM12=$BK$24),$BM$24,IF(AND(BM12=$BK$25),$BM$25,IF(AND(BM12=$BK$26),$BM$26,IF(AND(BM12=$BK$27),$BM$27,IF(AND(BM12=$BK$28),$BM$28,IF(AND(BM12=$BK$29),$BM$29,IF(AND(BM12=$BK$30),$BM$30,IF(AND(BM12=$BK$31),$BM$31,IF(AND(BM12=$BK$32),$BM$32,\"\"))))))))))))))))))))))","v":"2021-03-01"},{"$f":"IFERROR(IF(BM12=\"\",\"\",IF(AND(BL12=$BK$24),$BM$24,IF(AND(BL12=$BK$25),$BM$25,IF(AND(BL12=$BK$26),$BM$26,IF(AND(BL12=$BK$27),$BM$27,IF(AND(BL12=$BK$28),$BM$28,IF(AND(BL12=$BK$29),$BM$29,IF(AND(BL12=$BK$30),$BM$30,IF(AND(BL12=$BK$31),$BM$31,IF(AND(BL12=$BK$32),$BM$32,BN12)))))))))),\"\")","v":"2021-03-01"},null,{"$f":"IFERROR(IF(BM12=\"\",\"\",IF(D8=$AX$25,$AX$25,IF(D8=$AX$30,$AX$30,IF(D8=$AX$31,$AX$31,IF(D8=$AX$32,$AX$32,IF(BM12>$AZ$17,\"\",BM12)))))),\"\")","v":"2021-03-01"},null,{"$f":"OFFSET(D6,MATCH(BO12,$D$8:$D$27,0)+1,MATCH(BO12,D8:N8,0))","v":50800},null,{"$f":"IF(AND('Master Data'!$E$36=\"\"),\"\",IF(AND('Master Data'!$I$38='GA55 Check & Edit'!AX13),'Master Data'!$I$36,'Master Data'!$E$36))","v":50800},null,null,{"$f":"IF(BB12=\"\",0,BF12)","v":0}]
[0,{"$f":"IF(LEN(D13)>=3,B12+1,0)","v":6},{"$f":"IF(B13=0,\"\",B13)","v":6},"2021-08-01",{"$f":"IFERROR(IF(D13=\"\",\"\",IF(AND(BQ17=\"\"),\"\",IF(AND('Master Data'!$I$28='GA55 Check & Edit'!$AP$6),VLOOKUP(D13,ram,13,0),VLOOKUP(D13,ram,4,0)))),\"\")","v":52300},{"$f":"IFERROR(IF(D13=\"\",\"\",IF(D13=$AX$24,\"\",IF(AND(D13=$AX$25),$BC$25,IF(AND(D13=$AX$27),\"\",IF(AND(D13=$AX$28),\"\",IF(AND('Master Data'!$I$28='GA55 Check & Edit'!$AP$5),VLOOKUP(D13,ram,7,0),\"\")))))),\"\")","v":14644},{"$f":"IFERROR(IF(D13=\"\",\"\",IF(D13=$AX$24,\"\",IF(AND(D13=$AX$25),\"\",IF(AND(D13=$AX$26),\"\",IF(AND(D13=$AX$27),\"\",IF(AND(D13=$AX$29),\"\",IF(AND('Master Data'!$I$28='GA55 Check & Edit'!$AP$6),\"\",VLOOKUP(D13,ram,8,0)))))))),\"\")","v":4707},{"$f":"IFERROR(IF(D13=\"\",\"\",IF(AND(E13=\"\"),\"\",IF(OR(D13=$AX$24,D13=$AX$25,D13=$AX$26,D13=$AX$27,D13=$AX$28,D13=$AX$29),\"\",IF(AND('Master Data'!$I$28='GA55 Check & Edit'!$AP$5),'Master Data'!$B$43,\"\")))),\"\")","v":0},{"$f":"IFERROR(IF(D13=\"\",\"\",IF(AND(E13=\"\"),\"\",IF(OR(D13=$AX$24,D13=$AX$25,D13=$AX$26,D13=$AX$27,D13=$AX$28,D13=$AX$29),\"\",IF(AND('Master Data'!$I$28='GA55 Check & Edit'!$AP$5,'Master Data'!$E$28='GA55 Check & Edit'!$AO$5),'Master Data'!$C$43,\"0\")))),\"\")","v":"0"},{"$f":"IFERROR(IF(OR('Master Data'!$E$32=$AO$6,'Master Data'!$E$32=\"\"),\"\",IF(D13=\"\",\"\",IF(AND(E13=\"\"),\"\",IF(OR(D13=$AX$24,D13=$AX$25,D13=$AX$26,D13=$AX$27,D13=$AX$28,D13=$AX$29),\"\",IF(AND('Master Data'!$I$28='GA55 Check & Edit'!$AP$6),\"\",IF(AND('Master Data'!$I$32=$AR$9),$AS$6,IF(AND('Master Data'!$I$32=$AR$10),$AS$6,IF(AND('Master Data'!$I$32=$AR$11),$AS$6,IF(AND('Master Data'!$I$32=$AR$12),$AS$6,$AS$5))))))))),\"\")","v":""},{"$f":"IFERROR(IF(D13=\"\",\"\",IF(AND(E13=\"\"),\"\",IF(OR(D13=$AX$24,D13=$AX$25,D13=$AX$26,D13=$AX$27,D13=$AX$28,D13=$AX$29),\"\",IF(AND('Master Data'!$I$28='GA55 Check & Edit'!$AP$5),'Master Data'!$E$43,\"\")))),\"\")","v":0},{"$f":"IFERROR(IF(D13=\"\",\"\",IF(AND(E13=\"\"),\"\",IF(OR(D13=$AX$24,D13=$AX$25,D13=$AX$26,D13=$AX$27,D13=$AX$28,D13=$AX$29),\"\",IF(AND('Master Data'!$I$28='GA55 Check & Edit'!$AP$6),\"\",'Master Data'!$F$43)))),\"\")","v":0},{"$f":"IFERROR(IF(D13=\"\",\"\",IF(AND('Master Data'!$I$28='GA55 Check & Edit'!$AP$6),\"\",IF(AND('Master Data'!$I$24='GA55 Check & Edit'!$AO$6),\"\",IF(AND(D13=\"Bonus\"),VLOOKUP(D13,ram,4,0),\"\")))),\"\")","v":""},{"$f":"IFERROR(IF(AND(D13=\"\"),\"\",IF(AND(D13=$AX$25,'Master Data'!$I$30='GA55 Check & Edit'!$AN$6),ROUND((E13+F13)*0.1,0),IF(AND(D13=$AX$29,'Master Data'!$I$30='GA55 Check & Edit'!$AN$6),ROUND((F13)*0.1,0),IF(AND(D13=$AX$26,'Master Data'!$I$30='GA55 Check & Edit'!$AN$6),ROUND((F13)*0.1,0),IF(AND(D13=$AX$27,'Master Data'!$I$30='GA55 Check & Edit'!$AN$6),ROUND((E13+F13)*0.1,0),IF(AND('Master Data'!$I$30='GA55 Check & Edit'!$AN$5),\"\",IF(AND('Master Data'!$I$30='GA55 Check & Edit'!$AN$6,'Master Data'!$I$28='GA55 Check & Edit'!$AP$6),ROUND((E13)*0.1,0),ROUND((E13+F13)*0.1,0)))))))),\"\")","v":6694},{"$f":"IF(D13=\"\",\"\",IF('Master Data'!$H$18='GA55 Check & Edit'!$AO$5,SUM(E13:N13),SUM(E13:M13)))","v":71651},{"$f":"IFERROR(IF(OR('Master Data'!$I$28='GA55 Check & Edit'!$AP$6,D13=\"\"),\"\",IF(AND(D13=$AX$24),\"\",IF(AND(D13=$AX$25),\"\",IF(AND(D13=$AX$26),\"\",IF(AND(D13=$AX$27),\"\",IF(AND(D13=$AX$28),\"\",IF(AND(D13=$AX$29),\"\",IF(AND(E13=\"\"),\"\",VLOOKUP(D13,ram,11,0))))))))),\"\")","v":7000},{"$f":"IFERROR(IF(AND(D13=\"\",E13=\"\"),\"\",IF(AND(D13=$AX$25,'Master Data'!$I$30='GA55 Check & Edit'!$AN$6),ROUND((E13+F13)*0.1,0),IF(AND(D13=$AX$29,'Master Data'!$I$30='GA55 Check & Edit'!$AN$6),ROUND((F13)*0.1,0),IF(AND(D13=$AX$26,'Master Data'!$I$30='GA55 Check & Edit'!$AN$6),ROUND((F13)*0.1,0),IF(AND(D13=$AX$27,'Master Data'!$I$30='GA55 Check & Edit'!$AN$6),ROUND((E13+F13)*0.1,0),IF(AND('Master Data'!$I$30='GA55 Check & Edit'!$AN$6,'Master Data'!$I$28='GA55 Check & Edit'!$AP$6),ROUND((E13)*0.1,0),IF(AND('Master Data'!$I$30='GA55 Check & Edit'!$AN$6,'Master Data'!$I$28='GA55 Check & Edit'!$AP$5),ROUND((E13+F13)*0.1,0),IF(AND('Master Data'!$I$30='GA55 Check & Edit'!$AN$5,'Master Data'!$I$28='GA55 Check & Edit'!$AP$5),VLOOKUP(D13,ram,12,0))))))))),\"\")","v":6694},{"$f":"IFERROR(IF(OR('Master Data'!$I$28='GA55 Check & Edit'!$AP$6,D13=\"\"),\"\",IF(AND(D13=$AX$24),\"\",IF(AND(D13=$AX$25),\"\",IF(AND(D13=$AX$26),\"\",IF(AND(D13=$AX$27),\"\",IF(AND(D13=$AX$28),\"\",IF(AND(D13=$AX$29),\"\",IF(AND(D13=$AX$32),\"\",IF(AND(E13=\"\"),\"\",'Master Data'!$I$43))))))))),\"\")","v":1880},{"$f":"IFERROR(IF(OR('Master Data'!$I$28='GA55 Check & Edit'!$AP$6),\"\",IF(D13=\"\",\"\",IF(E13=\"\",\"\",IF(AND(D13=$AX$24),\"\",IF(AND(D13=$AX$25),\"\",IF(AND(D13=$AX$26),\"\",IF(AND(D13=$AX$27),\"\",IF(AND(D13=$AX$28),\"\",IF(AND(D13=$AX$29),\"\",VLOOKUP(D13,ram,10,0)))))))))),\"\")","v":0},{"$f":"IFERROR(IF(OR('Master Data'!$I$28='GA55 Check & Edit'!$AP$6,D13=\"\"),\"\",IF(AND(D13=$AX$24),\"\",IF(AND(D13=$AX$25),\"\",IF(AND(D13=$AX$26),\"\",IF(AND(D13=$AX$27),\"\",IF(AND(D13=$AX$28),\"\",IF(AND(D13=$AX$29),\"\",IF(AND(E13=\"\"),\"\",'Master Data'!$K$43)))))))),\"\")","v":0},{"$f":"IFERROR(IF(OR('Master Data'!$I$28='GA55 Check & Edit'!$AP$6,D13=\"\"),\"\",IF(AND(D13=$AX$24),\"\",IF(AND(D13=$AX$25),\"\",IF(AND(D13=$AX$26),\"\",IF(AND(D13=$AX$27),\"\",IF(AND(D13=$AX$28),\"\",IF(AND(D13=$AX$29),\"\",IF(AND(E13=\"\"),\"\",'Master Data'!$L$43)))))))),\"\")","v":0},{"$f":"IFERROR(IF(OR('Master Data'!$I$28='GA55 Check & Edit'!$AP$6,D13=\"\"),\"\",IF(AND(D13=$AX$24,'Master Data'!$I$28='GA55 Check & Edit'!$AP$5,'Master Data'!$I$30='GA55 Check & Edit'!$AN$6),ROUND(M13*50%,0),IF(AND(D13=$AX$25),\"\",IF(AND(D13=$AX$26,'Master Data'!$I$28='GA55 Check & Edit'!$AP$5,'Master Data'!$I$30='GA55 Check & Edit'!$AN$6),SUM(F13-N13),IF(AND(D13=$AX$27),\"\",IF(AND(D13=$AX$28),\"\",IF(AND(D13=$AX$29,'Master Data'!$I$28='GA55 Check & Edit'!$AP$5,'Master Data'!$I$30='GA55 Check & Edit'!$AN$6),SUM(F13-N13),IF(AND(E13=\"\"),\"\",'Master Data'!$M$43)))))))),\"\")","v":0},{"$f":"IFERROR(IF(OR('Master Data'!$I$28='GA55 Check & Edit'!$AP$6,D13=\"\"),\"\",IF(AND(D13=$AX$24),\"\",IF(AND(D13=$AX$25),\"\",IF(AND(D13=$AX$26),\"\",IF(AND(D13=$AX$27),\"\",IF(AND(D13=$AX$28),\"\",IF(AND(D13=$AX$29),\"\",IF(AND(E13=\"\"),\"\",'Master Data'!$O$43)))))))),\"\")","v":0},{"$f":"IFERROR(IF(OR('Master Data'!$I$28='GA55 Check & Edit'!$AP$6,D13=\"\"),\"\",IF(AND(E13=\"\"),\"\",IF(AND('GA55 Check & Edit'!D13='GA55 Check & Edit'!$AT$17,'Master Data'!$D$18=\"Gazetted\"),500,IF(AND('GA55 Check & Edit'!D13='GA55 Check & Edit'!$AT$17,'Master Data'!$D$18=\"Non-Gazetted\"),250,\"\")))),\"\")","v":""},{"$f":"IFERROR(IF(D13=\"\",\"\",IF(AND(E13=\"\"),\"\",IF(AND(D13=$AX$24),\"\",IF(AND(D13=$AX$25),\"\",IF(AND(D13=$AX$26),\"\",IF(AND(D13=$AX$27),\"\",IF(AND(D13=$AX$28),\"\",IF(AND(D13=$AX$29),\"\",IF(OR('Master Data'!$I$28='GA55 Check & Edit'!$AP$6,D13=\"\"),\"\",$Y$7))))))))),\"\")","v":0},{"$f":"IFERROR(IF(OR('Master Data'!$I$28='GA55 Check & Edit'!$AP$6),\"\",IF(D13=\"\",\"\",IF(E13=\"\",\"\",VLOOKUP(D13,ram,9,0)))),\"\")","v":1500},{"$f":"IFERROR(IF(OR('Master Data'!$I$28='GA55 Check & Edit'!$AP$6,D13=\"\",'Master Data'!$N$38=\"\"),\"\",IF(AND(E13=\"\"),\"\",IF('GA55 Check & Edit'!D13='GA55 Check & Edit'!$AT$9,'Master Data'!$N$38,\"\"))),\"\")","v":""},{"$f":"IFERROR(IF(D13=\"\",\"\",IF(AND(O13=\"\"),\"\",IF(AND(N13=\"\"),SUM(P13:AA13),IF(AND('Master Data'!$H$18='GA55 Check & Edit'!$AO$5,'Master Data'!$I$30='GA55 Check & Edit'!$AN$6),SUM(P13:AA13)+N13,SUM(P13:AA13))))),\"0\")","v":17074},54577,null,null,null,null,null,null,null,null,null,null,null,null,null,null,null,"JUN","2021-08-01","L-6",null,"APR","2021-04-01",4,null,{"$f":"IF(AND('Master Data'!$E$36=\"\"),\"\",IF(AND('Master Data'!$I$28='GA55 Check & Edit'!$AP$6),'GA55 Check & Edit'!$AZ$15,BU13))","v":50800},{"$f":"IF(AND(AX13<$AZ$16),\"\",IF(AND(AX13>$AZ$17),\"\",BA13))","v":50800},{"$f":"IF(AND('Master Data'!$E$36=\"\"),\"\",ROUND(17%*BA13,0))","v":8636},{"$f":"IF(BB13=\"\",\"\",BC13)","v":8636},{"$f":"IFERROR(IF(AND('Master Data'!$E$36=\"\"),\"\",ROUND('Master Data'!$E$30%*BB13,0)),\"\")","v":4064},{"$f":"'Master Data'!C47","v":1500},{"$f":"IF(AND('Master Data'!$I$28='GA55 Check & Edit'!$AP$6),\"\",IF(AND('Master Data'!$I$30='GA55 Check & Edit'!$AN$6,'Master Data'!$N$36='GA55 Check & Edit'!$AO$6),0,IF(AND('Master Data'!$I$30='GA55 Check & Edit'!$AN$6,'Master Data'!$N$36='GA55 Check & Edit'!$AO$5),'Master Data'!$J$43,IF(AND('Master Data'!$I$30='GA55 Check & Edit'!$AN$5),IF($AZ$15<18001,265,IF($AZ$15<33501,440,IF($AZ$15<54001,658,875)))))))","v":0},{"$f":"IFERROR(IF(OR('Master Data'!$I$28='GA55 Check & Edit'!$AP$6),\"\",'Master Data'!$G$43),\"\")","v":7000},{"$f":"IFERROR(IF(AND('Master Data'!$I$30='GA55 Check & Edit'!$AN$6),ROUND((E9)*0.1,0),IF(AND('Master Data'!$I$28='GA55 Check & Edit'!$AP$6),ROUND((E9+F9)*0.1,0),'Master Data'!$H$43)),\"\")","v":5080},{"$f":"BA13","v":50800},"2021-04-01",{"$f":"IFERROR(IF('Master Data'!$E$36=\"\",\"\",IF('Master Data'!$F$40=\"\",\"\",IF(AND($AZ$17>$AZ$9),\"\",DATE(YEAR(BL12),MONTH(BL12)+1,DAY(BL12))))),\"\")","v":"2021-04-01"},{"$f":"IFERROR(IF('Master Data'!$E$36=\"\",\"\",IF('Master Data'!$F$40=\"\",\"\",IF(AND($AZ$17>$AZ$9),\"\",DATE(YEAR(BM12),MONTH(BM12)+1,DAY(BM12))))),\"\")","v":"2021-04-01"},{"$f":"IF(AND(BM13=\"\"),\"\",IF(AND(BM13=$BK$12),$BK$12,IF(AND(BM13=$BK$13),$BK$13,IF(AND(BM13=$BK$14),$BK$14,IF(AND(BM13=$BK$15),$BK$15,IF(AND(BM13=$BK$16),$BK$16,IF(AND(BM13=$BK$17),$BK$17,IF(AND(BM13=$BK$18),$BK$18,IF(AND(BM13=$BK$19),$BK$19,IF(AND(BM13=$BK$20),$BK$20,IF(AND(BM13=$BK$21),$BK$21,IF(AND(BM13=$BK$22),$BK$22,IF(AND(BM13=$BK$23),$BK$23,IF(AND(BM13=$BK$24),$BM$24,IF(AND(BM13=$BK$25),$BM$25,IF(AND(BM13=$BK$26),$BM$26,IF(AND(BM13=$BK$27),$BM$27,IF(AND(BM13=$BK$28),$BM$28,IF(AND(BM13=$BK$29),$BM$29,IF(AND(BM13=$BK$30),$BM$30,IF(AND(BM13=$BK$31),$BM$31,IF(AND(BM13=$BK$32),$BM$32,\"\"))))))))))))))))))))))","v":"2021-04-01"},{"$f":"IFERROR(IF(BM13=\"\",\"\",IF(AND(BL13=$BK$24),$BM$24,IF(AND(BL13=$BK$25),$BM$25,IF(AND(BL13=$BK$26),$BM$26,IF(AND(BL13=$BK$27),$BM$27,IF(AND(BL13=$BK$28),$BM$28,IF(AND(BL13=$BK$29),$BM$29,IF(AND(BL13=$BK$30),$BM$30,IF(AND(BL13=$BK$31),$BM$31,IF(AND(BL13=$BK$32),$BM$32,BN13)))))))))),\"\")","v":"2021-04-01"},null,{"$f":"IFERROR(IF(BM13=\"\",\"\",IF(D9=$AX$25,$AX$25,IF(D9=$AX$30,$AX$30,IF(D9=$AX$31,$AX$31,IF(D9=$AX$32,$AX$32,IF(BM13>$AZ$17,\"\",BM13)))))),\"\")","v":"2021-04-01"},null,{"$f":"OFFSET(D7,MATCH(BO13,$D$8:$D$27,0)+1,MATCH(BO13,D9:N9,0))","v":50800},null,{"$f":"IF(AND('Master Data'!$E$36=\"\"),\"\",IF(AND('Master Data'!$I$38='GA55 Check & Edit'!AX13),'Master Data'!$I$36,'Master Data'!$E$36))","v":50800},null,null,{"$f":"IF(BB13=\"\",0,BF13)","v":1500}]
[1,7,7,"2021-09-01",{"$f":"IFERROR(IF(D14=\"\",\"\",IF(AND(BQ18=\"\"),\"\",IF(AND('Master Data'!$I$28='GA55 Check & Edit'!$AP$6),VLOOKUP(D14,ram,13,0),VLOOKUP(D14,ram,4,0)))),\"\")","v":52300},{"$f":"IFERROR(IF(D14=\"\",\"\",IF(D14=$AX$24,\"\",IF(AND(D14=$AX$25),$BC$25,IF(AND(D14=$AX$27),\"\",IF(AND(D14=$AX$28),\"\",IF(AND('Master Data'!$I$28='GA55 Check & Edit'!$AP$5),VLOOKUP(D14,ram,7,0),\"\")))))),\"\")","v":14644},{"$f":"IFERROR(IF(D14=\"\",\"\",IF(D14=$AX$24,\"\",IF(AND(D14=$AX$25),\"\",IF(AND(D14=$AX$26),\"\",IF(AND(D14=$AX$27),\"\",IF(AND(D14=$AX$29),\"\",IF(AND('Master Data'!$I$28='GA55 Check & Edit'!$AP$6),\"\",VLOOKUP(D14,ram,8,0)))))))),\"\")","v":4707},{"$f":"IFERROR(IF(D14=\"\",\"\",IF(AND(E14=\"\"),\"\",IF(OR(D14=$AX$24,D14=$AX$25,D14=$AX$26,D14=$AX$27,D14=$AX$28,D14=$AX$29),\"\",IF(AND('Master Data'!$I$28='GA55 Check & Edit'!$AP$5),'Master Data'!$B$43,\"\")))),\"\")","v":0},{"$f":"IFERROR(IF(D14=\"\",\"\",IF(AND(E14=\"\"),\"\",IF(OR(D14=$AX$24,D14=$AX$25,D14=$AX$26,D14=$AX$27,D14=$AX$28,D14=$AX$29),\"\",IF(AND('Master Data'!$I$28='GA55 Check & Edit'!$AP$5,'Master Data'!$E$28='GA55 Check & Edit'!$AO$5),'Master Data'!$C$43,\"0\")))),\"\")","v":"0"},{"$f":"IFERROR(IF(OR('Master Data'!$E$32=$AO$6,'Master Data'!$E$32=\"\"),\"\",IF(D14=\"\",\"\",IF(AND(E14=\"\"),\"\",IF(OR(D14=$AX$24,D14=$AX$25,D14=$AX$26,D14=$AX$27,D14=$AX$28,D14=$AX$29),\"\",IF(AND('Master Data'!$I$28='GA55 Check & Edit'!$AP$6),\"\",IF(AND('Master Data'!$I$32=$AR$9),$AS$6,IF(AND('Master Data'!$I$32=$AR$10),$AS$6,IF(AND('Master Data'!$I$32=$AR$11),$AS$6,IF(AND('Master Data'!$I$32=$AR$12),$AS$6,$AS$5))))))))),\"\")","v":""},{"$f":"IFERROR(IF(D14=\"\",\"\",IF(AND(E14=\"\"),\"\",IF(OR(D14=$AX$24,D14=$AX$25,D14=$AX$26,D14=$AX$27,D14=$AX$28,D14=$AX$29),\"\",IF(AND('Master Data'!$I$28='GA55 Check & Edit'!$AP$5),'Master Data'!$E$43,\"\")))),\"\")","v":0},{"$f":"IFERROR(IF(D14=\"\",\"\",IF(AND(E14=\"\"),\"\",IF(OR(D14=$AX$24,D14=$AX$25,D14=$AX$26,D14=$AX$27,D14=$AX$28,D14=$AX$29),\"\",IF(AND('Master Data'!$I$28='GA55 Check & Edit'!$AP$6),\"\",'Master Data'!$F$43)))),\"\")","v":0},{"$f":"IFERROR(IF(D14=\"\",\"\",IF(AND('Master Data'!$I$28='GA55 Check & Edit'!$AP$6),\"\",IF(AND('Master Data'!$I$24='GA55 Check & Edit'!$AO$6),\"\",IF(AND(D14=\"Bonus\"),VLOOKUP(D14,ram,4,0),\"\")))),\"\")","v":""},{"$f":"IFERROR(IF(AND(D14=\"\"),\"\",IF(AND(D14=$AX$25,'Master Data'!$I$30='GA55 Check & Edit'!$AN$6),ROUND((E14+F14)*0.1,0),IF(AND(D14=$AX$29,'Master Data'!$I$30='GA55 Check & Edit'!$AN$6),ROUND((F14)*0.1,0),IF(AND(D14=$AX$26,'Master Data'!$I$30='GA55 Check & Edit'!$AN$6),ROUND((F14)*0.1,0),IF(AND(D14=$AX$27,'Master Data'!$I$30='GA55 Check & Edit'!$AN$6),ROUND((E14+F14)*0.1,0),IF(AND('Master Data'!$I$30='GA55 Check & Edit'!$AN$5),\"\",IF(AND('Master Data'!$I$30='GA55 Check & Edit'!$AN$6,'Master Data'!$I$28='GA55 Check & Edit'!$AP$6),ROUND((E14)*0.1,0),ROUND((E14+F14)*0.1,0)))))))),\"\")","v":6694},{"$f":"IF(D14=\"\",\"\",IF('Master Data'!$H$18='GA55 Check & Edit'!$AO$5,SUM(E14:N14),SUM(E14:M14)))","v":71651},{"$f":"IFERROR(IF(OR('Master Data'!$I$28='GA55 Check & Edit'!$AP$6,D14=\"\"),\"\",IF(AND(D14=$AX$24),\"\",IF(AND(D14=$AX$25),\"\",IF(AND(D14=$AX$26),\"\",IF(AND(D14=$AX$27),\"\",IF(AND(D14=$AX$28),\"\",IF(AND(D14=$AX$29),\"\",IF(AND(E14=\"\"),\"\",VLOOKUP(D14,ram,11,0))))))))),\"\")","v":7000},{"$f":"IFERROR(IF(AND(D14=\"\",E14=\"\"),\"\",IF(AND(D14=$AX$25,'Master Data'!$I$30='GA55 Check & Edit'!$AN$6),ROUND((E14+F14)*0.1,0),IF(AND(D14=$AX$29,'Master Data'!$I$30='GA55 Check & Edit'!$AN$6),ROUND((F14)*0.1,0),IF(AND(D14=$AX$26,'Master Data'!$I$30='GA55 Check & Edit'!$AN$6),ROUND((F14)*0.1,0),IF(AND(D14=$AX$27,'Master Data'!$I$30='GA55 Check & Edit'!$AN$6),ROUND((E14+F14)*0.1,0),IF(AND('Master Data'!$I$30='GA55 Check & Edit'!$AN$6,'Master Data'!$I$28='GA55 Check & Edit'!$AP$6),ROUND((E14)*0.1,0),IF(AND('Master Data'!$I$30='GA55 Check & Edit'!$AN$6,'Master Data'!$I$28='GA55 Check & Edit'!$AP$5),ROUND((E14+F14)*0.1,0),IF(AND('Master Data'!$I$30='GA55 Check & Edit'!$AN$5,'Master Data'!$I$28='GA55 Check & Edit'!$AP$5),VLOOKUP(D14,ram,12,0))))))))),\"\")","v":6694},{"$f":"IFERROR(IF(OR('Master Data'!$I$28='GA55 Check & Edit'!$AP$6,D14=\"\"),\"\",IF(AND(D14=$AX$24),\"\",IF(AND(D14=$AX$25),\"\",IF(AND(D14=$AX$26),\"\",IF(AND(D14=$AX$27),\"\",IF(AND(D14=$AX$28),\"\",IF(AND(D14=$AX$29),\"\",IF(AND(D14=$AX$32),\"\",IF(AND(E14=\"\"),\"\",'Master Data'!$I$43))))))))),\"\")","v":1880},{"$f":"IFERROR(IF(OR('Master Data'!$I$28='GA55 Check & Edit'!$AP$6),\"\",IF(D14=\"\",\"\",IF(E14=\"\",\"\",IF(AND(D14=$AX$24),\"\",IF(AND(D14=$AX$25),\"\",IF(AND(D14=$AX$26),\"\",IF(AND(D14=$AX$27),\"\",IF(AND(D14=$AX$28),\"\",IF(AND(D14=$AX$29),\"\",VLOOKUP(D14,ram,10,0)))))))))),\"\")","v":0},{"$f":"IFERROR(IF(OR('Master Data'!$I$28='GA55 Check & Edit'!$AP$6,D14=\"\"),\"\",IF(AND(D14=$AX$24),\"\",IF(AND(D14=$AX$25),\"\",IF(AND(D14=$AX$26),\"\",IF(AND(D14=$AX$27),\"\",IF(AND(D14=$AX$28),\"\",IF(AND(D14=$AX$29),\"\",IF(AND(E14=\"\"),\"\",'Master Data'!$K$43)))))))),\"\")","v":0},{"$f":"IFERROR(IF(OR('Master Data'!$I$28='GA55 Check & Edit'!$AP$6,D14=\"\"),\"\",IF(AND(D14=$AX$24),\"\",IF(AND(D14=$AX$25),\"\",IF(AND(D14=$AX$26),\"\",IF(AND(D14=$AX$27),\"\",IF(AND(D14=$AX$28),\"\",IF(AND(D14=$AX$29),\"\",IF(AND(E14=\"\"),\"\",'Master Data'!$L$43)))))))),\"\")","v":0},{"$f":"IFERROR(IF(OR('Master Data'!$I$28='GA55 Check & Edit'!$AP$6,D14=\"\"),\"\",IF(AND(D14=$AX$24,'Master Data'!$I$28='GA55 Check & Edit'!$AP$5,'Master Data'!$I$30='GA55 Check & Edit'!$AN$6),ROUND(M14*50%,0),IF(AND(D14=$AX$25),\"\",IF(AND(D14=$AX$26,'Master Data'!$I$28='GA55 Check & Edit'!$AP$5,'Master Data'!$I$30='GA55 Check & Edit'!$AN$6),SUM(F14-N14),IF(AND(D14=$AX$27),\"\",IF(AND(D14=$AX$28),\"\",IF(AND(D14=$AX$29,'Master Data'!$I$28='GA55 Check & Edit'!$AP$5,'Master Data'!$I$30='GA55 Check & Edit'!$AN$6),SUM(F14-N14),IF(AND(E14=\"\"),\"\",'Master Data'!$M$43)))))))),\"\")","v":0},{"$f":"IFERROR(IF(OR('Master Data'!$I$28='GA55 Check & Edit'!$AP$6,D14=\"\"),\"\",IF(AND(D14=$AX$24),\"\",IF(AND(D14=$AX$25),\"\",IF(AND(D14=$AX$26),\"\",IF(AND(D14=$AX$27),\"\",IF(AND(D14=$AX$28),\"\",IF(AND(D14=$AX$29),\"\",IF(AND(E14=\"\"),\"\",'Master Data'!$O$43)))))))),\"\")","v":0},{"$f":"IFERROR(IF(OR('Master Data'!$I$28='GA55 Check & Edit'!$AP$6,D14=\"\"),\"\",IF(AND(E14=\"\"),\"\",IF(AND('GA55 Check & Edit'!D14='GA55 Check & Edit'!$AT$17,'Master Data'!$D$18=\"Gazetted\"),500,IF(AND('GA55 Check & Edit'!D14='GA55 Check & Edit'!$AT$17,'Master Data'!$D$18=\"Non-Gazetted\"),250,\"\")))),\"\")","v":""},{"$f":"IFERROR(IF(D14=\"\",\"\",IF(AND(E14=\"\"),\"\",IF(AND(D14=$AX$24),\"\",IF(AND(D14=$AX$25),\"\",IF(AND(D14=$AX$26),\"\",IF(AND(D14=$AX$27),\"\",IF(AND(D14=$AX$28),\"\",IF(AND(D14=$AX$29),\"\",IF(OR('Master Data'!$I$28='GA55 Check & Edit'!$AP$6,D14=\"\"),\"\",$Y$7))))))))),\"\")","v":0},{"$f":"IFERROR(IF(OR('Master Data'!$I$28='GA55 Check & Edit'!$AP$6),\"\",IF(D14=\"\",\"\",IF(E14=\"\",\"\",VLOOKUP(D14,ram,9,0)))),\"\")","v":1500},{"$f":"IFERROR(IF(OR('Master Data'!$I$28='GA55 Check & Edit'!$AP$6,D14=\"\",'Master Data'!$N$38=\"\"),\"\",IF(AND(E14=\"\"),\"\",IF('GA55 Check & Edit'!D14='GA55 Check & Edit'!$AT$9,'Master Data'!$N$38,\"\"))),\"\")","v":""},{"$f":"IFERROR(IF(D14=\"\",\"\",IF(AND(O14=\"\"),\"\",IF(AND(N14=\"\"),SUM(P14:AA14),IF(AND('Master Data'!$H$18='GA55 Check & Edit'!$AO$5,'Master Data'!$I$30='GA55 Check & Edit'!$AN$6),SUM(P14:AA14)+N14,SUM(P14:AA14))))),\"0\")","v":17074},54577,null,null,null,null,null,null,null,null,null,null,null,null,null,null,null,"JUL","2021-09-01","L-7",null,"MAY","2021-05-01",5,null,{"$f":"IF(AND('Master Data'!$E$36=\"\"),\"\",IF(AND('Master Data'!$I$28='GA55 Check & Edit'!$AP$6),'GA55 Check & Edit'!$AZ$15,BU14))","v":50800},{"$f":"IF(AND(AX14<$AZ$16),\"\",IF(AND(AX14>$AZ$17),\"\",BA14))","v":50800},{"$f":"IF(AND('Master Data'!$E$36=\"\"),\"\",ROUND(17%*BA14,0))","v":8636},{"$f":"IF(BB14=\"\",\"\",BC14)","v":8636},{"$f":"IFERROR(IF(AND('Master Data'!$E$36=\"\"),\"\",ROUND('Master Data'!$E$30%*BB14,0)),\"\")","v":4064},{"$f":"'Master Data'!D47","v":1500},{"$f":"IF(AND('Master Data'!$I$28='GA55 Check & Edit'!$AP$6),\"\",IF(AND('Master Data'!$I$30='GA55 Check & Edit'!$AN$6,'Master Data'!$N$36='GA55 Check & Edit'!$AO$6),0,IF(AND('Master Data'!$I$30='GA55 Check & Edit'!$AN$6,'Master Data'!$N$36='GA55 Check & Edit'!$AO$5),'Master Data'!$J$43,IF(AND('Master Data'!$I$30='GA55 Check & Edit'!$AN$5),IF($AZ$15<18001,265,IF($AZ$15<33501,440,IF($AZ$15<54001,658,875)))))))","v":0},{"$f":"IFERROR(IF(OR('Master Data'!$I$28='GA55 Check & Edit'!$AP$6),\"\",'Master Data'!$G$43),\"\")","v":7000},{"$f":"IFERROR(IF(AND('Master Data'!$I$30='GA55 Check & Edit'!$AN$6),ROUND((E10)*0.1,0),IF(AND('Master Data'!$I$28='GA55 Check & Edit'!$AP$6),ROUND((E10+F10)*0.1,0),'Master Data'!$H$43)),\"\")","v":5080},{"$f":"BA14","v":50800},"2021-05-01",{"$f":"IFERROR(IF('Master Data'!$E$36=\"\",\"\",IF('Master Data'!$F$40=\"\",\"\",IF(AND($AZ$17>$AZ$9),\"\",DATE(YEAR(BL13),MONTH(BL13)+1,DAY(BL13))))),\"\")","v":"2021-05-01"},{"$f":"IFERROR(IF('Master Data'!$E$36=\"\",\"\",IF('Master Data'!$F$40=\"\",\"\",IF(AND($AZ$17>$AZ$9),\"\",DATE(YEAR(BM13),MONTH(BM13)+1,DAY(BM13))))),\"\")","v":"2021-05-01"},"2021-05-01","2021-05-01",null,"2021-05-01",null,52300,null,{"$f":"IF(AND('Master Data'!$I$38='GA55 Check & Edit'!AX14),'Master Data'!$I$36,BU13)","v":50800},null,null,1500]
[0,8,8,"2021-10-01",{"$f":"IFERROR(IF(D15=\"\",\"\",IF(AND(BQ19=\"\"),\"\",IF(AND('Master Data'!$I$28='GA55 Check & Edit'!$AP$6),VLOOKUP(D15,ram,13,0),VLOOKUP(D15,ram,4,0)))),\"\")","v":52300},{"$f":"IFERROR(IF(D15=\"\",\"\",IF(D15=$AX$24,\"\",IF(AND(D15=$AX$25),$BC$25,IF(AND(D15=$AX$27),\"\",IF(AND(D15=$AX$28),\"\",IF(AND('Master Data'!$I$28='GA55 Check & Edit'!$AP$5),VLOOKUP(D15,ram,7,0),\"\")))))),\"\")","v":16213},{"$f":"IFERROR(IF(D15=\"\",\"\",IF(D15=$AX$24,\"\",IF(AND(D15=$AX$25),\"\",IF(AND(D15=$AX$26),\"\",IF(AND(D15=$AX$27),\"\",IF(AND(D15=$AX$29),\"\",IF(AND('Master Data'!$I$28='GA55 Check & Edit'!$AP$6),\"\",VLOOKUP(D15,ram,8,0)))))))),\"\")","v":4707},{"$f":"IFERROR(IF(D15=\"\",\"\",IF(AND(E15=\"\"),\"\",IF(OR(D15=$AX$24,D15=$AX$25,D15=$AX$26,D15=$AX$27,D15=$AX$28,D15=$AX$29),\"\",IF(AND('Master Data'!$I$28='GA55 Check & Edit'!$AP$5),'Master Data'!$B$43,\"\")))),\"\")","v":0},{"$f":"IFERROR(IF(D15=\"\",\"\",IF(AND(E15=\"\"),\"\",IF(OR(D15=$AX$24,D15=$AX$25,D15=$AX$26,D15=$AX$27,D15=$AX$28,D15=$AX$29),\"\",IF(AND('Master Data'!$I$28='GA55 Check & Edit'!$AP$5,'Master Data'!$E$28='GA55 Check & Edit'!$AO$5),'Master Data'!$C$43,\"0\")))),\"\")","v":"0"},{"$f":"IFERROR(IF(OR('Master Data'!$E$32=$AO$6,'Master Data'!$E$32=\"\"),\"\",IF(D15=\"\",\"\",IF(AND(E15=\"\"),\"\",IF(OR(D15=$AX$24,D15=$AX$25,D15=$AX$26,D15=$AX$27,D15=$AX$28,D15=$AX$29),\"\",IF(AND('Master Data'!$I$28='GA55 Check & Edit'!$AP$6),\"\",IF(AND('Master Data'!$I$32=$AR$9),$AS$6,IF(AND('Master Data'!$I$32=$AR$10),$AS$6,IF(AND('Master Data'!$I$32=$AR$11),$AS$6,IF(AND('Master Data'!$I$32=$AR$12),$AS$6,$AS$5))))))))),\"\")","v":""},{"$f":"IFERROR(IF(D15=\"\",\"\",IF(AND(E15=\"\"),\"\",IF(OR(D15=$AX$24,D15=$AX$25,D15=$AX$26,D15=$AX$27,D15=$AX$28,D15=$AX$29),\"\",IF(AND('Master Data'!$I$28='GA55 Check & Edit'!$AP$5),'Master Data'!$E$43,\"\")))),\"\")","v":0},{"$f":"IFERROR(IF(D15=\"\",\"\",IF(AND(E15=\"\"),\"\",IF(OR(D15=$AX$24,D15=$AX$25,D15=$AX$26,D15=$AX$27,D15=$AX$28,D15=$AX$29),\"\",IF(AND('Master Data'!$I$28='GA55 Check & Edit'!$AP$6),\"\",'Master Data'!$F$43)))),\"\")","v":0},{"$f":"IFERROR(IF(D15=\"\",\"\",IF(AND('Master Data'!$I$28='GA55 Check & Edit'!$AP$6),\"\",IF(AND('Master Data'!$I$24='GA55 Check & Edit'!$AO$6),\"\",IF(AND(D15=\"Bonus\"),VLOOKUP(D15,ram,4,0),\"\")))),\"\")","v":""},{"$f":"IFERROR(IF(AND(D15=\"\"),\"\",IF(AND(D15=$AX$25,'Master Data'!$I$30='GA55 Check & Edit'!$AN$6),ROUND((E15+F15)*0.1,0),IF(AND(D15=$AX$29,'Master Data'!$I$30='GA55 Check & Edit'!$AN$6),ROUND((F15)*0.1,0),IF(AND(D15=$AX$26,'Master Data'!$I$30='GA55 Check & Edit'!$AN$6),ROUND((F15)*0.1,0),IF(AND(D15=$AX$27,'Master Data'!$I$30='GA55 Check & Edit'!$AN$6),ROUND((E15+F15)*0.1,0),IF(AND('Master Data'!$I$30='GA55 Check & Edit'!$AN$5),\"\",IF(AND('Master Data'!$I$30='GA55 Check & Edit'!$AN$6,'Master Data'!$I$28='GA55 Check & Edit'!$AP$6),ROUND((E15)*0.1,0),ROUND((E15+F15)*0.1,0)))))))),\"\")","v":6851},{"$f":"IF(D15=\"\",\"\",IF('Master Data'!$H$18='GA55 Check & Edit'!$AO$5,SUM(E15:N15),SUM(E15:M15)))","v":73220},{"$f":"IFERROR(IF(OR('Master Data'!$I$28='GA55 Check & Edit'!$AP$6,D15=\"\"),\"\",IF(AND(D15=$AX$24),\"\",IF(AND(D15=$AX$25),\"\",IF(AND(D15=$AX$26),\"\",IF(AND(D15=$AX$27),\"\",IF(AND(D15=$AX$28),\"\",IF(AND(D15=$AX$29),\"\",IF(AND(E15=\"\"),\"\",VLOOKUP(D15,ram,11,0))))))))),\"\")","v":7000},{"$f":"IFERROR(IF(AND(D15=\"\",E15=\"\"),\"\",IF(AND(D15=$AX$25,'Master Data'!$I$30='GA55 Check & Edit'!$AN$6),ROUND((E15+F15)*0.1,0),IF(AND(D15=$AX$29,'Master Data'!$I$30='GA55 Check & Edit'!$AN$6),ROUND((F15)*0.1,0),IF(AND(D15=$AX$26,'Master Data'!$I$30='GA55 Check & Edit'!$AN$6),ROUND((F15)*0.1,0),IF(AND(D15=$AX$27,'Master Data'!$I$30='GA55 Check & Edit'!$AN$6),ROUND((E15+F15)*0.1,0),IF(AND('Master Data'!$I$30='GA55 Check & Edit'!$AN$6,'Master Data'!$I$28='GA55 Check & Edit'!$AP$6),ROUND((E15)*0.1,0),IF(AND('Master Data'!$I$30='GA55 Check & Edit'!$AN$6,'Master Data'!$I$28='GA55 Check & Edit'!$AP$5),ROUND((E15+F15)*0.1,0),IF(AND('Master Data'!$I$30='GA55 Check & Edit'!$AN$5,'Master Data'!$I$28='GA55 Check & Edit'!$AP$5),VLOOKUP(D15,ram,12,0))))))))),\"\")","v":6851},{"$f":"IFERROR(IF(OR('Master Data'!$I$28='GA55 Check & Edit'!$AP$6,D15=\"\"),\"\",IF(AND(D15=$AX$24),\"\",IF(AND(D15=$AX$25),\"\",IF(AND(D15=$AX$26),\"\",IF(AND(D15=$AX$27),\"\",IF(AND(D15=$AX$28),\"\",IF(AND(D15=$AX$29),\"\",IF(AND(D15=$AX$32),\"\",IF(AND(E15=\"\"),\"\",'Master Data'!$I$43))))))))),\"\")","v":1880},{"$f":"IFERROR(IF(OR('Master Data'!$I$28='GA55 Check & Edit'!$AP$6),\"\",IF(D15=\"\",\"\",IF(E15=\"\",\"\",IF(AND(D15=$AX$24),\"\",IF(AND(D15=$AX$25),\"\",IF(AND(D15=$AX$26),\"\",IF(AND(D15=$AX$27),\"\",IF(AND(D15=$AX$28),\"\",IF(AND(D15=$AX$29),\"\",VLOOKUP(D15,ram,10,0)))))))))),\"\")","v":0},{"$f":"IFERROR(IF(OR('Master Data'!$I$28='GA55 Check & Edit'!$AP$6,D15=\"\"),\"\",IF(AND(D15=$AX$24),\"\",IF(AND(D15=$AX$25),\"\",IF(AND(D15=$AX$26),\"\",IF(AND(D15=$AX$27),\"\",IF(AND(D15=$AX$28),\"\",IF(AND(D15=$AX$29),\"\",IF(AND(E15=\"\"),\"\",'Master Data'!$K$43)))))))),\"\")","v":0},{"$f":"IFERROR(IF(OR('Master Data'!$I$28='GA55 Check & Edit'!$AP$6,D15=\"\"),\"\",IF(AND(D15=$AX$24),\"\",IF(AND(D15=$AX$25),\"\",IF(AND(D15=$AX$26),\"\",IF(AND(D15=$AX$27),\"\",IF(AND(D15=$AX$28),\"\",IF(AND(D15=$AX$29),\"\",IF(AND(E15=\"\"),\"\",'Master Data'!$L$43)))))))),\"\")","v":0},{"$f":"IFERROR(IF(OR('Master Data'!$I$28='GA55 Check & Edit'!$AP$6,D15=\"\"),\"\",IF(AND(D15=$AX$24,'Master Data'!$I$28='GA55 Check & Edit'!$AP$5,'Master Data'!$I$30='GA55 Check & Edit'!$AN$6),ROUND(M15*50%,0),IF(AND(D15=$AX$25),\"\",IF(AND(D15=$AX$26,'Master Data'!$I$28='GA55 Check & Edit'!$AP$5,'Master Data'!$I$30='GA55 Check & Edit'!$AN$6),SUM(F15-N15),IF(AND(D15=$AX$27),\"\",IF(AND(D15=$AX$28),\"\",IF(AND(D15=$AX$29,'Master Data'!$I$28='GA55 Check & Edit'!$AP$5,'Master Data'!$I$30='GA55 Check & Edit'!$AN$6),SUM(F15-N15),IF(AND(E15=\"\"),\"\",'Master Data'!$M$43)))))))),\"\")","v":0},{"$f":"IFERROR(IF(OR('Master Data'!$I$28='GA55 Check & Edit'!$AP$6,D15=\"\"),\"\",IF(AND(D15=$AX$24),\"\",IF(AND(D15=$AX$25),\"\",IF(AND(D15=$AX$26),\"\",IF(AND(D15=$AX$27),\"\",IF(AND(D15=$AX$28),\"\",IF(AND(D15=$AX$29),\"\",IF(AND(E15=\"\"),\"\",'Master Data'!$O$43)))))))),\"\")","v":0},{"$f":"IFERROR(IF(OR('Master Data'!$I$28='GA55 Check & Edit'!$AP$6,D15=\"\"),\"\",IF(AND(E15=\"\"),\"\",IF(AND('GA55 Check & Edit'!D15='GA55 Check & Edit'!$AT$17,'Master Data'!$D$18=\"Gazetted\"),500,IF(AND('GA55 Check & Edit'!D15='GA55 Check & Edit'!$AT$17,'Master Data'!$D$18=\"Non-Gazetted\"),250,\"\")))),\"\")","v":""},{"$f":"IFERROR(IF(D15=\"\",\"\",IF(AND(E15=\"\"),\"\",IF(AND(D15=$AX$24),\"\",IF(AND(D15=$AX$25),\"\",IF(AND(D15=$AX$26),\"\",IF(AND(D15=$AX$27),\"\",IF(AND(D15=$AX$28),\"\",IF(AND(D15=$AX$29),\"\",IF(OR('Master Data'!$I$28='GA55 Check & Edit'!$AP$6,D15=\"\"),\"\",$Y$7))))))))),\"\")","v":0},{"$f":"IFERROR(IF(OR('Master Data'!$I$28='GA55 Check & Edit'!$AP$6),\"\",IF(D15=\"\",\"\",IF(E15=\"\",\"\",VLOOKUP(D15,ram,9,0)))),\"\")","v":1500},{"$f":"IFERROR(IF(OR('Master Data'!$I$28='GA55 Check & Edit'!$AP$6,D15=\"\",'Master Data'!$N$38=\"\"),\"\",IF(AND(E15=\"\"),\"\",IF('GA55 Check & Edit'!D15='GA55 Check & Edit'!$AT$9,'Master Data'!$N$38,\"\"))),\"\")","v":""},{"$f":"IFERROR(IF(D15=\"\",\"\",IF(AND(O15=\"\"),\"\",IF(AND(N15=\"\"),SUM(P15:AA15),IF(AND('Master Data'!$H$18='GA55 Check & Edit'!$AO$5,'Master Data'!$I$30='GA55 Check & Edit'!$AN$6),SUM(P15:AA15)+N15,SUM(P15:AA15))))),\"0\")","v":17231},55989,null,null,null,null,null,null,null,null,null,null,null,null,null,null,null,"AUG","2021-10-01","L-8",null,"JUN","2021-06-01",6,{"$f":"IF(AND('Master Data'!E36=\"\"),\"\",'Master Data'!E36)","v":50800},{"$f":"IF(AND('Master Data'!$E$36=\"\"),\"\",IF(AND('Master Data'!$I$28='GA55 Check & Edit'!$AP$6),'GA55 Check & Edit'!$AZ$15,BU15))","v":50800},50800,{"$f":"IF(AND('Master Data'!$E$36=\"\"),\"\",ROUND(17%*BA15,0))","v":8636},{"$f":"IF(BB15=\"\",\"\",BC15)","v":8636},{"$f":"IFERROR(IF(AND('Master Data'!$E$36=\"\"),\"\",ROUND('Master Data'!$E$30%*BB15,0)),\"\")","v":4064},{"$f":"'Master Data'!E47","v":1500},{"$f":"IF(AND('Master Data'!$I$28='GA55 Check & Edit'!$AP$6),\"\",IF(AND('Master Data'!$I$30='GA55 Check & Edit'!$AN$6,'Master Data'!$N$36='GA55 Check & Edit'!$AO$6),0,IF(AND('Master Data'!$I$30='GA55 Check & Edit'!$AN$6,'Master Data'!$N$36='GA55 Check & Edit'!$AO$5),'Master Data'!$J$43,IF(AND('Master Data'!$I$30='GA55 Check & Edit'!$AN$5),IF($AZ$15<18001,265,IF($AZ$15<33501,440,IF($AZ$15<54001,658,875)))))))","v":0},{"$f":"IFERROR(IF(OR('Master Data'!$I$28='GA55 Check & Edit'!$AP$6),\"\",'Master Data'!$G$43),\"\")","v":7000},{"$f":"IFERROR(IF(AND('Master Data'!$I$30='GA55 Check & Edit'!$AN$6),ROUND((E11)*0.1,0),IF(AND('Master Data'!$I$28='GA55 Check & Edit'!$AP$6),ROUND((E11+F11)*0.1,0),'Master Data'!$H$43)),\"\")","v":5080},50800,"2021-06-01",{"$f":"IFERROR(IF('Master Data'!$E$36=\"\",\"\",IF('Master Data'!$F$40=\"\",\"\",IF(AND($AZ$17>$AZ$9),\"\",DATE(YEAR(BL14),MONTH(BL14)+1,DAY(BL14))))),\"\")","v":"2021-06-01"},{"$f":"IFERROR(IF('Master Data'!$E$36=\"\",\"\",IF('Master Data'!$F$40=\"\",\"\",IF(AND($AZ$17>$AZ$9),\"\",DATE(YEAR(BM14),MONTH(BM14)+1,DAY(BM14))))),\"\")","v":"2021-06-01"},"2021-06-01","2021-06-01",null,"2021-06-01",null,52300,null,{"$f":"IF(AND('Master Data'!$I$38='GA55 Check & Edit'!AX15),'Master Data'!$I$36,BU14)","v":50800},null,null,1500]
[1,9,9,"2021-11-01",{"$f":"IFERROR(IF(D16=\"\",\"\",IF(AND(BQ20=\"\"),\"\",IF(AND('Master Data'!$I$28='GA55 Check & Edit'!$AP$6),VLOOKUP(D16,ram,13,0),VLOOKUP(D16,ram,4,0)))),\"\")","v":52300},{"$f":"IFERROR(IF(D16=\"\",\"\",IF(D16=$AX$24,\"\",IF(AND(D16=$AX$25),$BC$25,IF(AND(D16=$AX$27),\"\",IF(AND(D16=$AX$28),\"\",IF(AND('Master Data'!$I$28='GA55 Check & Edit'!$AP$5),VLOOKUP(D16,ram,7,0),\"\")))))),\"\")","v":16213},{"$f":"IFERROR(IF(D16=\"\",\"\",IF(D16=$AX$24,\"\",IF(AND(D16=$AX$25),\"\",IF(AND(D16=$AX$26),\"\",IF(AND(D16=$AX$27),\"\",IF(AND(D16=$AX$29),\"\",IF(AND('Master Data'!$I$28='GA55 Check & Edit'!$AP$6),\"\",VLOOKUP(D16,ram,8,0)))))))),\"\")","v":4707},{"$f":"IFERROR(IF(D16=\"\",\"\",IF(AND(E16=\"\"),\"\",IF(OR(D16=$AX$24,D16=$AX$25,D16=$AX$26,D16=$AX$27,D16=$AX$28,D16=$AX$29),\"\",IF(AND('Master Data'!$I$28='GA55 Check & Edit'!$AP$5),'Master Data'!$B$43,\"\")))),\"\")","v":0},{"$f":"IFERROR(IF(D16=\"\",\"\",IF(AND(E16=\"\"),\"\",IF(OR(D16=$AX$24,D16=$AX$25,D16=$AX$26,D16=$AX$27,D16=$AX$28,D16=$AX$29),\"\",IF(AND('Master Data'!$I$28='GA55 Check & Edit'!$AP$5,'Master Data'!$E$28='GA55 Check & Edit'!$AO$5),'Master Data'!$C$43,\"0\")))),\"\")","v":"0"},{"$f":"IFERROR(IF(OR('Master Data'!$E$32=$AO$6,'Master Data'!$E$32=\"\"),\"\",IF(D16=\"\",\"\",IF(AND(E16=\"\"),\"\",IF(OR(D16=$AX$24,D16=$AX$25,D16=$AX$26,D16=$AX$27,D16=$AX$28,D16=$AX$29),\"\",IF(AND('Master Data'!$I$28='GA55 Check & Edit'!$AP$6),\"\",IF(AND('Master Data'!$I$32=$AR$9),$AS$6,IF(AND('Master Data'!$I$32=$AR$10),$AS$6,IF(AND('Master Data'!$I$32=$AR$11),$AS$6,IF(AND('Master Data'!$I$32=$AR$12),$AS$6,$AS$5))))))))),\"\")","v":""},{"$f":"IFERROR(IF(D16=\"\",\"\",IF(AND(E16=\"\"),\"\",IF(OR(D16=$AX$24,D16=$AX$25,D16=$AX$26,D16=$AX$27,D16=$AX$28,D16=$AX$29),\"\",IF(AND('Master Data'!$I$28='GA55 Check & Edit'!$AP$5),'Master Data'!$E$43,\"\")))),\"\")","v":0},{"$f":"IFERROR(IF(D16=\"\",\"\",IF(AND(E16=\"\"),\"\",IF(OR(D16=$AX$24,D16=$AX$25,D16=$AX$26,D16=$AX$27,D16=$AX$28,D16=$AX$29),\"\",IF(AND('Master Data'!$I$28='GA55 Check & Edit'!$AP$6),\"\",'Master Data'!$F$43)))),\"\")","v":0},{"$f":"IFERROR(IF(D16=\"\",\"\",IF(AND('Master Data'!$I$28='GA55 Check & Edit'!$AP$6),\"\",IF(AND('Master Data'!$I$24='GA55 Check & Edit'!$AO$6),\"\",IF(AND(D16=\"Bonus\"),VLOOKUP(D16,ram,4,0),\"\")))),\"\")","v":""},{"$f":"IFERROR(IF(AND(D16=\"\"),\"\",IF(AND(D16=$AX$25,'Master Data'!$I$30='GA55 Check & Edit'!$AN$6),ROUND((E16+F16)*0.1,0),IF(AND(D16=$AX$29,'Master Data'!$I$30='GA55 Check & Edit'!$AN$6),ROUND((F16)*0.1,0),IF(AND(D16=$AX$26,'Master Data'!$I$30='GA55 Check & Edit'!$AN$6),ROUND((F16)*0.1,0),IF(AND(D16=$AX$27,'Master Data'!$I$30='GA55 Check & Edit'!$AN$6),ROUND((E16+F16)*0.1,0),IF(AND('Master Data'!$I$30='GA55 Check & Edit'!$AN$5),\"\",IF(AND('Master Data'!$I$30='GA55 Check & Edit'!$AN$6,'Master Data'!$I$28='GA55 Check & Edit'!$AP$6),ROUND((E16)*0.1,0),ROUND((E16+F16)*0.1,0)))))))),\"\")","v":6851},{"$f":"IF(D16=\"\",\"\",IF('Master Data'!$H$18='GA55 Check & Edit'!$AO$5,SUM(E16:N16),SUM(E16:M16)))","v":73220},{"$f":"IFERROR(IF(OR('Master Data'!$I$28='GA55 Check & Edit'!$AP$6,D16=\"\"),\"\",IF(AND(D16=$AX$24),\"\",IF(AND(D16=$AX$25),\"\",IF(AND(D16=$AX$26),\"\",IF(AND(D16=$AX$27),\"\",IF(AND(D16=$AX$28),\"\",IF(AND(D16=$AX$29),\"\",IF(AND(E16=\"\"),\"\",VLOOKUP(D16,ram,11,0))))))))),\"\")","v":7000},{"$f":"IFERROR(IF(AND(D16=\"\",E16=\"\"),\"\",IF(AND(D16=$AX$25,'Master Data'!$I$30='GA55 Check & Edit'!$AN$6),ROUND((E16+F16)*0.1,0),IF(AND(D16=$AX$29,'Master Data'!$I$30='GA55 Check & Edit'!$AN$6),ROUND((F16)*0.1,0),IF(AND(D16=$AX$26,'Master Data'!$I$30='GA55 Check & Edit'!$AN$6),ROUND((F16)*0.1,0),IF(AND(D16=$AX$27,'Master Data'!$I$30='GA55 Check & Edit'!$AN$6),ROUND((E16+F16)*0.1,0),IF(AND('Master Data'!$I$30='GA55 Check & Edit'!$AN$6,'Master Data'!$I$28='GA55 Check & Edit'!$AP$6),ROUND((E16)*0.1,0),IF(AND('Master Data'!$I$30='GA55 Check & Edit'!$AN$6,'Master Data'!$I$28='GA55 Check & Edit'!$AP$5),ROUND((E16+F16)*0.1,0),IF(AND('Master Data'!$I$30='GA55 Check & Edit'!$AN$5,'Master Data'!$I$28='GA55 Check & Edit'!$AP$5),VLOOKUP(D16,ram,12,0))))))))),\"\")","v":6851},{"$f":"IFERROR(IF(OR('Master Data'!$I$28='GA55 Check & Edit'!$AP$6,D16=\"\"),\"\",IF(AND(D16=$AX$24),\"\",IF(AND(D16=$AX$25),\"\",IF(AND(D16=$AX$26),\"\",IF(AND(D16=$AX$27),\"\",IF(AND(D16=$AX$28),\"\",IF(AND(D16=$AX$29),\"\",IF(AND(D16=$AX$32),\"\",IF(AND(E16=\"\"),\"\",'Master Data'!$I$43))))))))),\"\")","v":1880},{"$f":"IFERROR(IF(OR('Master Data'!$I$28='GA55 Check & Edit'!$AP$6),\"\",IF(D16=\"\",\"\",IF(E16=\"\",\"\",IF(AND(D16=$AX$24),\"\",IF(AND(D16=$AX$25),\"\",IF(AND(D16=$AX$26),\"\",IF(AND(D16=$AX$27),\"\",IF(AND(D16=$AX$28),\"\",IF(AND(D16=$AX$29),\"\",VLOOKUP(D16,ram,10,0)))))))))),\"\")","v":0},{"$f":"IFERROR(IF(OR('Master Data'!$I$28='GA55 Check & Edit'!$AP$6,D16=\"\"),\"\",IF(AND(D16=$AX$24),\"\",IF(AND(D16=$AX$25),\"\",IF(AND(D16=$AX$26),\"\",IF(AND(D16=$AX$27),\"\",IF(AND(D16=$AX$28),\"\",IF(AND(D16=$AX$29),\"\",IF(AND(E16=\"\"),\"\",'Master Data'!$K$43)))))))),\"\")","v":0},{"$f":"IFERROR(IF(OR('Master Data'!$I$28='GA55 Check & Edit'!$AP$6,D16=\"\"),\"\",IF(AND(D16=$AX$24),\"\",IF(AND(D16=$AX$25),\"\",IF(AND(D16=$AX$26),\"\",IF(AND(D16=$AX$27),\"\",IF(AND(D16=$AX$28),\"\",IF(AND(D16=$AX$29),\"\",IF(AND(E16=\"\"),\"\",'Master Data'!$L$43)))))))),\"\")","v":0},{"$f":"IFERROR(IF(OR('Master Data'!$I$28='GA55 Check & Edit'!$AP$6,D16=\"\"),\"\",IF(AND(D16=$AX$24,'Master Data'!$I$28='GA55 Check & Edit'!$AP$5,'Master Data'!$I$30='GA55 Check & Edit'!$AN$6),ROUND(M16*50%,0),IF(AND(D16=$AX$25),\"\",IF(AND(D16=$AX$26,'Master Data'!$I$28='GA55 Check & Edit'!$AP$5,'Master Data'!$I$30='GA55 Check & Edit'!$AN$6),SUM(F16-N16),IF(AND(D16=$AX$27),\"\",IF(AND(D16=$AX$28),\"\",IF(AND(D16=$AX$29,'Master Data'!$I$28='GA55 Check & Edit'!$AP$5,'Master Data'!$I$30='GA55 Check & Edit'!$AN$6),SUM(F16-N16),IF(AND(E16=\"\"),\"\",'Master Data'!$M$43)))))))),\"\")","v":0},{"$f":"IFERROR(IF(OR('Master Data'!$I$28='GA55 Check & Edit'!$AP$6,D16=\"\"),\"\",IF(AND(D16=$AX$24),\"\",IF(AND(D16=$AX$25),\"\",IF(AND(D16=$AX$26),\"\",IF(AND(D16=$AX$27),\"\",IF(AND(D16=$AX$28),\"\",IF(AND(D16=$AX$29),\"\",IF(AND(E16=\"\"),\"\",'Master Data'!$O$43)))))))),\"\")","v":0},{"$f":"IFERROR(IF(OR('Master Data'!$I$28='GA55 Check & Edit'!$AP$6,D16=\"\"),\"\",IF(AND(E16=\"\"),\"\",IF(AND('GA55 Check & Edit'!D16='GA55 Check & Edit'!$AT$17,'Master Data'!$D$18=\"Gazetted\"),500,IF(AND('GA55 Check & Edit'!D16='GA55 Check & Edit'!$AT$17,'Master Data'!$D$18=\"Non-Gazetted\"),250,\"\")))),\"\")","v":""},{"$f":"IFERROR(IF(D16=\"\",\"\",IF(AND(E16=\"\"),\"\",IF(AND(D16=$AX$24),\"\",IF(AND(D16=$AX$25),\"\",IF(AND(D16=$AX$26),\"\",IF(AND(D16=$AX$27),\"\",IF(AND(D16=$AX$28),\"\",IF(AND(D16=$AX$29),\"\",IF(OR('Master Data'!$I$28='GA55 Check & Edit'!$AP$6,D16=\"\"),\"\",$Y$7))))))))),\"\")","v":0},{"$f":"IFERROR(IF(OR('Master Data'!$I$28='GA55 Check & Edit'!$AP$6),\"\",IF(D16=\"\",\"\",IF(E16=\"\",\"\",VLOOKUP(D16,ram,9,0)))),\"\")","v":1500},{"$f":"IFERROR(IF(OR('Master Data'!$I$28='GA55 Check & Edit'!$AP$6,D16=\"\",'Master Data'!$N$38=\"\"),\"\",IF(AND(E16=\"\"),\"\",IF('GA55 Check & Edit'!D16='GA55 Check & Edit'!$AT$9,'Master Data'!$N$38,\"\"))),\"\")","v":""},{"$f":"IFERROR(IF(D16=\"\",\"\",IF(AND(O16=\"\"),\"\",IF(AND(N16=\"\"),SUM(P16:AA16),IF(AND('Master Data'!$H$18='GA55 Check & Edit'!$AO$5,'Master Data'!$I$30='GA55 Check & Edit'!$AN$6),SUM(P16:AA16)+N16,SUM(P16:AA16))))),\"0\")","v":17231},55989,null,null,null,null,null,null,null,null,null,null,null,null,null,null,null,"SEP","2021-11-01","L-9",null,"JUL","2021-07-01",7,{"$f":"IF(AND('Master Data'!F40=\"\"),\"\",'Master Data'!F40)","v":"2021-03-01"},{"$f":"IF(AND('Master Data'!$E$36=\"\"),\"\",IF(AND('Master Data'!$I$28='GA55 Check & Edit'!$AP$6),'GA55 Check & Edit'!$AZ$15,BU16))","v":52300},52300,{"$f":"IF(AND('Master Data'!$E$36=\"\"),\"\",IF(AND('Master Data'!$N$26='GA55 Check & Edit'!$AO$5),ROUND(28%*BA16,0),ROUND(17%*BA16,0)))","v":14644},14644,{"$f":"IFERROR(IF(AND('Master Data'!$E$36=\"\"),\"\",ROUND('Master Data'!$E$30%*BB16,0)),\"\")","v":4184},{"$f":"'Master Data'!F47","v":1500},{"$f":"IF(AND('Master Data'!$I$28='GA55 Check & Edit'!$AP$6),\"\",IF(AND('Master Data'!$I$30='GA55 Check & Edit'!$AN$6,'Master Data'!$N$36='GA55 Check & Edit'!$AO$6),0,IF(AND('Master Data'!$I$30='GA55 Check & Edit'!$AN$6,'Master Data'!$N$36='GA55 Check & Edit'!$AO$5),'Master Data'!$J$43,IF(AND('Master Data'!$I$30='GA55 Check & Edit'!$AN$5),IF($AZ$15<18001,265,IF($AZ$15<33501,440,IF($AZ$15<54001,658,875)))))))","v":0},{"$f":"IFERROR(IF(OR('Master Data'!$I$28='GA55 Check & Edit'!$AP$6),\"\",'Master Data'!$G$43),\"\")","v":7000},{"$f":"IFERROR(IF(AND('Master Data'!$I$30='GA55 Check & Edit'!$AN$6),ROUND((E12)*0.1,0),IF(AND('Master Data'!$I$28='GA55 Check & Edit'!$AP$6),ROUND((E12+F12)*0.1,0),'Master Data'!$H$43)),\"\")","v":5230},{"$f":"BA16","v":52300},"2021-07-01",{"$f":"IFERROR(IF('Master Data'!$E$36=\"\",\"\",IF('Master Data'!$F$40=\"\",\"\",IF(AND($AZ$17>$AZ$9),\"\",DATE(YEAR(BL15),MONTH(BL15)+1,DAY(BL15))))),\"\")","v":"2021-07-01"},{"$f":"IFERROR(IF('Master Data'!$E$36=\"\",\"\",IF('Master Data'!$F$40=\"\",\"\",IF(AND($AZ$17>$AZ$9),\"\",DATE(YEAR(BM15),MONTH(BM15)+1,DAY(BM15))))),\"\")","v":"2021-07-01"},"2021-07-01","2021-07-01",null,"2021-07-01",null,52300,null,{"$f":"IF(AND('Master Data'!$I$38='GA55 Check & Edit'!AX16),'Master Data'!$I$36,AZ18)","v":52300},null,null,1500]
[0,10,10,{"$f":"IFERROR(IF(BO21=\"\",\"\",BO21),\"\")","v":"2021-12-01"},{"$f":"IFERROR(IF(D17=\"\",\"\",IF(AND(BQ21=\"\"),\"\",IF(AND('Master Data'!$I$28='GA55 Check & Edit'!$AP$6),VLOOKUP(D17,ram,13,0),VLOOKUP(D17,ram,4,0)))),\"\")","v":52300},{"$f":"IFERROR(IF(D17=\"\",\"\",IF(D17=$AX$24,\"\",IF(AND(D17=$AX$25),$BC$25,IF(AND(D17=$AX$27),\"\",IF(AND(D17=$AX$28),\"\",IF(AND('Master Data'!$I$28='GA55 Check & Edit'!$AP$5),VLOOKUP(D17,ram,7,0),\"\")))))),\"\")","v":16213},{"$f":"IFERROR(IF(D17=\"\",\"\",IF(D17=$AX$24,\"\",IF(AND(D17=$AX$25),\"\",IF(AND(D17=$AX$26),\"\",IF(AND(D17=$AX$27),\"\",IF(AND(D17=$AX$29),\"\",IF(AND('Master Data'!$I$28='GA55 Check & Edit'!$AP$6),\"\",VLOOKUP(D17,ram,8,0)))))))),\"\")","v":4707},{"$f":"IFERROR(IF(D17=\"\",\"\",IF(AND(E17=\"\"),\"\",IF(OR(D17=$AX$24,D17=$AX$25,D17=$AX$26,D17=$AX$27,D17=$AX$28,D17=$AX$29),\"\",IF(AND('Master Data'!$I$28='GA55 Check & Edit'!$AP$5),'Master Data'!$B$43,\"\")))),\"\")","v":0},{"$f":"IFERROR(IF(D17=\"\",\"\",IF(AND(E17=\"\"),\"\",IF(OR(D17=$AX$24,D17=$AX$25,D17=$AX$26,D17=$AX$27,D17=$AX$28,D17=$AX$29),\"\",IF(AND('Master Data'!$I$28='GA55 Check & Edit'!$AP$5,'Master Data'!$E$28='GA55 Check & Edit'!$AO$5),'Master Data'!$C$43,\"0\")))),\"\")","v":"0"},{"$f":"IFERROR(IF(OR('Master Data'!$E$32=$AO$6,'Master Data'!$E$32=\"\"),\"\",IF(D17=\"\",\"\",IF(AND(E17=\"\"),\"\",IF(OR(D17=$AX$24,D17=$AX$25,D17=$AX$26,D17=$AX$27,D17=$AX$28,D17=$AX$29),\"\",IF(AND('Master Data'!$I$28='GA55 Check & Edit'!$AP$6),\"\",IF(AND('Master Data'!$I$32=$AR$9),$AS$6,IF(AND('Master Data'!$I$32=$AR$10),$AS$6,IF(AND('Master Data'!$I$32=$AR$11),$AS$6,IF(AND('Master Data'!$I$32=$AR$12),$AS$6,$AS$5))))))))),\"\")","v":""},{"$f":"IFERROR(IF(D17=\"\",\"\",IF(AND(E17=\"\"),\"\",IF(OR(D17=$AX$24,D17=$AX$25,D17=$AX$26,D17=$AX$27,D17=$AX$28,D17=$AX$29),\"\",IF(AND('Master Data'!$I$28='GA55 Check & Edit'!$AP$5),'Master Data'!$E$43,\"\")))),\"\")","v":0},{"$f":"IFERROR(IF(D17=\"\",\"\",IF(AND(E17=\"\"),\"\",IF(OR(D17=$AX$24,D17=$AX$25,D17=$AX$26,D17=$AX$27,D17=$AX$28,D17=$AX$29),\"\",IF(AND('Master Data'!$I$28='GA55 Check & Edit'!$AP$6),\"\",'Master Data'!$F$43)))),\"\")","v":0},{"$f":"IFERROR(IF(D17=\"\",\"\",IF(AND('Master Data'!$I$28='GA55 Check & Edit'!$AP$6),\"\",IF(AND('Master Data'!$I$24='GA55 Check & Edit'!$AO$6),\"\",IF(AND(D17=\"Bonus\"),VLOOKUP(D17,ram,4,0),\"\")))),\"\")","v":""},{"$f":"IFERROR(IF(AND(D17=\"\"),\"\",IF(AND(D17=$AX$25,'Master Data'!$I$30='GA55 Check & Edit'!$AN$6),ROUND((E17+F17)*0.1,0),IF(AND(D17=$AX$29,'Master Data'!$I$30='GA55 Check & Edit'!$AN$6),ROUND((F17)*0.1,0),IF(AND(D17=$AX$26,'Master Data'!$I$30='GA55 Check & Edit'!$AN$6),ROUND((F17)*0.1,0),IF(AND(D17=$AX$27,'Master Data'!$I$30='GA55 Check & Edit'!$AN$6),ROUND((E17+F17)*0.1,0),IF(AND('Master Data'!$I$30='GA55 Check & Edit'!$AN$5),\"\",IF(AND('Master Data'!$I$30='GA55 Check & Edit'!$AN$6,'Master Data'!$I$28='GA55 Check & Edit'!$AP$6),ROUND((E17)*0.1,0),ROUND((E17+F17)*0.1,0)))))))),\"\")","v":6851},{"$f":"IF(D17=\"\",\"\",IF('Master Data'!$H$18='GA55 Check & Edit'!$AO$5,SUM(E17:N17),SUM(E17:M17)))","v":73220},{"$f":"IFERROR(IF(OR('Master Data'!$I$28='GA55 Check & Edit'!$AP$6,D17=\"\"),\"\",IF(AND(D17=$AX$24),\"\",IF(AND(D17=$AX$25),\"\",IF(AND(D17=$AX$26),\"\",IF(AND(D17=$AX$27),\"\",IF(AND(D17=$AX$28),\"\",IF(AND(D17=$AX$29),\"\",IF(AND(E17=\"\"),\"\",VLOOKUP(D17,ram,11,0))))))))),\"\")","v":7000},{"$f":"IFERROR(IF(AND(D17=\"\",E17=\"\"),\"\",IF(AND(D17=$AX$25,'Master Data'!$I$30='GA55 Check & Edit'!$AN$6),ROUND((E17+F17)*0.1,0),IF(AND(D17=$AX$29,'Master Data'!$I$30='GA55 Check & Edit'!$AN$6),ROUND((F17)*0.1,0),IF(AND(D17=$AX$26,'Master Data'!$I$30='GA55 Check & Edit'!$AN$6),ROUND((F17)*0.1,0),IF(AND(D17=$AX$27,'Master Data'!$I$30='GA55 Check & Edit'!$AN$6),ROUND((E17+F17)*0.1,0),IF(AND('Master Data'!$I$30='GA55 Check & Edit'!$AN$6,'Master Data'!$I$28='GA55 Check & Edit'!$AP$6),ROUND((E17)*0.1,0),IF(AND('Master Data'!$I$30='GA55 Check & Edit'!$AN$6,'Master Data'!$I$28='GA55 Check & Edit'!$AP$5),ROUND((E17+F17)*0.1,0),IF(AND('Master Data'!$I$30='GA55 Check & Edit'!$AN$5,'Master Data'!$I$28='GA55 Check & Edit'!$AP$5),VLOOKUP(D17,ram,12,0))))))))),\"\")","v":6851},{"$f":"IFERROR(IF(OR('Master Data'!$I$28='GA55 Check & Edit'!$AP$6,D17=\"\"),\"\",IF(AND(D17=$AX$24),\"\",IF(AND(D17=$AX$25),\"\",IF(AND(D17=$AX$26),\"\",IF(AND(D17=$AX$27),\"\",IF(AND(D17=$AX$28),\"\",IF(AND(D17=$AX$29),\"\",IF(AND(D17=$AX$32),\"\",IF(AND(E17=\"\"),\"\",'Master Data'!$I$43))))))))),\"\")","v":1880},{"$f":"IFERROR(IF(OR('Master Data'!$I$28='GA55 Check & Edit'!$AP$6),\"\",IF(D17=\"\",\"\",IF(E17=\"\",\"\",IF(AND(D17=$AX$24),\"\",IF(AND(D17=$AX$25),\"\",IF(AND(D17=$AX$26),\"\",IF(AND(D17=$AX$27),\"\",IF(AND(D17=$AX$28),\"\",IF(AND(D17=$AX$29),\"\",VLOOKUP(D17,ram,10,0)))))))))),\"\")","v":0},{"$f":"IFERROR(IF(OR('Master Data'!$I$28='GA55 Check & Edit'!$AP$6,D17=\"\"),\"\",IF(AND(D17=$AX$24),\"\",IF(AND(D17=$AX$25),\"\",IF(AND(D17=$AX$26),\"\",IF(AND(D17=$AX$27),\"\",IF(AND(D17=$AX$28),\"\",IF(AND(D17=$AX$29),\"\",IF(AND(E17=\"\"),\"\",'Master Data'!$K$43)))))))),\"\")","v":0},{"$f":"IFERROR(IF(OR('Master Data'!$I$28='GA55 Check & Edit'!$AP$6,D17=\"\"),\"\",IF(AND(D17=$AX$24),\"\",IF(AND(D17=$AX$25),\"\",IF(AND(D17=$AX$26),\"\",IF(AND(D17=$AX$27),\"\",IF(AND(D17=$AX$28),\"\",IF(AND(D17=$AX$29),\"\",IF(AND(E17=\"\"),\"\",'Master Data'!$L$43)))))))),\"\")","v":0},{"$f":"IFERROR(IF(OR('Master Data'!$I$28='GA55 Check & Edit'!$AP$6,D17=\"\"),\"\",IF(AND(D17=$AX$24,'Master Data'!$I$28='GA55 Check & Edit'!$AP$5,'Master Data'!$I$30='GA55 Check & Edit'!$AN$6),ROUND(M17*50%,0),IF(AND(D17=$AX$25),\"\",IF(AND(D17=$AX$26,'Master Data'!$I$28='GA55 Check & Edit'!$AP$5,'Master Data'!$I$30='GA55 Check & Edit'!$AN$6),SUM(F17-N17),IF(AND(D17=$AX$27),\"\",IF(AND(D17=$AX$28),\"\",IF(AND(D17=$AX$29,'Master Data'!$I$28='GA55 Check & Edit'!$AP$5,'Master Data'!$I$30='GA55 Check & Edit'!$AN$6),SUM(F17-N17),IF(AND(E17=\"\"),\"\",'Master Data'!$M$43)))))))),\"\")","v":0},{"$f":"IFERROR(IF(OR('Master Data'!$I$28='GA55 Check & Edit'!$AP$6,D17=\"\"),\"\",IF(AND(D17=$AX$24),\"\",IF(AND(D17=$AX$25),\"\",IF(AND(D17=$AX$26),\"\",IF(AND(D17=$AX$27),\"\",IF(AND(D17=$AX$28),\"\",IF(AND(D17=$AX$29),\"\",IF(AND(E17=\"\"),\"\",'Master Data'!$O$43)))))))),\"\")","v":0},{"$f":"IFERROR(IF(OR('Master Data'!$I$28='GA55 Check & Edit'!$AP$6,D17=\"\"),\"\",IF(AND(E17=\"\"),\"\",IF(AND('GA55 Check & Edit'!D17='GA55 Check & Edit'!$AT$17,'Master Data'!$D$18=\"Gazetted\"),500,IF(AND('GA55 Check & Edit'!D17='GA55 Check & Edit'!$AT$17,'Master Data'!$D$18=\"Non-Gazetted\"),250,\"\")))),\"\")","v":250},{"$f":"IFERROR(IF(D17=\"\",\"\",IF(AND(E17=\"\"),\"\",IF(AND(D17=$AX$24),\"\",IF(AND(D17=$AX$25),\"\",IF(AND(D17=$AX$26),\"\",IF(AND(D17=$AX$27),\"\",IF(AND(D17=$AX$28),\"\",IF(AND(D17=$AX$29),\"\",IF(OR('Master Data'!$I$28='GA55 Check & Edit'!$AP$6,D17=\"\"),\"\",$Y$7))))))))),\"\")","v":0},{"$f":"IFERROR(IF(OR('Master Data'!$I$28='GA55 Check & Edit'!$AP$6),\"\",IF(D17=\"\",\"\",IF(E17=\"\",\"\",VLOOKUP(D17,ram,9,0)))),\"\")","v":1500},{"$f":"IFERROR(IF(OR('Master Data'!$I$28='GA55 Check & Edit'!$AP$6,D17=\"\",'Master Data'!$N$38=\"\"),\"\",IF(AND(E17=\"\"),\"\",IF('GA55 Check & Edit'!D17='GA55 Check & Edit'!$AT$9,'Master Data'!$N$38,\"\"))),\"\")","v":""},{"$f":"IFERROR(IF(D17=\"\",\"\",IF(AND(O17=\"\"),\"\",IF(AND(N17=\"\"),SUM(P17:AA17),IF(AND('Master Data'!$H$18='GA55 Check & Edit'!$AO$5,'Master Data'!$I$30='GA55 Check & Edit'!$AN$6),SUM(P17:AA17)+N17,SUM(P17:AA17))))),\"0\")","v":17481},55739,null,null,null,null,null,null,null,null,null,null,null,null,null,null,null,"OCT","2021-12-01","L-10",null,"AUG","2021-08-01",8,{"$f":"IF(AND('Master Data'!H40=\"\"),\"\",'Master Data'!H40)","v":"2022-02-01"},{"$f":"IF(AND('Master Data'!$E$36=\"\"),\"\",IF(AND('Master Data'!$I$28='GA55 Check & Edit'!$AP$6),'GA55 Check & Edit'!$AZ$15,BU17))","v":52300},52300,{"$f":"IF(AND('Master Data'!$E$36=\"\"),\"\",IF(AND('Master Data'!$N$26='GA55 Check & Edit'!$AO$5),ROUND(28%*BA17,0),ROUND(17%*BA17,0)))","v":14644},14644,{"$f":"IFERROR(IF(AND('Master Data'!$E$36=\"\"),\"\",ROUND('Master Data'!$E$34%*BB17,0)),\"\")","v":4707},{"$f":"'Master Data'!G47","v":1500},{"$f":"IF(AND('Master Data'!$I$28='GA55 Check & Edit'!$AP$6),\"\",IF(AND('Master Data'!$I$30='GA55 Check & Edit'!$AN$6,'Master Data'!$N$36='GA55 Check & Edit'!$AO$6),0,IF(AND('Master Data'!$I$30='GA55 Check & Edit'!$AN$6,'Master Data'!$N$36='GA55 Check & Edit'!$AO$5),'Master Data'!$J$43,IF(AND('Master Data'!$I$30='GA55 Check & Edit'!$AN$5),IF($AZ$15<18001,265,IF($AZ$15<33501,440,IF($AZ$15<54001,658,875)))))))","v":0},{"$f":"IFERROR(IF(OR('Master Data'!$I$28='GA55 Check & Edit'!$AP$6),\"\",'Master Data'!$G$43),\"\")","v":7000},{"$f":"IFERROR(IF(AND('Master Data'!$I$30='GA55 Check & Edit'!$AN$6),ROUND((E13)*0.1,0),IF(AND('Master Data'!$I$28='GA55 Check & Edit'!$AP$6),ROUND((E13+F13)*0.1,0),'Master Data'!$H$43)),\"\")","v":5230},{"$f":"BJ16","v":52300},"2021-08-01",{"$f":"IFERROR(IF('Master Data'!$E$36=\"\",\"\",IF('Master Data'!$F$40=\"\",\"\",IF(AND($AZ$17>$AZ$9),\"\",DATE(YEAR(BL16),MONTH(BL16)+1,DAY(BL16))))),\"\")","v":"2021-08-01"},{"$f":"IFERROR(IF('Master Data'!$E$36=\"\",\"\",IF('Master Data'!$F$40=\"\",\"\",IF(AND($AZ$17>$AZ$9),\"\",DATE(YEAR(BM16),MONTH(BM16)+1,DAY(BM16))))),\"\")","v":"2021-08-01"},"2021-08-01","2021-08-01",null,"2021-08-01",null,52300,null,{"$f":"IF(AND('Master Data'!$I$38='GA55 Check & Edit'!AX17),'Master Data'!$I$36,BU16)","v":52300},null,null,1500]
[1,11,11,"2022-01-01",{"$f":"IFERROR(IF(D18=\"\",\"\",IF(AND(BQ22=\"\"),\"\",IF(AND('Master Data'!$I$28='GA55 Check & Edit'!$AP$6),VLOOKUP(D18,ram,13,0),VLOOKUP(D18,ram,4,0)))),\"\")","v":52300},{"$f":"IFERROR(IF(D18=\"\",\"\",IF(D18=$AX$24,\"\",IF(AND(D18=$AX$25),$BC$25,IF(AND(D18=$AX$27),\"\",IF(AND(D18=$AX$28),\"\",IF(AND('Master Data'!$I$28='GA55 Check & Edit'!$AP$5),VLOOKUP(D18,ram,7,0),\"\")))))),\"\")","v":16213},{"$f":"IFERROR(IF(D18=\"\",\"\",IF(D18=$AX$24,\"\",IF(AND(D18=$AX$25),\"\",IF(AND(D18=$AX$26),\"\",IF(AND(D18=$AX$27),\"\",IF(AND(D18=$AX$29),\"\",IF(AND('Master Data'!$I$28='GA55 Check & Edit'!$AP$6),\"\",VLOOKUP(D18,ram,8,0)))))))),\"\")","v":4707},{"$f":"IFERROR(IF(D18=\"\",\"\",IF(AND(E18=\"\"),\"\",IF(OR(D18=$AX$24,D18=$AX$25,D18=$AX$26,D18=$AX$27,D18=$AX$28,D18=$AX$29),\"\",IF(AND('Master Data'!$I$28='GA55 Check & Edit'!$AP$5),'Master Data'!$B$43,\"\")))),\"\")","v":0},{"$f":"IFERROR(IF(D18=\"\",\"\",IF(AND(E18=\"\"),\"\",IF(OR(D18=$AX$24,D18=$AX$25,D18=$AX$26,D18=$AX$27,D18=$AX$28,D18=$AX$29),\"\",IF(AND('Master Data'!$I$28='GA55 Check & Edit'!$AP$5,'Master Data'!$E$28='GA55 Check & Edit'!$AO$5),'Master Data'!$C$43,\"0\")))),\"\")","v":"0"},{"$f":"IFERROR(IF(OR('Master Data'!$E$32=$AO$6,'Master Data'!$E$32=\"\"),\"\",IF(D18=\"\",\"\",IF(AND(E18=\"\"),\"\",IF(OR(D18=$AX$24,D18=$AX$25,D18=$AX$26,D18=$AX$27,D18=$AX$28,D18=$AX$29),\"\",IF(AND('Master Data'!$I$28='GA55 Check & Edit'!$AP$6),\"\",IF(AND('Master Data'!$I$32=$AR$9),$AS$6,IF(AND('Master Data'!$I$32=$AR$10),$AS$6,IF(AND('Master Data'!$I$32=$AR$11),$AS$6,IF(AND('Master Data'!$I$32=$AR$12),$AS$6,$AS$5))))))))),\"\")","v":""},{"$f":"IFERROR(IF(D18=\"\",\"\",IF(AND(E18=\"\"),\"\",IF(OR(D18=$AX$24,D18=$AX$25,D18=$AX$26,D18=$AX$27,D18=$AX$28,D18=$AX$29),\"\",IF(AND('Master Data'!$I$28='GA55 Check & Edit'!$AP$5),'Master Data'!$E$43,\"\")))),\"\")","v":0},{"$f":"IFERROR(IF(D18=\"\",\"\",IF(AND(E18=\"\"),\"\",IF(OR(D18=$AX$24,D18=$AX$25,D18=$AX$26,D18=$AX$27,D18=$AX$28,D18=$AX$29),\"\",IF(AND('Master Data'!$I$28='GA55 Check & Edit'!$AP$6),\"\",'Master Data'!$F$43)))),\"\")","v":0},{"$f":"IFERROR(IF(D18=\"\",\"\",IF(AND('Master Data'!$I$28='GA55 Check & Edit'!$AP$6),\"\",IF(AND('Master Data'!$I$24='GA55 Check & Edit'!$AO$6),\"\",IF(AND(D18=\"Bonus\"),VLOOKUP(D18,ram,4,0),\"\")))),\"\")","v":""},{"$f":"IFERROR(IF(AND(D18=\"\"),\"\",IF(AND(D18=$AX$25,'Master Data'!$I$30='GA55 Check & Edit'!$AN$6),ROUND((E18+F18)*0.1,0),IF(AND(D18=$AX$29,'Master Data'!$I$30='GA55 Check & Edit'!$AN$6),ROUND((F18)*0.1,0),IF(AND(D18=$AX$26,'Master Data'!$I$30='GA55 Check & Edit'!$AN$6),ROUND((F18)*0.1,0),IF(AND(D18=$AX$27,'Master Data'!$I$30='GA55 Check & Edit'!$AN$6),ROUND((E18+F18)*0.1,0),IF(AND('Master Data'!$I$30='GA55 Check & Edit'!$AN$5),\"\",IF(AND('Master Data'!$I$30='GA55 Check & Edit'!$AN$6,'Master Data'!$I$28='GA55 Check & Edit'!$AP$6),ROUND((E18)*0.1,0),ROUND((E18+F18)*0.1,0)))))))),\"\")","v":6851},{"$f":"IF(D18=\"\",\"\",IF('Master Data'!$H$18='GA55 Check & Edit'!$AO$5,SUM(E18:N18),SUM(E18:M18)))","v":73220},{"$f":"IFERROR(IF(OR('Master Data'!$I$28='GA55 Check & Edit'!$AP$6,D18=\"\"),\"\",IF(AND(D18=$AX$24),\"\",IF(AND(D18=$AX$25),\"\",IF(AND(D18=$AX$26),\"\",IF(AND(D18=$AX$27),\"\",IF(AND(D18=$AX$28),\"\",IF(AND(D18=$AX$29),\"\",IF(AND(E18=\"\"),\"\",VLOOKUP(D18,ram,11,0))))))))),\"\")","v":7000},{"$f":"IFERROR(IF(AND(D18=\"\",E18=\"\"),\"\",IF(AND(D18=$AX$25,'Master Data'!$I$30='GA55 Check & Edit'!$AN$6),ROUND((E18+F18)*0.1,0),IF(AND(D18=$AX$29,'Master Data'!$I$30='GA55 Check & Edit'!$AN$6),ROUND((F18)*0.1,0),IF(AND(D18=$AX$26,'Master Data'!$I$30='GA55 Check & Edit'!$AN$6),ROUND((F18)*0.1,0),IF(AND(D18=$AX$27,'Master Data'!$I$30='GA55 Check & Edit'!$AN$6),ROUND((E18+F18)*0.1,0),IF(AND('Master Data'!$I$30='GA55 Check & Edit'!$AN$6,'Master Data'!$I$28='GA55 Check & Edit'!$AP$6),ROUND((E18)*0.1,0),IF(AND('Master Data'!$I$30='GA55 Check & Edit'!$AN$6,'Master Data'!$I$28='GA55 Check & Edit'!$AP$5),ROUND((E18+F18)*0.1,0),IF(AND('Master Data'!$I$30='GA55 Check & Edit'!$AN$5,'Master Data'!$I$28='GA55 Check & Edit'!$AP$5),VLOOKUP(D18,ram,12,0))))))))),\"\")","v":6851},{"$f":"IFERROR(IF(OR('Master Data'!$I$28='GA55 Check & Edit'!$AP$6,D18=\"\"),\"\",IF(AND(D18=$AX$24),\"\",IF(AND(D18=$AX$25),\"\",IF(AND(D18=$AX$26),\"\",IF(AND(D18=$AX$27),\"\",IF(AND(D18=$AX$28),\"\",IF(AND(D18=$AX$29),\"\",IF(AND(D18=$AX$32),\"\",IF(AND(E18=\"\"),\"\",'Master Data'!$I$43))))))))),\"\")","v":1880},{"$f":"IFERROR(IF(OR('Master Data'!$I$28='GA55 Check & Edit'!$AP$6),\"\",IF(D18=\"\",\"\",IF(E18=\"\",\"\",IF(AND(D18=$AX$24),\"\",IF(AND(D18=$AX$25),\"\",IF(AND(D18=$AX$26),\"\",IF(AND(D18=$AX$27),\"\",IF(AND(D18=$AX$28),\"\",IF(AND(D18=$AX$29),\"\",VLOOKUP(D18,ram,10,0)))))))))),\"\")","v":0},{"$f":"IFERROR(IF(OR('Master Data'!$I$28='GA55 Check & Edit'!$AP$6,D18=\"\"),\"\",IF(AND(D18=$AX$24),\"\",IF(AND(D18=$AX$25),\"\",IF(AND(D18=$AX$26),\"\",IF(AND(D18=$AX$27),\"\",IF(AND(D18=$AX$28),\"\",IF(AND(D18=$AX$29),\"\",IF(AND(E18=\"\"),\"\",'Master Data'!$K$43)))))))),\"\")","v":0},{"$f":"IFERROR(IF(OR('Master Data'!$I$28='GA55 Check & Edit'!$AP$6,D18=\"\"),\"\",IF(AND(D18=$AX$24),\"\",IF(AND(D18=$AX$25),\"\",IF(AND(D18=$AX$26),\"\",IF(AND(D18=$AX$27),\"\",IF(AND(D18=$AX$28),\"\",IF(AND(D18=$AX$29),\"\",IF(AND(E18=\"\"),\"\",'Master Data'!$L$43)))))))),\"\")","v":0},{"$f":"IFERROR(IF(OR('Master Data'!$I$28='GA55 Check & Edit'!$AP$6,D18=\"\"),\"\",IF(AND(D18=$AX$24,'Master Data'!$I$28='GA55 Check & Edit'!$AP$5,'Master Data'!$I$30='GA55 Check & Edit'!$AN$6),ROUND(M18*50%,0),IF(AND(D18=$AX$25),\"\",IF(AND(D18=$AX$26,'Master Data'!$I$28='GA55 Check & Edit'!$AP$5,'Master Data'!$I$30='GA55 Check & Edit'!$AN$6),SUM(F18-N18),IF(AND(D18=$AX$27),\"\",IF(AND(D18=$AX$28),\"\",IF(AND(D18=$AX$29,'Master Data'!$I$28='GA55 Check & Edit'!$AP$5,'Master Data'!$I$30='GA55 Check & Edit'!$AN$6),SUM(F18-N18),IF(AND(E18=\"\"),\"\",'Master Data'!$M$43)))))))),\"\")","v":0},{"$f":"IFERROR(IF(OR('Master Data'!$I$28='GA55 Check & Edit'!$AP$6,D18=\"\"),\"\",IF(AND(D18=$AX$24),\"\",IF(AND(D18=$AX$25),\"\",IF(AND(D18=$AX$26),\"\",IF(AND(D18=$AX$27),\"\",IF(AND(D18=$AX$28),\"\",IF(AND(D18=$AX$29),\"\",IF(AND(E18=\"\"),\"\",'Master Data'!$O$43)))))))),\"\")","v":0},{"$f":"IFERROR(IF(OR('Master Data'!$I$28='GA55 Check & Edit'!$AP$6,D18=\"\"),\"\",IF(AND(E18=\"\"),\"\",IF(AND('GA55 Check & Edit'!D18='GA55 Check & Edit'!$AT$17,'Master Data'!$D$18=\"Gazetted\"),500,IF(AND('GA55 Check & Edit'!D18='GA55 Check & Edit'!$AT$17,'Master Data'!$D$18=\"Non-Gazetted\"),250,\"\")))),\"\")","v":""},{"$f":"IFERROR(IF(D18=\"\",\"\",IF(AND(E18=\"\"),\"\",IF(AND(D18=$AX$24),\"\",IF(AND(D18=$AX$25),\"\",IF(AND(D18=$AX$26),\"\",IF(AND(D18=$AX$27),\"\",IF(AND(D18=$AX$28),\"\",IF(AND(D18=$AX$29),\"\",IF(OR('Master Data'!$I$28='GA55 Check & Edit'!$AP$6,D18=\"\"),\"\",$Y$7))))))))),\"\")","v":0},{"$f":"IFERROR(IF(OR('Master Data'!$I$28='GA55 Check & Edit'!$AP$6),\"\",IF(D18=\"\",\"\",IF(E18=\"\",\"\",VLOOKUP(D18,ram,9,0)))),\"\")","v":1500},{"$f":"IFERROR(IF(OR('Master Data'!$I$28='GA55 Check & Edit'!$AP$6,D18=\"\",'Master Data'!$N$38=\"\"),\"\",IF(AND(E18=\"\"),\"\",IF('GA55 Check & Edit'!D18='GA55 Check & Edit'!$AT$9,'Master Data'!$N$38,\"\"))),\"\")","v":""},{"$f":"IFERROR(IF(D18=\"\",\"\",IF(AND(O18=\"\"),\"\",IF(AND(N18=\"\"),SUM(P18:AA18),IF(AND('Master Data'!$H$18='GA55 Check & Edit'!$AO$5,'Master Data'!$I$30='GA55 Check & Edit'!$AN$6),SUM(P18:AA18)+N18,SUM(P18:AA18))))),\"0\")","v":17231},55989,null,null,null,null,null,null,null,null,null,null,null,null,null,null,null,"NOV","2022-01-01","L-11",null,"SEP","2021-09-01",9,{"$f":"IF(OR('Master Data'!I36=\"\",'Master Data'!I38=\"\"),MROUND(AZ15*1.03,100),IF('Master Data'!I38<'GA55 Check & Edit'!AX16,MROUND('Master Data'!I36*1.03,100),MROUND(AZ15*1.03,100)))","v":52300},{"$f":"IF(AND('Master Data'!$E$36=\"\"),\"\",IF(AND('Master Data'!$I$28='GA55 Check & Edit'!$AP$6),'GA55 Check & Edit'!$AZ$15,BU18))","v":52300},52300,{"$f":"IF(AND('Master Data'!$E$36=\"\"),\"\",IF(AND('Master Data'!$N$26='GA55 Check & Edit'!$AO$5),ROUND(28%*BA18,0),ROUND(17%*BA18,0)))","v":14644},14644,{"$f":"IFERROR(IF(AND('Master Data'!$E$36=\"\"),\"\",ROUND('Master Data'!$E$34%*BB18,0)),\"\")","v":4707},{"$f":"'Master Data'!H47","v":1500},{"$f":"IF(AND('Master Data'!$I$28='GA55 Check & Edit'!$AP$6),\"\",IF(AND('Master Data'!$I$30='GA55 Check & Edit'!$AN$6,'Master Data'!$N$36='GA55 Check & Edit'!$AO$6),0,IF(AND('Master Data'!$I$30='GA55 Check & Edit'!$AN$6,'Master Data'!$N$36='GA55 Check & Edit'!$AO$5),'Master Data'!$J$43,IF(AND('Master Data'!$I$30='GA55 Check & Edit'!$AN$5),IF($AZ$15<18001,265,IF($AZ$15<33501,440,IF($AZ$15<54001,658,875)))))))","v":0},{"$f":"IFERROR(IF(OR('Master Data'!$I$28='GA55 Check & Edit'!$AP$6),\"\",'Master Data'!$G$43),\"\")","v":7000},{"$f":"IFERROR(IF(AND('Master Data'!$I$30='GA55 Check & Edit'!$AN$6),ROUND((E14)*0.1,0),IF(AND('Master Data'!$I$28='GA55 Check & Edit'!$AP$6),ROUND((E14+F14)*0.1,0),'Master Data'!$H$43)),\"\")","v":5230},{"$f":"BJ17","v":52300},"2021-09-01",{"$f":"IFERROR(IF('Master Data'!$E$36=\"\",\"\",IF('Master Data'!$F$40=\"\",\"\",IF(AND($AZ$17>$AZ$9),\"\",DATE(YEAR(BL17),MONTH(BL17)+1,DAY(BL17))))),\"\")","v":"2021-09-01"},{"$f":"IFERROR(IF('Master Data'!$E$36=\"\",\"\",IF('Master Data'!$F$40=\"\",\"\",IF(AND($AZ$17>$AZ$9),\"\",DATE(YEAR(BM17),MONTH(BM17)+1,DAY(BM17))))),\"\")","v":"2021-09-01"},"2021-09-01","2021-09-01",null,"2021-09-01",null,"",null,{"$f":"IF(AND('Master Data'!$I$38='GA55 Check & Edit'!AX18),'Master Data'!$I$36,BU17)","v":52300},null,null,1500]
[0,12,12,{"$f":"IFERROR(IF(BO23=\"\",\"\",BO23),\"\")","v":"2022-02-01"},{"$f":"IFERROR(IF(D19=\"\",\"\",IF(AND(BQ23=\"\"),\"\",IF(AND('Master Data'!$I$28='GA55 Check & Edit'!$AP$6),VLOOKUP(D19,ram,13,0),VLOOKUP(D19,ram,4,0)))),\"\")","v":52300},{"$f":"IFERROR(IF(D19=\"\",\"\",IF(D19=$AX$24,\"\",IF(AND(D19=$AX$25),$BC$25,IF(AND(D19=$AX$27),\"\",IF(AND(D19=$AX$28),\"\",IF(AND('Master Data'!$I$28='GA55 Check & Edit'!$AP$5),VLOOKUP(D19,ram,7,0),\"\")))))),\"\")","v":16213},{"$f":"IFERROR(IF(D19=\"\",\"\",IF(D19=$AX$24,\"\",IF(AND(D19=$AX$25),\"\",IF(AND(D19=$AX$26),\"\",IF(AND(D19=$AX$27),\"\",IF(AND(D19=$AX$29),\"\",IF(AND('Master Data'!$I$28='GA55 Check & Edit'!$AP$6),\"\",VLOOKUP(D19,ram,8,0)))))))),\"\")","v":4707},{"$f":"IFERROR(IF(D19=\"\",\"\",IF(AND(E19=\"\"),\"\",IF(OR(D19=$AX$24,D19=$AX$25,D19=$AX$26,D19=$AX$27,D19=$AX$28,D19=$AX$29),\"\",IF(AND('Master Data'!$I$28='GA55 Check & Edit'!$AP$5),'Master Data'!$B$43,\"\")))),\"\")","v":0},{"$f":"IFERROR(IF(D19=\"\",\"\",IF(AND(E19=\"\"),\"\",IF(OR(D19=$AX$24,D19=$AX$25,D19=$AX$26,D19=$AX$27,D19=$AX$28,D19=$AX$29),\"\",IF(AND('Master Data'!$I$28='GA55 Check & Edit'!$AP$5,'Master Data'!$E$28='GA55 Check & Edit'!$AO$5),'Master Data'!$C$43,\"0\")))),\"\")","v":"0"},{"$f":"IFERROR(IF(OR('Master Data'!$E$32=$AO$6,'Master Data'!$E$32=\"\"),\"\",IF(D19=\"\",\"\",IF(AND(E19=\"\"),\"\",IF(OR(D19=$AX$24,D19=$AX$25,D19=$AX$26,D19=$AX$27,D19=$AX$28,D19=$AX$29),\"\",IF(AND('Master Data'!$I$28='GA55 Check & Edit'!$AP$6),\"\",IF(AND('Master Data'!$I$32=$AR$9),$AS$6,IF(AND('Master Data'!$I$32=$AR$10),$AS$6,IF(AND('Master Data'!$I$32=$AR$11),$AS$6,IF(AND('Master Data'!$I$32=$AR$12),$AS$6,$AS$5))))))))),\"\")","v":""},{"$f":"IFERROR(IF(D19=\"\",\"\",IF(AND(E19=\"\"),\"\",IF(OR(D19=$AX$24,D19=$AX$25,D19=$AX$26,D19=$AX$27,D19=$AX$28,D19=$AX$29),\"\",IF(AND('Master Data'!$I$28='GA55 Check & Edit'!$AP$5),'Master Data'!$E$43,\"\")))),\"\")","v":0},{"$f":"IFERROR(IF(D19=\"\",\"\",IF(AND(E19=\"\"),\"\",IF(OR(D19=$AX$24,D19=$AX$25,D19=$AX$26,D19=$AX$27,D19=$AX$28,D19=$AX$29),\"\",IF(AND('Master Data'!$I$28='GA55 Check & Edit'!$AP$6),\"\",'Master Data'!$F$43)))),\"\")","v":0},{"$f":"IFERROR(IF(D19=\"\",\"\",IF(AND('Master Data'!$I$28='GA55 Check & Edit'!$AP$6),\"\",IF(AND('Master Data'!$I$24='GA55 Check & Edit'!$AO$6),\"\",IF(AND(D19=\"Bonus\"),VLOOKUP(D19,ram,4,0),\"\")))),\"\")","v":""},{"$f":"IFERROR(IF(AND(D19=\"\"),\"\",IF(AND(D19=$AX$25,'Master Data'!$I$30='GA55 Check & Edit'!$AN$6),ROUND((E19+F19)*0.1,0),IF(AND(D19=$AX$29,'Master Data'!$I$30='GA55 Check & Edit'!$AN$6),ROUND((F19)*0.1,0),IF(AND(D19=$AX$26,'Master Data'!$I$30='GA55 Check & Edit'!$AN$6),ROUND((F19)*0.1,0),IF(AND(D19=$AX$27,'Master Data'!$I$30='GA55 Check & Edit'!$AN$6),ROUND((E19+F19)*0.1,0),IF(AND('Master Data'!$I$30='GA55 Check & Edit'!$AN$5),\"\",IF(AND('Master Data'!$I$30='GA55 Check & Edit'!$AN$6,'Master Data'!$I$28='GA55 Check & Edit'!$AP$6),ROUND((E19)*0.1,0),ROUND((E19+F19)*0.1,0)))))))),\"\")","v":6851},{"$f":"IF(D19=\"\",\"\",IF('Master Data'!$H$18='GA55 Check & Edit'!$AO$5,SUM(E19:N19),SUM(E19:M19)))","v":73220},{"$f":"IFERROR(IF(OR('Master Data'!$I$28='GA55 Check & Edit'!$AP$6,D19=\"\"),\"\",IF(AND(D19=$AX$24),\"\",IF(AND(D19=$AX$25),\"\",IF(AND(D19=$AX$26),\"\",IF(AND(D19=$AX$27),\"\",IF(AND(D19=$AX$28),\"\",IF(AND(D19=$AX$29),\"\",IF(AND(E19=\"\"),\"\",VLOOKUP(D19,ram,11,0))))))))),\"\")","v":7000},{"$f":"IFERROR(IF(AND(D19=\"\",E19=\"\"),\"\",IF(AND(D19=$AX$25,'Master Data'!$I$30='GA55 Check & Edit'!$AN$6),ROUND((E19+F19)*0.1,0),IF(AND(D19=$AX$29,'Master Data'!$I$30='GA55 Check & Edit'!$AN$6),ROUND((F19)*0.1,0),IF(AND(D19=$AX$26,'Master Data'!$I$30='GA55 Check & Edit'!$AN$6),ROUND((F19)*0.1,0),IF(AND(D19=$AX$27,'Master Data'!$I$30='GA55 Check & Edit'!$AN$6),ROUND((E19+F19)*0.1,0),IF(AND('Master Data'!$I$30='GA55 Check & Edit'!$AN$6,'Master Data'!$I$28='GA55 Check & Edit'!$AP$6),ROUND((E19)*0.1,0),IF(AND('Master Data'!$I$30='GA55 Check & Edit'!$AN$6,'Master Data'!$I$28='GA55 Check & Edit'!$AP$5),ROUND((E19+F19)*0.1,0),IF(AND('Master Data'!$I$30='GA55 Check & Edit'!$AN$5,'Master Data'!$I$28='GA55 Check & Edit'!$AP$5),VLOOKUP(D19,ram,12,0))))))))),\"\")","v":6851},{"$f":"IFERROR(IF(OR('Master Data'!$I$28='GA55 Check & Edit'!$AP$6,D19=\"\"),\"\",IF(AND(D19=$AX$24),\"\",IF(AND(D19=$AX$25),\"\",IF(AND(D19=$AX$26),\"\",IF(AND(D19=$AX$27),\"\",IF(AND(D19=$AX$28),\"\",IF(AND(D19=$AX$29),\"\",IF(AND(D19=$AX$32),\"\",IF(AND(E19=\"\"),\"\",'Master Data'!$I$43))))))))),\"\")","v":1880},{"$f":"IFERROR(IF(OR('Master Data'!$I$28='GA55 Check & Edit'!$AP$6),\"\",IF(D19=\"\",\"\",IF(E19=\"\",\"\",IF(AND(D19=$AX$24),\"\",IF(AND(D19=$AX$25),\"\",IF(AND(D19=$AX$26),\"\",IF(AND(D19=$AX$27),\"\",IF(AND(D19=$AX$28),\"\",IF(AND(D19=$AX$29),\"\",VLOOKUP(D19,ram,10,0)))))))))),\"\")","v":0},{"$f":"IFERROR(IF(OR('Master Data'!$I$28='GA55 Check & Edit'!$AP$6,D19=\"\"),\"\",IF(AND(D19=$AX$24),\"\",IF(AND(D19=$AX$25),\"\",IF(AND(D19=$AX$26),\"\",IF(AND(D19=$AX$27),\"\",IF(AND(D19=$AX$28),\"\",IF(AND(D19=$AX$29),\"\",IF(AND(E19=\"\"),\"\",'Master Data'!$K$43)))))))),\"\")","v":0},{"$f":"IFERROR(IF(OR('Master Data'!$I$28='GA55 Check & Edit'!$AP$6,D19=\"\"),\"\",IF(AND(D19=$AX$24),\"\",IF(AND(D19=$AX$25),\"\",IF(AND(D19=$AX$26),\"\",IF(AND(D19=$AX$27),\"\",IF(AND(D19=$AX$28),\"\",IF(AND(D19=$AX$29),\"\",IF(AND(E19=\"\"),\"\",'Master Data'!$L$43)))))))),\"\")","v":0},{"$f":"IFERROR(IF(OR('Master Data'!$I$28='GA55 Check & Edit'!$AP$6,D19=\"\"),\"\",IF(AND(D19=$AX$24,'Master Data'!$I$28='GA55 Check & Edit'!$AP$5,'Master Data'!$I$30='GA55 Check & Edit'!$AN$6),ROUND(M19*50%,0),IF(AND(D19=$AX$25),\"\",IF(AND(D19=$AX$26,'Master Data'!$I$28='GA55 Check & Edit'!$AP$5,'Master Data'!$I$30='GA55 Check & Edit'!$AN$6),SUM(F19-N19),IF(AND(D19=$AX$27),\"\",IF(AND(D19=$AX$28),\"\",IF(AND(D19=$AX$29,'Master Data'!$I$28='GA55 Check & Edit'!$AP$5,'Master Data'!$I$30='GA55 Check & Edit'!$AN$6),SUM(F19-N19),IF(AND(E19=\"\"),\"\",'Master Data'!$M$43)))))))),\"\")","v":0},{"$f":"IFERROR(IF(OR('Master Data'!$I$28='GA55 Check & Edit'!$AP$6,D19=\"\"),\"\",IF(AND(D19=$AX$24),\"\",IF(AND(D19=$AX$25),\"\",IF(AND(D19=$AX$26),\"\",IF(AND(D19=$AX$27),\"\",IF(AND(D19=$AX$28),\"\",IF(AND(D19=$AX$29),\"\",IF(AND(E19=\"\"),\"\",'Master Data'!$O$43)))))))),\"\")","v":0},{"$f":"IFERROR(IF(OR('Master Data'!$I$28='GA55 Check & Edit'!$AP$6,D19=\"\"),\"\",IF(AND(E19=\"\"),\"\",IF(AND('GA55 Check & Edit'!D19='GA55 Check & Edit'!$AT$17,'Master Data'!$D$18=\"Gazetted\"),500,IF(AND('GA55 Check & Edit'!D19='GA55 Check & Edit'!$AT$17,'Master Data'!$D$18=\"Non-Gazetted\"),250,\"\")))),\"\")","v":""},{"$f":"IFERROR(IF(D19=\"\",\"\",IF(AND(E19=\"\"),\"\",IF(AND(D19=$AX$24),\"\",IF(AND(D19=$AX$25),\"\",IF(AND(D19=$AX$26),\"\",IF(AND(D19=$AX$27),\"\",IF(AND(D19=$AX$28),\"\",IF(AND(D19=$AX$29),\"\",IF(OR('Master Data'!$I$28='GA55 Check & Edit'!$AP$6,D19=\"\"),\"\",$Y$7))))))))),\"\")","v":0},{"$f":"IFERROR(IF(OR('Master Data'!$I$28='GA55 Check & Edit'!$AP$6),\"\",IF(D19=\"\",\"\",IF(E19=\"\",\"\",VLOOKUP(D19,ram,9,0)))),\"\")","v":0},{"$f":"IFERROR(IF(OR('Master Data'!$I$28='GA55 Check & Edit'!$AP$6,D19=\"\",'Master Data'!$N$38=\"\"),\"\",IF(AND(E19=\"\"),\"\",IF('GA55 Check & Edit'!D19='GA55 Check & Edit'!$AT$9,'Master Data'!$N$38,\"\"))),\"\")","v":""},{"$f":"IFERROR(IF(D19=\"\",\"\",IF(AND(O19=\"\"),\"\",IF(AND(N19=\"\"),SUM(P19:AA19),IF(AND('Master Data'!$H$18='GA55 Check & Edit'!$AO$5,'Master Data'!$I$30='GA55 Check & Edit'!$AN$6),SUM(P19:AA19)+N19,SUM(P19:AA19))))),\"0\")","v":15731},57489,null,null,null,null,null,null,null,null,null,null,null,null,null,null,null,"DEC","2022-02-01","L-12",null,"OCT","2021-10-01",10,null,{"$f":"IF(AND('Master Data'!$E$36=\"\"),\"\",IF(AND('Master Data'!$I$28='GA55 Check & Edit'!$AP$6),'GA55 Check & Edit'!$AZ$15,BU19))","v":52300},{"$f":"IF(AND(AX19<$AZ$16),\"\",IF(AND(AX19>$AZ$17),\"\",BA19))","v":52300},{"$f":"IF(AND('Master Data'!$E$36=\"\"),\"\",IF(AND('Master Data'!$N$26='GA55 Check & Edit'!$AO$5),ROUND(31%*BA19,0),ROUND(17%*BA19,0)))","v":16213},{"$f":"IF(BB19=\"\",\"\",BC19)","v":16213},{"$f":"IFERROR(IF(AND('Master Data'!$E$36=\"\"),\"\",ROUND('Master Data'!$E$34%*BB19,0)),\"\")","v":4707},{"$f":"'Master Data'!I47","v":1500},{"$f":"IF(AND('Master Data'!$I$28='GA55 Check & Edit'!$AP$6),\"\",IF(AND('Master Data'!$I$30='GA55 Check & Edit'!$AN$6,'Master Data'!$N$36='GA55 Check & Edit'!$AO$6),0,IF(AND('Master Data'!$I$30='GA55 Check & Edit'!$AN$6,'Master Data'!$N$36='GA55 Check & Edit'!$AO$5),'Master Data'!$J$43,IF(AND('Master Data'!$I$30='GA55 Check & Edit'!$AN$5),IF($AZ$15<18001,265,IF($AZ$15<33501,440,IF($AZ$15<54001,658,875)))))))","v":0},{"$f":"IFERROR(IF(OR('Master Data'!$I$28='GA55 Check & Edit'!$AP$6),\"\",'Master Data'!$G$43),\"\")","v":7000},{"$f":"IFERROR(IF(AND('Master Data'!$I$30='GA55 Check & Edit'!$AN$6),ROUND((E15)*0.1,0),IF(AND('Master Data'!$I$28='GA55 Check & Edit'!$AP$6),ROUND((E15+F15)*0.1,0),'Master Data'!$H$43)),\"\")","v":5230},52300,"2021-10-01",{"$f":"IFERROR(IF('Master Data'!$E$36=\"\",\"\",IF('Master Data'!$F$40=\"\",\"\",IF(AND($AZ$17>$AZ$9),\"\",DATE(YEAR(BL18),MONTH(BL18)+1,DAY(BL18))))),\"\")","v":"2021-10-01"},{"$f":"IFERROR(IF('Master Data'!$E$36=\"\",\"\",IF('Master Data'!$F$40=\"\",\"\",IF(AND($AZ$17>$AZ$9),\"\",DATE(YEAR(BM18),MONTH(BM18)+1,DAY(BM18))))),\"\")","v":"2021-10-01"},"2021-10-01","2021-10-01",null,"2021-10-01",null,"",null,{"$f":"IF(AND('Master Data'!$I$38='GA55 Check & Edit'!AX19),'Master Data'!$I$36,BU18)","v":52300},null,null,1500]
[1,{"$f":"IF(LEN(D20)>=3,B19+1,0)","v":13},13,"Bonus",{"$f":"IFERROR(IF(D20=\"\",\"\",IF(AND(BQ24=\"\"),\"\",IF(AND('Master Data'!$I$28='GA55 Check & Edit'!$AP$6),VLOOKUP(D20,ram,13,0),VLOOKUP(D20,ram,4,0)))),\"\")","v":""},{"$f":"IFERROR(IF(D20=\"\",\"\",IF(D20=$AX$24,\"\",IF(AND(D20=$AX$25),$BC$25,IF(AND(D20=$AX$27),\"\",IF(AND(D20=$AX$28),\"\",IF(AND('Master Data'!$I$28='GA55 Check & Edit'!$AP$5),VLOOKUP(D20,ram,7,0),\"\")))))),\"\")","v":""},{"$f":"IFERROR(IF(D20=\"\",\"\",IF(D20=$AX$24,\"\",IF(AND(D20=$AX$25),\"\",IF(AND(D20=$AX$26),\"\",IF(AND(D20=$AX$27),\"\",IF(AND(D20=$AX$29),\"\",IF(AND('Master Data'!$I$28='GA55 Check & Edit'!$AP$6),\"\",VLOOKUP(D20,ram,8,0)))))))),\"\")","v":""},{"$f":"IFERROR(IF(D20=\"\",\"\",IF(AND(E20=\"\"),\"\",IF(OR(D20=$AX$24,D20=$AX$25,D20=$AX$26,D20=$AX$27,D20=$AX$28,D20=$AX$29),\"\",IF(AND('Master Data'!$I$28='GA55 Check & Edit'!$AP$5),'Master Data'!$B$43,\"\")))),\"\")","v":""},{"$f":"IFERROR(IF(D20=\"\",\"\",IF(AND(E20=\"\"),\"\",IF(OR(D20=$AX$24,D20=$AX$25,D20=$AX$26,D20=$AX$27,D20=$AX$28,D20=$AX$29),\"\",IF(AND('Master Data'!$I$28='GA55 Check & Edit'!$AP$5,'Master Data'!$E$28='GA55 Check & Edit'!$AO$5),'Master Data'!$C$43,\"0\")))),\"\")","v":""},{"$f":"IFERROR(IF(OR('Master Data'!$E$32=$AO$6,'Master Data'!$E$32=\"\"),\"\",IF(D20=\"\",\"\",IF(AND(E20=\"\"),\"\",IF(OR(D20=$AX$24,D20=$AX$25,D20=$AX$26,D20=$AX$27,D20=$AX$28,D20=$AX$29),\"\",IF(AND('Master Data'!$I$28='GA55 Check & Edit'!$AP$6),\"\",IF(AND('Master Data'!$I$32=$AR$9),$AS$6,IF(AND('Master Data'!$I$32=$AR$10),$AS$6,IF(AND('Master Data'!$I$32=$AR$11),$AS$6,IF(AND('Master Data'!$I$32=$AR$12),$AS$6,$AS$5))))))))),\"\")","v":""},{"$f":"IFERROR(IF(D20=\"\",\"\",IF(AND(E20=\"\"),\"\",IF(OR(D20=$AX$24,D20=$AX$25,D20=$AX$26,D20=$AX$27,D20=$AX$28,D20=$AX$29),\"\",IF(AND('Master Data'!$I$28='GA55 Check & Edit'!$AP$5),'Master Data'!$E$43,\"\")))),\"\")","v":""},{"$f":"IFERROR(IF(D20=\"\",\"\",IF(AND(E20=\"\"),\"\",IF(OR(D20=$AX$24,D20=$AX$25,D20=$AX$26,D20=$AX$27,D20=$AX$28,D20=$AX$29),\"\",IF(AND('Master Data'!$I$28='GA55 Check & Edit'!$AP$6),\"\",'Master Data'!$F$43)))),\"\")","v":""},{"$f":"IFERROR(IF(D20=\"\",\"\",IF(AND('Master Data'!$I$28='GA55 Check & Edit'!$AP$6),\"\",IF(AND('Master Data'!$I$24='GA55 Check & Edit'!$AO$6),\"\",IF(AND(D20=\"Bonus\"),VLOOKUP(D20,ram,4,0),\"\")))),\"\")","v":6774},{"$f":"IFERROR(IF(AND(D20=\"\"),\"\",IF(AND(D20=$AX$25,'Master Data'!$I$30='GA55 Check & Edit'!$AN$6),ROUND((E20+F20)*0.1,0),IF(AND(D20=$AX$29,'Master Data'!$I$30='GA55 Check & Edit'!$AN$6),ROUND((F20)*0.1,0),IF(AND(D20=$AX$26,'Master Data'!$I$30='GA55 Check & Edit'!$AN$6),ROUND((F20)*0.1,0),IF(AND(D20=$AX$27,'Master Data'!$I$30='GA55 Check & Edit'!$AN$6),ROUND((E20+F20)*0.1,0),IF(AND('Master Data'!$I$30='GA55 Check & Edit'!$AN$5),\"\",IF(AND('Master Data'!$I$30='GA55 Check & Edit'!$AN$6,'Master Data'!$I$28='GA55 Check & Edit'!$AP$6),ROUND((E20)*0.1,0),ROUND((E20+F20)*0.1,0)))))))),\"\")","v":""},{"$f":"IF(D20=\"\",\"\",IF('Master Data'!$H$18='GA55 Check & Edit'!$AO$5,SUM(E20:N20),SUM(E20:M20)))","v":6774},{"$f":"IFERROR(IF(OR('Master Data'!$I$28='GA55 Check & Edit'!$AP$6,D20=\"\"),\"\",IF(AND(D20=$AX$24),\"\",IF(AND(D20=$AX$25),\"\",IF(AND(D20=$AX$26),\"\",IF(AND(D20=$AX$27),\"\",IF(AND(D20=$AX$28),\"\",IF(AND(D20=$AX$29),\"\",IF(AND(E20=\"\"),\"\",VLOOKUP(D20,ram,11,0))))))))),\"\")","v":""},{"$f":"IFERROR(IF(AND(D20=\"\",E20=\"\"),\"\",IF(AND(D20=$AX$25,'Master Data'!$I$30='GA55 Check & Edit'!$AN$6),ROUND((E20+F20)*0.1,0),IF(AND(D20=$AX$29,'Master Data'!$I$30='GA55 Check & Edit'!$AN$6),ROUND((F20)*0.1,0),IF(AND(D20=$AX$26,'Master Data'!$I$30='GA55 Check & Edit'!$AN$6),ROUND((F20)*0.1,0),IF(AND(D20=$AX$27,'Master Data'!$I$30='GA55 Check & Edit'!$AN$6),ROUND((E20+F20)*0.1,0),IF(AND('Master Data'!$I$30='GA55 Check & Edit'!$AN$6,'Master Data'!$I$28='GA55 Check & Edit'!$AP$6),ROUND((E20)*0.1,0),IF(AND('Master Data'!$I$30='GA55 Check & Edit'!$AN$6,'Master Data'!$I$28='GA55 Check & Edit'!$AP$5),ROUND((E20+F20)*0.1,0),IF(AND('Master Data'!$I$30='GA55 Check & Edit'!$AN$5,'Master Data'!$I$28='GA55 Check & Edit'!$AP$5),VLOOKUP(D20,ram,12,0))))))))),\"\")","v":""},{"$f":"IFERROR(IF(OR('Master Data'!$I$28='GA55 Check & Edit'!$AP$6,D20=\"\"),\"\",IF(AND(D20=$AX$24),\"\",IF(AND(D20=$AX$25),\"\",IF(AND(D20=$AX$26),\"\",IF(AND(D20=$AX$27),\"\",IF(AND(D20=$AX$28),\"\",IF(AND(D20=$AX$29),\"\",IF(AND(D20=$AX$32),\"\",IF(AND(E20=\"\"),\"\",'Master Data'!$I$43))))))))),\"\")","v":""},{"$f":"IFERROR(IF(OR('Master Data'!$I$28='GA55 Check & Edit'!$AP$6),\"\",IF(D20=\"\",\"\",IF(E20=\"\",\"\",IF(AND(D20=$AX$24),\"\",IF(AND(D20=$AX$25),\"\",IF(AND(D20=$AX$26),\"\",IF(AND(D20=$AX$27),\"\",IF(AND(D20=$AX$28),\"\",IF(AND(D20=$AX$29),\"\",VLOOKUP(D20,ram,10,0)))))))))),\"\")","v":""},{"$f":"IFERROR(IF(OR('Master Data'!$I$28='GA55 Check & Edit'!$AP$6,D20=\"\"),\"\",IF(AND(D20=$AX$24),\"\",IF(AND(D20=$AX$25),\"\",IF(AND(D20=$AX$26),\"\",IF(AND(D20=$AX$27),\"\",IF(AND(D20=$AX$28),\"\",IF(AND(D20=$AX$29),\"\",IF(AND(E20=\"\"),\"\",'Master Data'!$K$43)))))))),\"\")","v":""},{"$f":"IFERROR(IF(OR('Master Data'!$I$28='GA55 Check & Edit'!$AP$6,D20=\"\"),\"\",IF(AND(D20=$AX$24),\"\",IF(AND(D20=$AX$25),\"\",IF(AND(D20=$AX$26),\"\",IF(AND(D20=$AX$27),\"\",IF(AND(D20=$AX$28),\"\",IF(AND(D20=$AX$29),\"\",IF(AND(E20=\"\"),\"\",'Master Data'!$L$43)))))))),\"\")","v":""},{"$f":"IFERROR(IF(OR('Master Data'!$I$28='GA55 Check & Edit'!$AP$6,D20=\"\"),\"\",IF(AND(D20=$AX$24,'Master Data'!$I$28='GA55 Check & Edit'!$AP$5,'Master Data'!$I$30='GA55 Check & Edit'!$AN$6),ROUND(M20*50%,0),IF(AND(D20=$AX$25),\"\",IF(AND(D20=$AX$26,'Master Data'!$I$28='GA55 Check & Edit'!$AP$5,'Master Data'!$I$30='GA55 Check & Edit'!$AN$6),SUM(F20-N20),IF(AND(D20=$AX$27),\"\",IF(AND(D20=$AX$28),\"\",IF(AND(D20=$AX$29,'Master Data'!$I$28='GA55 Check & Edit'!$AP$5,'Master Data'!$I$30='GA55 Check & Edit'!$AN$6),SUM(F20-N20),IF(AND(E20=\"\"),\"\",'Master Data'!$M$43)))))))),\"\")","v":3387},{"$f":"IFERROR(IF(OR('Master Data'!$I$28='GA55 Check & Edit'!$AP$6,D20=\"\"),\"\",IF(AND(D20=$AX$24),\"\",IF(AND(D20=$AX$25),\"\",IF(AND(D20=$AX$26),\"\",IF(AND(D20=$AX$27),\"\",IF(AND(D20=$AX$28),\"\",IF(AND(D20=$AX$29),\"\",IF(AND(E20=\"\"),\"\",'Master Data'!$O$43)))))))),\"\")","v":""},{"$f":"IFERROR(IF(OR('Master Data'!$I$28='GA55 Check & Edit'!$AP$6,D20=\"\"),\"\",IF(AND(E20=\"\"),\"\",IF(AND('GA55 Check & Edit'!D20='GA55 Check & Edit'!$AT$17,'Master Data'!$D$18=\"Gazetted\"),500,IF(AND('GA55 Check & Edit'!D20='GA55 Check & Edit'!$AT$17,'Master Data'!$D$18=\"Non-Gazetted\"),250,\"\")))),\"\")","v":""},{"$f":"IFERROR(IF(D20=\"\",\"\",IF(AND(E20=\"\"),\"\",IF(AND(D20=$AX$24),\"\",IF(AND(D20=$AX$25),\"\",IF(AND(D20=$AX$26),\"\",IF(AND(D20=$AX$27),\"\",IF(AND(D20=$AX$28),\"\",IF(AND(D20=$AX$29),\"\",IF(OR('Master Data'!$I$28='GA55 Check & Edit'!$AP$6,D20=\"\"),\"\",$Y$7))))))))),\"\")","v":""},null,{"$f":"IFERROR(IF(OR('Master Data'!$I$28='GA55 Check & Edit'!$AP$6,D20=\"\",'Master Data'!$N$38=\"\"),\"\",IF(AND(E20=\"\"),\"\",IF('GA55 Check & Edit'!D20='GA55 Check & Edit'!$AT$9,'Master Data'!$N$38,\"\"))),\"\")","v":""},{"$f":"IFERROR(IF(D20=\"\",\"\",IF(AND(O20=\"\"),\"\",IF(AND(N20=\"\"),SUM(P20:AA20),IF(AND('Master Data'!$H$18='GA55 Check & Edit'!$AO$5,'Master Data'!$I$30='GA55 Check & Edit'!$AN$6),SUM(P20:AA20)+N20,SUM(P20:AA20))))),\"0\")","v":3387},3387,null,null,null,null,null,null,null,null,null,null,null,null,null,null,null,null,null,"L-13",null,"NOV","2021-11-01",11,{"$f":"ROUND(17%*AZ18,0)+ROUND(AZ18*'Master Data'!E30%,0)","v":13075},{"$f":"IF(AND('Master Data'!$E$36=\"\"),\"\",IF(AND('Master Data'!$I$28='GA55 Check & Edit'!$AP$6),'GA55 Check & Edit'!$AZ$15,BU20))","v":52300},52300,{"$f":"IF(AND('Master Data'!$E$36=\"\"),\"\",IF(AND('Master Data'!$N$26='GA55 Check & Edit'!$AO$5),ROUND(31%*BA20,0),ROUND(17%*BA20,0)))","v":16213},16213,{"$f":"IFERROR(IF(AND('Master Data'!$E$36=\"\"),\"\",ROUND('Master Data'!$E$34%*BB20,0)),\"\")","v":4707},{"$f":"'Master Data'!J47","v":1500},{"$f":"IF(AND('Master Data'!$I$28='GA55 Check & Edit'!$AP$6),\"\",IF(AND('Master Data'!$I$30='GA55 Check & Edit'!$AN$6,'Master Data'!$N$36='GA55 Check & Edit'!$AO$6),0,IF(AND('Master Data'!$I$30='GA55 Check & Edit'!$AN$6,'Master Data'!$N$36='GA55 Check & Edit'!$AO$5),'Master Data'!$J$43,IF(AND('Master Data'!$I$30='GA55 Check & Edit'!$AN$5),IF($AZ$15<18001,265,IF($AZ$15<33501,440,IF($AZ$15<54001,658,875)))))))","v":0},{"$f":"IFERROR(IF(OR('Master Data'!$I$28='GA55 Check & Edit'!$AP$6),\"\",'Master Data'!$G$43),\"\")","v":7000},{"$f":"IFERROR(IF(AND('Master Data'!$I$30='GA55 Check & Edit'!$AN$6),ROUND((E16)*0.1,0),IF(AND('Master Data'!$I$28='GA55 Check & Edit'!$AP$6),ROUND((E16+F16)*0.1,0),'Master Data'!$H$43)),\"\")","v":5230},52300,"2021-11-01",{"$f":"IFERROR(IF('Master Data'!$E$36=\"\",\"\",IF('Master Data'!$F$40=\"\",\"\",IF(AND($AZ$17>$AZ$9),\"\",DATE(YEAR(BL19),MONTH(BL19)+1,DAY(BL19))))),\"\")","v":"2021-11-01"},{"$f":"IFERROR(IF('Master Data'!$E$36=\"\",\"\",IF('Master Data'!$F$40=\"\",\"\",IF(AND($AZ$17>$AZ$9),\"\",DATE(YEAR(BM19),MONTH(BM19)+1,DAY(BM19))))),\"\")","v":"2021-11-01"},"2021-11-01","2021-11-01",null,"2021-11-01",null,"",null,{"$f":"IF(AND('Master Data'!$I$38='GA55 Check & Edit'!AX20),'Master Data'!$I$36,BU19)","v":52300},null,null,1500]
[0,14,14,"PL Surrender",{"$f":"IFERROR(IF(D21=\"\",\"\",IF(AND(BQ25=\"\"),\"\",IF(AND('Master Data'!$I$28='GA55 Check & Edit'!$AP$6),VLOOKUP(D21,ram,13,0),VLOOKUP(D21,ram,4,0)))),\"\")","v":0},{"$f":"IFERROR(IF(D21=\"\",\"\",IF(D21=$AX$24,\"\",IF(AND(D21=$AX$25),$BC$25,IF(AND(D21=$AX$27),\"\",IF(AND(D21=$AX$28),\"\",IF(AND('Master Data'!$I$28='GA55 Check & Edit'!$AP$5),VLOOKUP(D21,ram,7,0),\"\")))))),\"\")","v":0},{"$f":"IFERROR(IF(D21=\"\",\"\",IF(D21=$AX$24,\"\",IF(AND(D21=$AX$25),\"\",IF(AND(D21=$AX$26),\"\",IF(AND(D21=$AX$27),\"\",IF(AND(D21=$AX$29),\"\",IF(AND('Master Data'!$I$28='GA55 Check & Edit'!$AP$6),\"\",VLOOKUP(D21,ram,8,0)))))))),\"\")","v":""},{"$f":"IFERROR(IF(D21=\"\",\"\",IF(AND(E21=\"\"),\"\",IF(OR(D21=$AX$24,D21=$AX$25,D21=$AX$26,D21=$AX$27,D21=$AX$28,D21=$AX$29),\"\",IF(AND('Master Data'!$I$28='GA55 Check & Edit'!$AP$5),'Master Data'!$B$43,\"\")))),\"\")","v":""},{"$f":"IFERROR(IF(D21=\"\",\"\",IF(AND(E21=\"\"),\"\",IF(OR(D21=$AX$24,D21=$AX$25,D21=$AX$26,D21=$AX$27,D21=$AX$28,D21=$AX$29),\"\",IF(AND('Master Data'!$I$28='GA55 Check & Edit'!$AP$5,'Master Data'!$E$28='GA55 Check & Edit'!$AO$5),'Master Data'!$C$43,\"0\")))),\"\")","v":""},{"$f":"IFERROR(IF(OR('Master Data'!$E$32=$AO$6,'Master Data'!$E$32=\"\"),\"\",IF(D21=\"\",\"\",IF(AND(E21=\"\"),\"\",IF(OR(D21=$AX$24,D21=$AX$25,D21=$AX$26,D21=$AX$27,D21=$AX$28,D21=$AX$29),\"\",IF(AND('Master Data'!$I$28='GA55 Check & Edit'!$AP$6),\"\",IF(AND('Master Data'!$I$32=$AR$9),$AS$6,IF(AND('Master Data'!$I$32=$AR$10),$AS$6,IF(AND('Master Data'!$I$32=$AR$11),$AS$6,IF(AND('Master Data'!$I$32=$AR$12),$AS$6,$AS$5))))))))),\"\")","v":""},{"$f":"IFERROR(IF(D21=\"\",\"\",IF(AND(E21=\"\"),\"\",IF(OR(D21=$AX$24,D21=$AX$25,D21=$AX$26,D21=$AX$27,D21=$AX$28,D21=$AX$29),\"\",IF(AND('Master Data'!$I$28='GA55 Check & Edit'!$AP$5),'Master Data'!$E$43,\"\")))),\"\")","v":""},{"$f":"IFERROR(IF(D21=\"\",\"\",IF(AND(E21=\"\"),\"\",IF(OR(D21=$AX$24,D21=$AX$25,D21=$AX$26,D21=$AX$27,D21=$AX$28,D21=$AX$29),\"\",IF(AND('Master Data'!$I$28='GA55 Check & Edit'!$AP$6),\"\",'Master Data'!$F$43)))),\"\")","v":""},null,{"$f":"IFERROR(IF(AND(D21=\"\"),\"\",IF(AND(D21=$AX$25,'Master Data'!$I$30='GA55 Check & Edit'!$AN$6),ROUND((E21+F21)*0.1,0),IF(AND(D21=$AX$29,'Master Data'!$I$30='GA55 Check & Edit'!$AN$6),ROUND((F21)*0.1,0),IF(AND(D21=$AX$26,'Master Data'!$I$30='GA55 Check & Edit'!$AN$6),ROUND((F21)*0.1,0),IF(AND(D21=$AX$27,'Master Data'!$I$30='GA55 Check & Edit'!$AN$6),ROUND((E21+F21)*0.1,0),IF(AND('Master Data'!$I$30='GA55 Check & Edit'!$AN$5),\"\",IF(AND('Master Data'!$I$30='GA55 Check & Edit'!$AN$6,'Master Data'!$I$28='GA55 Check & Edit'!$AP$6),ROUND((E21)*0.1,0),ROUND((E21+F21)*0.1,0)))))))),\"\")","v":0},{"$f":"IF(D21=\"\",\"\",IF('Master Data'!$H$18='GA55 Check & Edit'!$AO$5,SUM(E21:N21),SUM(E21:M21)))","v":0},{"$f":"IFERROR(IF(OR('Master Data'!$I$28='GA55 Check & Edit'!$AP$6,D21=\"\"),\"\",IF(AND(D21=$AX$24),\"\",IF(AND(D21=$AX$25),\"\",IF(AND(D21=$AX$26),\"\",IF(AND(D21=$AX$27),\"\",IF(AND(D21=$AX$28),\"\",IF(AND(D21=$AX$29),\"\",IF(AND(E21=\"\"),\"\",VLOOKUP(D21,ram,11,0))))))))),\"\")","v":""},{"$f":"IFERROR(IF(AND(D21=\"\",E21=\"\"),\"\",IF(AND(D21=$AX$25,'Master Data'!$I$30='GA55 Check & Edit'!$AN$6),ROUND((E21+F21)*0.1,0),IF(AND(D21=$AX$29,'Master Data'!$I$30='GA55 Check & Edit'!$AN$6),ROUND((F21)*0.1,0),IF(AND(D21=$AX$26,'Master Data'!$I$30='GA55 Check & Edit'!$AN$6),ROUND((F21)*0.1,0),IF(AND(D21=$AX$27,'Master Data'!$I$30='GA55 Check & Edit'!$AN$6),ROUND((E21+F21)*0.1,0),IF(AND('Master Data'!$I$30='GA55 Check & Edit'!$AN$6,'Master Data'!$I$28='GA55 Check & Edit'!$AP$6),ROUND((E21)*0.1,0),IF(AND('Master Data'!$I$30='GA55 Check & Edit'!$AN$6,'Master Data'!$I$28='GA55 Check & Edit'!$AP$5),ROUND((E21+F21)*0.1,0),IF(AND('Master Data'!$I$30='GA55 Check & Edit'!$AN$5,'Master Data'!$I$28='GA55 Check & Edit'!$AP$5),VLOOKUP(D21,ram,12,0))))))))),\"\")","v":0},{"$f":"IFERROR(IF(OR('Master Data'!$I$28='GA55 Check & Edit'!$AP$6,D21=\"\"),\"\",IF(AND(D21=$AX$24),\"\",IF(AND(D21=$AX$25),\"\",IF(AND(D21=$AX$26),\"\",IF(AND(D21=$AX$27),\"\",IF(AND(D21=$AX$28),\"\",IF(AND(D21=$AX$29),\"\",IF(AND(D21=$AX$32),\"\",IF(AND(E21=\"\"),\"\",'Master Data'!$I$43))))))))),\"\")","v":""},{"$f":"IFERROR(IF(OR('Master Data'!$I$28='GA55 Check & Edit'!$AP$6),\"\",IF(D21=\"\",\"\",IF(E21=\"\",\"\",IF(AND(D21=$AX$24),\"\",IF(AND(D21=$AX$25),\"\",IF(AND(D21=$AX$26),\"\",IF(AND(D21=$AX$27),\"\",IF(AND(D21=$AX$28),\"\",IF(AND(D21=$AX$29),\"\",VLOOKUP(D21,ram,10,0)))))))))),\"\")","v":""},{"$f":"IFERROR(IF(OR('Master Data'!$I$28='GA55 Check & Edit'!$AP$6,D21=\"\"),\"\",IF(AND(D21=$AX$24),\"\",IF(AND(D21=$AX$25),\"\",IF(AND(D21=$AX$26),\"\",IF(AND(D21=$AX$27),\"\",IF(AND(D21=$AX$28),\"\",IF(AND(D21=$AX$29),\"\",IF(AND(E21=\"\"),\"\",'Master Data'!$K$43)))))))),\"\")","v":""},{"$f":"IFERROR(IF(OR('Master Data'!$I$28='GA55 Check & Edit'!$AP$6,D21=\"\"),\"\",IF(AND(D21=$AX$24),\"\",IF(AND(D21=$AX$25),\"\",IF(AND(D21=$AX$26),\"\",IF(AND(D21=$AX$27),\"\",IF(AND(D21=$AX$28),\"\",IF(AND(D21=$AX$29),\"\",IF(AND(E21=\"\"),\"\",'Master Data'!$L$43)))))))),\"\")","v":""},{"$f":"IFERROR(IF(OR('Master Data'!$I$28='GA55 Check & Edit'!$AP$6,D21=\"\"),\"\",IF(AND(D21=$AX$24,'Master Data'!$I$28='GA55 Check & Edit'!$AP$5,'Master Data'!$I$30='GA55 Check & Edit'!$AN$6),ROUND(M21*50%,0),IF(AND(D21=$AX$25),\"\",IF(AND(D21=$AX$26,'Master Data'!$I$28='GA55 Check & Edit'!$AP$5,'Master Data'!$I$30='GA55 Check & Edit'!$AN$6),SUM(F21-N21),IF(AND(D21=$AX$27),\"\",IF(AND(D21=$AX$28),\"\",IF(AND(D21=$AX$29,'Master Data'!$I$28='GA55 Check & Edit'!$AP$5,'Master Data'!$I$30='GA55 Check & Edit'!$AN$6),SUM(F21-N21),IF(AND(E21=\"\"),\"\",'Master Data'!$M$43)))))))),\"\")","v":""},{"$f":"IFERROR(IF(OR('Master Data'!$I$28='GA55 Check & Edit'!$AP$6,D21=\"\"),\"\",IF(AND(D21=$AX$24),\"\",IF(AND(D21=$AX$25),\"\",IF(AND(D21=$AX$26),\"\",IF(AND(D21=$AX$27),\"\",IF(AND(D21=$AX$28),\"\",IF(AND(D21=$AX$29),\"\",IF(AND(E21=\"\"),\"\",'Master Data'!$O$43)))))))),\"\")","v":""},{"$f":"IFERROR(IF(OR('Master Data'!$I$28='GA55 Check & Edit'!$AP$6,D21=\"\"),\"\",IF(AND(E21=\"\"),\"\",IF(AND('GA55 Check & Edit'!D21='GA55 Check & Edit'!$AT$17,'Master Data'!$D$18=\"Gazetted\"),500,IF(AND('GA55 Check & Edit'!D21='GA55 Check & Edit'!$AT$17,'Master Data'!$D$18=\"Non-Gazetted\"),250,\"\")))),\"\")","v":""},{"$f":"IFERROR(IF(D21=\"\",\"\",IF(AND(E21=\"\"),\"\",IF(AND(D21=$AX$24),\"\",IF(AND(D21=$AX$25),\"\",IF(AND(D21=$AX$26),\"\",IF(AND(D21=$AX$27),\"\",IF(AND(D21=$AX$28),\"\",IF(AND(D21=$AX$29),\"\",IF(OR('Master Data'!$I$28='GA55 Check & Edit'!$AP$6,D21=\"\"),\"\",$Y$7))))))))),\"\")","v":""},null,{"$f":"IFERROR(IF(OR('Master Data'!$I$28='GA55 Check & Edit'!$AP$6,D21=\"\",'Master Data'!$N$38=\"\"),\"\",IF(AND(E21=\"\"),\"\",IF('GA55 Check & Edit'!D21='GA55 Check & Edit'!$AT$9,'Master Data'!$N$38,\"\"))),\"\")","v":""},{"$f":"IFERROR(IF(D21=\"\",\"\",IF(AND(O21=\"\"),\"\",IF(AND(N21=\"\"),SUM(P21:AA21),IF(AND('Master Data'!$H$18='GA55 Check & Edit'!$AO$5,'Master Data'!$I$30='GA55 Check & Edit'!$AN$6),SUM(P21:AA21)+N21,SUM(P21:AA21))))),\"0\")","v":0},0,null,null,null,null,null,null,null,null,null,null,null,null,null,null,null,null,null,"L-14",null,"DEC","2021-12-01",12,{"$f":"AZ18+AZ20","v":65375},{"$f":"IF(AND('Master Data'!$E$36=\"\"),\"\",IF(AND('Master Data'!$I$28='GA55 Check & Edit'!$AP$6),'GA55 Check & Edit'!$AZ$15,BU21))","v":52300},52300,{"$f":"IF(AND('Master Data'!$E$36=\"\"),\"\",IF(AND('Master Data'!$N$26='GA55 Check & Edit'!$AO$5),ROUND(31%*BA21,0),ROUND(17%*BA21,0)))","v":16213},16213,{"$f":"IFERROR(IF(AND('Master Data'!$E$36=\"\"),\"\",ROUND('Master Data'!$E$34%*BB21,0)),\"\")","v":4707},{"$f":"'Master Data'!K47","v":1500},{"$f":"IF(AND('Master Data'!$I$28='GA55 Check & Edit'!$AP$6),\"\",IF(AND('Master Data'!$I$30='GA55 Check & Edit'!$AN$6,'Master Data'!$N$36='GA55 Check & Edit'!$AO$6),0,IF(AND('Master Data'!$I$30='GA55 Check & Edit'!$AN$6,'Master Data'!$N$36='GA55 Check & Edit'!$AO$5),'Master Data'!$J$43,IF(AND('Master Data'!$I$30='GA55 Check & Edit'!$AN$5),IF($AZ$15<18001,265,IF($AZ$15<33501,440,IF($AZ$15<54001,658,875)))))))","v":0},{"$f":"IFERROR(IF(OR('Master Data'!$I$28='GA55 Check & Edit'!$AP$6),\"\",'Master Data'!$G$43),\"\")","v":7000},{"$f":"IFERROR(IF(AND('Master Data'!$I$30='GA55 Check & Edit'!$AN$6),ROUND((E17)*0.1,0),IF(AND('Master Data'!$I$28='GA55 Check & Edit'!$AP$6),ROUND((E17+F17)*0.1,0),'Master Data'!$H$43)),\"\")","v":5230},52300,"2021-12-01",{"$f":"IFERROR(IF('Master Data'!$E$36=\"\",\"\",IF('Master Data'!$F$40=\"\",\"\",IF(AND($AZ$17>$AZ$9),\"\",DATE(YEAR(BL20),MONTH(BL20)+1,DAY(BL20))))),\"\")","v":"2021-12-01"},{"$f":"IFERROR(IF('Master Data'!$E$36=\"\",\"\",IF('Master Data'!$F$40=\"\",\"\",IF(AND($AZ$17>$AZ$9),\"\",DATE(YEAR(BM20),MONTH(BM20)+1,DAY(BM20))))),\"\")","v":"2021-12-01"},"2021-12-01","2021-12-01",null,"2021-12-01",null,null,null,{"$f":"IF(AND('Master Data'!$I$38='GA55 Check & Edit'!AX21),'Master Data'!$I$36,BU20)","v":52300},null,null,1500]
[1,15,15,"DA Arrear ",{"$f":"IFERROR(IF(D22=\"\",\"\",IF(AND(BQ26=\"\"),\"\",IF(AND('Master Data'!$I$28='GA55 Check & Edit'!$AP$6),VLOOKUP(D22,ram,13,0),VLOOKUP(D22,ram,4,0)))),\"\")","v":""},{"$f":"IFERROR(IF(D22=\"\",\"\",IF(D22=$AX$24,\"\",IF(AND(D22=$AX$25),$BC$25,IF(AND(D22=$AX$27),\"\",IF(AND(D22=$AX$28),\"\",IF(AND('Master Data'!$I$28='GA55 Check & Edit'!$AP$5),VLOOKUP(D22,ram,7,0),\"\")))))),\"\")","v":4707},{"$f":"IFERROR(IF(D22=\"\",\"\",IF(D22=$AX$24,\"\",IF(AND(D22=$AX$25),\"\",IF(AND(D22=$AX$26),\"\",IF(AND(D22=$AX$27),\"\",IF(AND(D22=$AX$29),\"\",IF(AND('Master Data'!$I$28='GA55 Check & Edit'!$AP$6),\"\",VLOOKUP(D22,ram,8,0)))))))),\"\")","v":""},{"$f":"IFERROR(IF(D22=\"\",\"\",IF(AND(E22=\"\"),\"\",IF(OR(D22=$AX$24,D22=$AX$25,D22=$AX$26,D22=$AX$27,D22=$AX$28,D22=$AX$29),\"\",IF(AND('Master Data'!$I$28='GA55 Check & Edit'!$AP$5),'Master Data'!$B$43,\"\")))),\"\")","v":""},{"$f":"IFERROR(IF(D22=\"\",\"\",IF(AND(E22=\"\"),\"\",IF(OR(D22=$AX$24,D22=$AX$25,D22=$AX$26,D22=$AX$27,D22=$AX$28,D22=$AX$29),\"\",IF(AND('Master Data'!$I$28='GA55 Check & Edit'!$AP$5,'Master Data'!$E$28='GA55 Check & Edit'!$AO$5),'Master Data'!$C$43,\"0\")))),\"\")","v":""},{"$f":"IFERROR(IF(OR('Master Data'!$E$32=$AO$6,'Master Data'!$E$32=\"\"),\"\",IF(D22=\"\",\"\",IF(AND(E22=\"\"),\"\",IF(OR(D22=$AX$24,D22=$AX$25,D22=$AX$26,D22=$AX$27,D22=$AX$28,D22=$AX$29),\"\",IF(AND('Master Data'!$I$28='GA55 Check & Edit'!$AP$6),\"\",IF(AND('Master Data'!$I$32=$AR$9),$AS$6,IF(AND('Master Data'!$I$32=$AR$10),$AS$6,IF(AND('Master Data'!$I$32=$AR$11),$AS$6,IF(AND('Master Data'!$I$32=$AR$12),$AS$6,$AS$5))))))))),\"\")","v":""},{"$f":"IFERROR(IF(D22=\"\",\"\",IF(AND(E22=\"\"),\"\",IF(OR(D22=$AX$24,D22=$AX$25,D22=$AX$26,D22=$AX$27,D22=$AX$28,D22=$AX$29),\"\",IF(AND('Master Data'!$I$28='GA55 Check & Edit'!$AP$5),'Master Data'!$E$43,\"\")))),\"\")","v":""},{"$f":"IFERROR(IF(D22=\"\",\"\",IF(AND(E22=\"\"),\"\",IF(OR(D22=$AX$24,D22=$AX$25,D22=$AX$26,D22=$AX$27,D22=$AX$28,D22=$AX$29),\"\",IF(AND('Master Data'!$I$28='GA55 Check & Edit'!$AP$6),\"\",'Master Data'!$F$43)))),\"\")","v":""},null,{"$f":"IFERROR(IF(AND(D22=\"\"),\"\",IF(AND(D22=$AX$25,'Master Data'!$I$30='GA55 Check & Edit'!$AN$6),ROUND((E22+F22)*0.1,0),IF(AND(D22=$AX$29,'Master Data'!$I$30='GA55 Check & Edit'!$AN$6),ROUND((F22)*0.1,0),IF(AND(D22=$AX$26,'Master Data'!$I$30='GA55 Check & Edit'!$AN$6),ROUND((F22)*0.1,0),IF(AND(D22=$AX$27,'Master Data'!$I$30='GA55 Check & Edit'!$AN$6),ROUND((E22+F22)*0.1,0),IF(AND('Master Data'!$I$30='GA55 Check & Edit'!$AN$5),\"\",IF(AND('Master Data'!$I$30='GA55 Check & Edit'!$AN$6,'Master Data'!$I$28='GA55 Check & Edit'!$AP$6),ROUND((E22)*0.1,0),ROUND((E22+F22)*0.1,0)))))))),\"\")","v":471},{"$f":"IF(D22=\"\",\"\",IF('Master Data'!$H$18='GA55 Check & Edit'!$AO$5,SUM(E22:N22),SUM(E22:M22)))","v":4707},{"$f":"IFERROR(IF(OR('Master Data'!$I$28='GA55 Check & Edit'!$AP$6,D22=\"\"),\"\",IF(AND(D22=$AX$24),\"\",IF(AND(D22=$AX$25),\"\",IF(AND(D22=$AX$26),\"\",IF(AND(D22=$AX$27),\"\",IF(AND(D22=$AX$28),\"\",IF(AND(D22=$AX$29),\"\",IF(AND(E22=\"\"),\"\",VLOOKUP(D22,ram,11,0))))))))),\"\")","v":""},{"$f":"IFERROR(IF(AND(D22=\"\",E22=\"\"),\"\",IF(AND(D22=$AX$25,'Master Data'!$I$30='GA55 Check & Edit'!$AN$6),ROUND((E22+F22)*0.1,0),IF(AND(D22=$AX$29,'Master Data'!$I$30='GA55 Check & Edit'!$AN$6),ROUND((F22)*0.1,0),IF(AND(D22=$AX$26,'Master Data'!$I$30='GA55 Check & Edit'!$AN$6),ROUND((F22)*0.1,0),IF(AND(D22=$AX$27,'Master Data'!$I$30='GA55 Check & Edit'!$AN$6),ROUND((E22+F22)*0.1,0),IF(AND('Master Data'!$I$30='GA55 Check & Edit'!$AN$6,'Master Data'!$I$28='GA55 Check & Edit'!$AP$6),ROUND((E22)*0.1,0),IF(AND('Master Data'!$I$30='GA55 Check & Edit'!$AN$6,'Master Data'!$I$28='GA55 Check & Edit'!$AP$5),ROUND((E22+F22)*0.1,0),IF(AND('Master Data'!$I$30='GA55 Check & Edit'!$AN$5,'Master Data'!$I$28='GA55 Check & Edit'!$AP$5),VLOOKUP(D22,ram,12,0))))))))),\"\")","v":471},{"$f":"IFERROR(IF(OR('Master Data'!$I$28='GA55 Check & Edit'!$AP$6,D22=\"\"),\"\",IF(AND(D22=$AX$24),\"\",IF(AND(D22=$AX$25),\"\",IF(AND(D22=$AX$26),\"\",IF(AND(D22=$AX$27),\"\",IF(AND(D22=$AX$28),\"\",IF(AND(D22=$AX$29),\"\",IF(AND(D22=$AX$32),\"\",IF(AND(E22=\"\"),\"\",'Master Data'!$I$43))))))))),\"\")","v":""},{"$f":"IFERROR(IF(OR('Master Data'!$I$28='GA55 Check & Edit'!$AP$6),\"\",IF(D22=\"\",\"\",IF(E22=\"\",\"\",IF(AND(D22=$AX$24),\"\",IF(AND(D22=$AX$25),\"\",IF(AND(D22=$AX$26),\"\",IF(AND(D22=$AX$27),\"\",IF(AND(D22=$AX$28),\"\",IF(AND(D22=$AX$29),\"\",VLOOKUP(D22,ram,10,0)))))))))),\"\")","v":""},{"$f":"IFERROR(IF(OR('Master Data'!$I$28='GA55 Check & Edit'!$AP$6,D22=\"\"),\"\",IF(AND(D22=$AX$24),\"\",IF(AND(D22=$AX$25),\"\",IF(AND(D22=$AX$26),\"\",IF(AND(D22=$AX$27),\"\",IF(AND(D22=$AX$28),\"\",IF(AND(D22=$AX$29),\"\",IF(AND(E22=\"\"),\"\",'Master Data'!$K$43)))))))),\"\")","v":""},{"$f":"IFERROR(IF(OR('Master Data'!$I$28='GA55 Check & Edit'!$AP$6,D22=\"\"),\"\",IF(AND(D22=$AX$24),\"\",IF(AND(D22=$AX$25),\"\",IF(AND(D22=$AX$26),\"\",IF(AND(D22=$AX$27),\"\",IF(AND(D22=$AX$28),\"\",IF(AND(D22=$AX$29),\"\",IF(AND(E22=\"\"),\"\",'Master Data'!$L$43)))))))),\"\")","v":""},{"$f":"IFERROR(IF(OR('Master Data'!$I$28='GA55 Check & Edit'!$AP$6,D22=\"\"),\"\",IF(AND(D22=$AX$24,'Master Data'!$I$28='GA55 Check & Edit'!$AP$5,'Master Data'!$I$30='GA55 Check & Edit'!$AN$6),ROUND(M22*50%,0),IF(AND(D22=$AX$25),\"\",IF(AND(D22=$AX$26,'Master Data'!$I$28='GA55 Check & Edit'!$AP$5,'Master Data'!$I$30='GA55 Check & Edit'!$AN$6),SUM(F22-N22),IF(AND(D22=$AX$27),\"\",IF(AND(D22=$AX$28),\"\",IF(AND(D22=$AX$29,'Master Data'!$I$28='GA55 Check & Edit'!$AP$5,'Master Data'!$I$30='GA55 Check & Edit'!$AN$6),SUM(F22-N22),IF(AND(E22=\"\"),\"\",'Master Data'!$M$43)))))))),\"\")","v":4236},{"$f":"IFERROR(IF(OR('Master Data'!$I$28='GA55 Check & Edit'!$AP$6,D22=\"\"),\"\",IF(AND(D22=$AX$24),\"\",IF(AND(D22=$AX$25),\"\",IF(AND(D22=$AX$26),\"\",IF(AND(D22=$AX$27),\"\",IF(AND(D22=$AX$28),\"\",IF(AND(D22=$AX$29),\"\",IF(AND(E22=\"\"),\"\",'Master Data'!$O$43)))))))),\"\")","v":""},{"$f":"IFERROR(IF(OR('Master Data'!$I$28='GA55 Check & Edit'!$AP$6,D22=\"\"),\"\",IF(AND(E22=\"\"),\"\",IF(AND('GA55 Check & Edit'!D22='GA55 Check & Edit'!$AT$17,'Master Data'!$D$18=\"Gazetted\"),500,IF(AND('GA55 Check & Edit'!D22='GA55 Check & Edit'!$AT$17,'Master Data'!$D$18=\"Non-Gazetted\"),250,\"\")))),\"\")","v":""},{"$f":"IFERROR(IF(D22=\"\",\"\",IF(AND(E22=\"\"),\"\",IF(AND(D22=$AX$24),\"\",IF(AND(D22=$AX$25),\"\",IF(AND(D22=$AX$26),\"\",IF(AND(D22=$AX$27),\"\",IF(AND(D22=$AX$28),\"\",IF(AND(D22=$AX$29),\"\",IF(OR('Master Data'!$I$28='GA55 Check & Edit'!$AP$6,D22=\"\"),\"\",$Y$7))))))))),\"\")","v":""},null,{"$f":"IFERROR(IF(OR('Master Data'!$I$28='GA55 Check & Edit'!$AP$6,D22=\"\",'Master Data'!$N$38=\"\"),\"\",IF(AND(E22=\"\"),\"\",IF('GA55 Check & Edit'!D22='GA55 Check & Edit'!$AT$9,'Master Data'!$N$38,\"\"))),\"\")","v":""},{"$f":"IFERROR(IF(D22=\"\",\"\",IF(AND(O22=\"\"),\"\",IF(AND(N22=\"\"),SUM(P22:AA22),IF(AND('Master Data'!$H$18='GA55 Check & Edit'!$AO$5,'Master Data'!$I$30='GA55 Check & Edit'!$AN$6),SUM(P22:AA22)+N22,SUM(P22:AA22))))),\"0\")","v":4707},0,null,null,null,null,null,null,null,null,null,null,null,null,null,null,null,null,null,"L-15",null,"JAN","2022-01-01",1,null,{"$f":"IF(AND('Master Data'!$E$36=\"\"),\"\",IF(AND('Master Data'!$I$28='GA55 Check & Edit'!$AP$6),'GA55 Check & Edit'!$AZ$15,BU22))","v":52300},52300,{"$f":"IF(AND('Master Data'!$E$36=\"\"),\"\",IF(AND('Master Data'!$N$26='GA55 Check & Edit'!$AO$5),ROUND(31%*BA22,0),ROUND(17%*BA22,0)))","v":16213},16213,{"$f":"IFERROR(IF(AND('Master Data'!$E$36=\"\"),\"\",ROUND('Master Data'!$E$34%*BB22,0)),\"\")","v":4707},{"$f":"'Master Data'!L47","v":1500},{"$f":"IF(AND('Master Data'!$I$28='GA55 Check & Edit'!$AP$6),\"\",IF(AND('Master Data'!$I$30='GA55 Check & Edit'!$AN$6,'Master Data'!$N$36='GA55 Check & Edit'!$AO$6),0,IF(AND('Master Data'!$I$30='GA55 Check & Edit'!$AN$6,'Master Data'!$N$36='GA55 Check & Edit'!$AO$5),'Master Data'!$J$43,IF(AND('Master Data'!$I$30='GA55 Check & Edit'!$AN$5),IF($AZ$15<18001,265,IF($AZ$15<33501,440,IF($AZ$15<54001,658,875)))))))","v":0},{"$f":"IFERROR(IF(OR('Master Data'!$I$28='GA55 Check & Edit'!$AP$6),\"\",'Master Data'!$G$43),\"\")","v":7000},{"$f":"IFERROR(IF(AND('Master Data'!$I$30='GA55 Check & Edit'!$AN$6),ROUND((E18)*0.1,0),IF(AND('Master Data'!$I$28='GA55 Check & Edit'!$AP$6),ROUND((E18+F18)*0.1,0),'Master Data'!$H$43)),\"\")","v":5230},52300,"2022-01-01",{"$f":"IFERROR(IF('Master Data'!$E$36=\"\",\"\",IF('Master Data'!$F$40=\"\",\"\",IF(AND($AZ$17>$AZ$9),\"\",DATE(YEAR(BL21),MONTH(BL21)+1,DAY(BL21))))),\"\")","v":"2022-01-01"},{"$f":"IFERROR(IF('Master Data'!$E$36=\"\",\"\",IF('Master Data'!$F$40=\"\",\"\",IF(AND($AZ$17>$AZ$9),\"\",DATE(YEAR(BM21),MONTH(BM21)+1,DAY(BM21))))),\"\")","v":"2022-01-01"},"2022-01-01","2022-01-01",null,"2022-01-01",null,null,null,{"$f":"IF(AND('Master Data'!$I$38='GA55 Check & Edit'!AX22),'Master Data'!$I$36,BU21)","v":52300},null,null,1500]
[0,16,16,"Fixation arear",{"$f":"IFERROR(IF(D23=\"\",\"\",IF(AND(BQ27=\"\"),\"\",IF(AND('Master Data'!$I$28='GA55 Check & Edit'!$AP$6),VLOOKUP(D23,ram,13,0),VLOOKUP(D23,ram,4,0)))),\"\")","v":""},{"$f":"IFERROR(IF(D23=\"\",\"\",IF(D23=$AX$24,\"\",IF(AND(D23=$AX$25),$BC$25,IF(AND(D23=$AX$27),\"\",IF(AND(D23=$AX$28),\"\",IF(AND('Master Data'!$I$28='GA55 Check & Edit'!$AP$5),VLOOKUP(D23,ram,7,0),\"\")))))),\"\")","v":""},{"$f":"IFERROR(IF(D23=\"\",\"\",IF(D23=$AX$24,\"\",IF(AND(D23=$AX$25),\"\",IF(AND(D23=$AX$26),\"\",IF(AND(D23=$AX$27),\"\",IF(AND(D23=$AX$29),\"\",IF(AND('Master Data'!$I$28='GA55 Check & Edit'!$AP$6),\"\",VLOOKUP(D23,ram,8,0)))))))),\"\")","v":""},{"$f":"IFERROR(IF(D23=\"\",\"\",IF(AND(E23=\"\"),\"\",IF(OR(D23=$AX$24,D23=$AX$25,D23=$AX$26,D23=$AX$27,D23=$AX$28,D23=$AX$29),\"\",IF(AND('Master Data'!$I$28='GA55 Check & Edit'!$AP$5),'Master Data'!$B$43,\"\")))),\"\")","v":""},{"$f":"IFERROR(IF(D23=\"\",\"\",IF(AND(E23=\"\"),\"\",IF(OR(D23=$AX$24,D23=$AX$25,D23=$AX$26,D23=$AX$27,D23=$AX$28,D23=$AX$29),\"\",IF(AND('Master Data'!$I$28='GA55 Check & Edit'!$AP$5,'Master Data'!$E$28='GA55 Check & Edit'!$AO$5),'Master Data'!$C$43,\"0\")))),\"\")","v":""},{"$f":"IFERROR(IF(OR('Master Data'!$E$32=$AO$6,'Master Data'!$E$32=\"\"),\"\",IF(D23=\"\",\"\",IF(AND(E23=\"\"),\"\",IF(OR(D23=$AX$24,D23=$AX$25,D23=$AX$26,D23=$AX$27,D23=$AX$28,D23=$AX$29),\"\",IF(AND('Master Data'!$I$28='GA55 Check & Edit'!$AP$6),\"\",IF(AND('Master Data'!$I$32=$AR$9),$AS$6,IF(AND('Master Data'!$I$32=$AR$10),$AS$6,IF(AND('Master Data'!$I$32=$AR$11),$AS$6,IF(AND('Master Data'!$I$32=$AR$12),$AS$6,$AS$5))))))))),\"\")","v":""},{"$f":"IFERROR(IF(D23=\"\",\"\",IF(AND(E23=\"\"),\"\",IF(OR(D23=$AX$24,D23=$AX$25,D23=$AX$26,D23=$AX$27,D23=$AX$28,D23=$AX$29),\"\",IF(AND('Master Data'!$I$28='GA55 Check & Edit'!$AP$5),'Master Data'!$E$43,\"\")))),\"\")","v":""},{"$f":"IFERROR(IF(D23=\"\",\"\",IF(AND(E23=\"\"),\"\",IF(OR(D23=$AX$24,D23=$AX$25,D23=$AX$26,D23=$AX$27,D23=$AX$28,D23=$AX$29),\"\",IF(AND('Master Data'!$I$28='GA55 Check & Edit'!$AP$6),\"\",'Master Data'!$F$43)))),\"\")","v":""},null,{"$f":"IFERROR(IF(AND(D23=\"\"),\"\",IF(AND(D23=$AX$25,'Master Data'!$I$30='GA55 Check & Edit'!$AN$6),ROUND((E23+F23)*0.1,0),IF(AND(D23=$AX$29,'Master Data'!$I$30='GA55 Check & Edit'!$AN$6),ROUND((F23)*0.1,0),IF(AND(D23=$AX$26,'Master Data'!$I$30='GA55 Check & Edit'!$AN$6),ROUND((F23)*0.1,0),IF(AND(D23=$AX$27,'Master Data'!$I$30='GA55 Check & Edit'!$AN$6),ROUND((E23+F23)*0.1,0),IF(AND('Master Data'!$I$30='GA55 Check & Edit'!$AN$5),\"\",IF(AND('Master Data'!$I$30='GA55 Check & Edit'!$AN$6,'Master Data'!$I$28='GA55 Check & Edit'!$AP$6),ROUND((E23)*0.1,0),ROUND((E23+F23)*0.1,0)))))))),\"\")","v":""},{"$f":"IF(D23=\"\",\"\",IF('Master Data'!$H$18='GA55 Check & Edit'!$AO$5,SUM(E23:N23),SUM(E23:M23)))","v":0},{"$f":"IFERROR(IF(OR('Master Data'!$I$28='GA55 Check & Edit'!$AP$6,D23=\"\"),\"\",IF(AND(D23=$AX$24),\"\",IF(AND(D23=$AX$25),\"\",IF(AND(D23=$AX$26),\"\",IF(AND(D23=$AX$27),\"\",IF(AND(D23=$AX$28),\"\",IF(AND(D23=$AX$29),\"\",IF(AND(E23=\"\"),\"\",VLOOKUP(D23,ram,11,0))))))))),\"\")","v":""},{"$f":"IFERROR(IF(AND(D23=\"\",E23=\"\"),\"\",IF(AND(D23=$AX$25,'Master Data'!$I$30='GA55 Check & Edit'!$AN$6),ROUND((E23+F23)*0.1,0),IF(AND(D23=$AX$29,'Master Data'!$I$30='GA55 Check & Edit'!$AN$6),ROUND((F23)*0.1,0),IF(AND(D23=$AX$26,'Master Data'!$I$30='GA55 Check & Edit'!$AN$6),ROUND((F23)*0.1,0),IF(AND(D23=$AX$27,'Master Data'!$I$30='GA55 Check & Edit'!$AN$6),ROUND((E23+F23)*0.1,0),IF(AND('Master Data'!$I$30='GA55 Check & Edit'!$AN$6,'Master Data'!$I$28='GA55 Check & Edit'!$AP$6),ROUND((E23)*0.1,0),IF(AND('Master Data'!$I$30='GA55 Check & Edit'!$AN$6,'Master Data'!$I$28='GA55 Check & Edit'!$AP$5),ROUND((E23+F23)*0.1,0),IF(AND('Master Data'!$I$30='GA55 Check & Edit'!$AN$5,'Master Data'!$I$28='GA55 Check & Edit'!$AP$5),VLOOKUP(D23,ram,12,0))))))))),\"\")","v":""},{"$f":"IFERROR(IF(OR('Master Data'!$I$28='GA55 Check & Edit'!$AP$6,D23=\"\"),\"\",IF(AND(D23=$AX$24),\"\",IF(AND(D23=$AX$25),\"\",IF(AND(D23=$AX$26),\"\",IF(AND(D23=$AX$27),\"\",IF(AND(D23=$AX$28),\"\",IF(AND(D23=$AX$29),\"\",IF(AND(D23=$AX$32),\"\",IF(AND(E23=\"\"),\"\",'Master Data'!$I$43))))))))),\"\")","v":""},{"$f":"IFERROR(IF(OR('Master Data'!$I$28='GA55 Check & Edit'!$AP$6),\"\",IF(D23=\"\",\"\",IF(E23=\"\",\"\",IF(AND(D23=$AX$24),\"\",IF(AND(D23=$AX$25),\"\",IF(AND(D23=$AX$26),\"\",IF(AND(D23=$AX$27),\"\",IF(AND(D23=$AX$28),\"\",IF(AND(D23=$AX$29),\"\",VLOOKUP(D23,ram,10,0)))))))))),\"\")","v":""},{"$f":"IFERROR(IF(OR('Master Data'!$I$28='GA55 Check & Edit'!$AP$6,D23=\"\"),\"\",IF(AND(D23=$AX$24),\"\",IF(AND(D23=$AX$25),\"\",IF(AND(D23=$AX$26),\"\",IF(AND(D23=$AX$27),\"\",IF(AND(D23=$AX$28),\"\",IF(AND(D23=$AX$29),\"\",IF(AND(E23=\"\"),\"\",'Master Data'!$K$43)))))))),\"\")","v":""},{"$f":"IFERROR(IF(OR('Master Data'!$I$28='GA55 Check & Edit'!$AP$6,D23=\"\"),\"\",IF(AND(D23=$AX$24),\"\",IF(AND(D23=$AX$25),\"\",IF(AND(D23=$AX$26),\"\",IF(AND(D23=$AX$27),\"\",IF(AND(D23=$AX$28),\"\",IF(AND(D23=$AX$29),\"\",IF(AND(E23=\"\"),\"\",'Master Data'!$L$43)))))))),\"\")","v":""},{"$f":"IFERROR(IF(OR('Master Data'!$I$28='GA55 Check & Edit'!$AP$6,D23=\"\"),\"\",IF(AND(D23=$AX$24,'Master Data'!$I$28='GA55 Check & Edit'!$AP$5,'Master Data'!$I$30='GA55 Check & Edit'!$AN$6),ROUND(M23*50%,0),IF(AND(D23=$AX$25),\"\",IF(AND(D23=$AX$26,'Master Data'!$I$28='GA55 Check & Edit'!$AP$5,'Master Data'!$I$30='GA55 Check & Edit'!$AN$6),SUM(F23-N23),IF(AND(D23=$AX$27),\"\",IF(AND(D23=$AX$28),\"\",IF(AND(D23=$AX$29,'Master Data'!$I$28='GA55 Check & Edit'!$AP$5,'Master Data'!$I$30='GA55 Check & Edit'!$AN$6),SUM(F23-N23),IF(AND(E23=\"\"),\"\",'Master Data'!$M$43)))))))),\"\")","v":""},{"$f":"IFERROR(IF(OR('Master Data'!$I$28='GA55 Check & Edit'!$AP$6,D23=\"\"),\"\",IF(AND(D23=$AX$24),\"\",IF(AND(D23=$AX$25),\"\",IF(AND(D23=$AX$26),\"\",IF(AND(D23=$AX$27),\"\",IF(AND(D23=$AX$28),\"\",IF(AND(D23=$AX$29),\"\",IF(AND(E23=\"\"),\"\",'Master Data'!$O$43)))))))),\"\")","v":""},{"$f":"IFERROR(IF(OR('Master Data'!$I$28='GA55 Check & Edit'!$AP$6,D23=\"\"),\"\",IF(AND(E23=\"\"),\"\",IF(AND('GA55 Check & Edit'!D23='GA55 Check & Edit'!$AT$17,'Master Data'!$D$18=\"Gazetted\"),500,IF(AND('GA55 Check & Edit'!D23='GA55 Check & Edit'!$AT$17,'Master Data'!$D$18=\"Non-Gazetted\"),250,\"\")))),\"\")","v":""},{"$f":"IFERROR(IF(D23=\"\",\"\",IF(AND(E23=\"\"),\"\",IF(AND(D23=$AX$24),\"\",IF(AND(D23=$AX$25),\"\",IF(AND(D23=$AX$26),\"\",IF(AND(D23=$AX$27),\"\",IF(AND(D23=$AX$28),\"\",IF(AND(D23=$AX$29),\"\",IF(OR('Master Data'!$I$28='GA55 Check & Edit'!$AP$6,D23=\"\"),\"\",$Y$7))))))))),\"\")","v":""},null,{"$f":"IFERROR(IF(OR('Master Data'!$I$28='GA55 Check & Edit'!$AP$6,D23=\"\",'Master Data'!$N$38=\"\"),\"\",IF(AND(E23=\"\"),\"\",IF('GA55 Check & Edit'!D23='GA55 Check & Edit'!$AT$9,'Master Data'!$N$38,\"\"))),\"\")","v":""},{"$f":"IFERROR(IF(D23=\"\",\"\",IF(AND(O23=\"\"),\"\",IF(AND(N23=\"\"),SUM(P23:AA23),IF(AND('Master Data'!$H$18='GA55 Check & Edit'!$AO$5,'Master Data'!$I$30='GA55 Check & Edit'!$AN$6),SUM(P23:AA23)+N23,SUM(P23:AA23))))),\"0\")","v":0},0,null,null,null,null,null,null,null,null,null,null,null,null,null,null,{"$f":"IF('Master Data'!I38<'GA55 Check & Edit'!AX16,MROUND('Master Data'!I36*1.03,100),MROUND(AZ15*1.03,100))","v":0},null,null,"L-16",null,"FEB","2022-02-01",2,null,{"$f":"IF(AND('Master Data'!$E$36=\"\"),\"\",IF(AND('Master Data'!$I$28='GA55 Check & Edit'!$AP$6),'GA55 Check & Edit'!$AZ$15,BU23))","v":52300},52300,{"$f":"IF(AND('Master Data'!$E$36=\"\"),\"\",IF(AND('Master Data'!$N$26='GA55 Check & Edit'!$AO$5),ROUND(31%*BA23,0),ROUND(17%*BA23,0)))","v":16213},{"$f":"IF(BB23=\"\",\"\",BC23)","v":16213},{"$f":"IFERROR(IF(AND('Master Data'!$E$36=\"\"),\"\",ROUND('Master Data'!$E$34%*BB23,0)),\"\")","v":4707},{"$f":"'Master Data'!M47","v":0},{"$f":"IF(AND('Master Data'!$I$28='GA55 Check & Edit'!$AP$6),\"\",IF(AND('Master Data'!$I$30='GA55 Check & Edit'!$AN$6,'Master Data'!$N$36='GA55 Check & Edit'!$AO$6),0,IF(AND('Master Data'!$I$30='GA55 Check & Edit'!$AN$6,'Master Data'!$N$36='GA55 Check & Edit'!$AO$5),'Master Data'!$J$43,IF(AND('Master Data'!$I$30='GA55 Check & Edit'!$AN$5),IF($AZ$15<18001,265,IF($AZ$15<33501,440,IF($AZ$15<54001,658,875)))))))","v":0},{"$f":"IFERROR(IF(OR('Master Data'!$I$28='GA55 Check & Edit'!$AP$6),\"\",'Master Data'!$G$43),\"\")","v":7000},{"$f":"IFERROR(IF(AND('Master Data'!$I$30='GA55 Check & Edit'!$AN$6),ROUND((E19)*0.1,0),IF(AND('Master Data'!$I$28='GA55 Check & Edit'!$AP$6),ROUND((E19+F19)*0.1,0),'Master Data'!$H$43)),\"\")","v":5230},52300,"2022-02-01",{"$f":"IFERROR(IF('Master Data'!$E$36=\"\",\"\",IF('Master Data'!$F$40=\"\",\"\",IF(AND($AZ$17>$AZ$9),\"\",DATE(YEAR(BL22),MONTH(BL22)+1,DAY(BL22))))),\"\")","v":"2022-02-01"},{"$f":"IFERROR(IF('Master Data'!$E$36=\"\",\"\",IF('Master Data'!$F$40=\"\",\"\",IF(AND($AZ$17>$AZ$9),\"\",DATE(YEAR(BM22),MONTH(BM22)+1,DAY(BM22))))),\"\")","v":"2022-02-01"},"2022-02-01","2022-02-01",null,"2022-02-01",null,null,null,{"$f":"IF(AND('Master Data'!$I$38='GA55 Check & Edit'!AX23),'Master Data'!$I$36,BU22)","v":52300},null,null,{"$f":"IF(BB23=\"\",0,BF23)","v":0}]
[1,17,17,"HRA Arrear",{"$f":"IFERROR(IF(D24=\"\",\"\",IF(AND(BQ28=\"\"),\"\",IF(AND('Master Data'!$I$28='GA55 Check & Edit'!$AP$6),VLOOKUP(D24,ram,13,0),VLOOKUP(D24,ram,4,0)))),\"\")","v":""},{"$f":"IFERROR(IF(D24=\"\",\"\",IF(D24=$AX$24,\"\",IF(AND(D24=$AX$25),$BC$25,IF(AND(D24=$AX$27),\"\",IF(AND(D24=$AX$28),\"\",IF(AND('Master Data'!$I$28='GA55 Check & Edit'!$AP$5),VLOOKUP(D24,ram,7,0),\"\")))))),\"\")","v":""},{"$f":"IFERROR(IF(D24=\"\",\"\",IF(D24=$AX$24,\"\",IF(AND(D24=$AX$25),\"\",IF(AND(D24=$AX$26),\"\",IF(AND(D24=$AX$27),\"\",IF(AND(D24=$AX$29),\"\",IF(AND('Master Data'!$I$28='GA55 Check & Edit'!$AP$6),\"\",VLOOKUP(D24,ram,8,0)))))))),\"\")","v":523},{"$f":"IFERROR(IF(D24=\"\",\"\",IF(AND(E24=\"\"),\"\",IF(OR(D24=$AX$24,D24=$AX$25,D24=$AX$26,D24=$AX$27,D24=$AX$28,D24=$AX$29),\"\",IF(AND('Master Data'!$I$28='GA55 Check & Edit'!$AP$5),'Master Data'!$B$43,\"\")))),\"\")","v":""},{"$f":"IFERROR(IF(D24=\"\",\"\",IF(AND(E24=\"\"),\"\",IF(OR(D24=$AX$24,D24=$AX$25,D24=$AX$26,D24=$AX$27,D24=$AX$28,D24=$AX$29),\"\",IF(AND('Master Data'!$I$28='GA55 Check & Edit'!$AP$5,'Master Data'!$E$28='GA55 Check & Edit'!$AO$5),'Master Data'!$C$43,\"0\")))),\"\")","v":""},{"$f":"IFERROR(IF(OR('Master Data'!$E$32=$AO$6,'Master Data'!$E$32=\"\"),\"\",IF(D24=\"\",\"\",IF(AND(E24=\"\"),\"\",IF(OR(D24=$AX$24,D24=$AX$25,D24=$AX$26,D24=$AX$27,D24=$AX$28,D24=$AX$29),\"\",IF(AND('Master Data'!$I$28='GA55 Check & Edit'!$AP$6),\"\",IF(AND('Master Data'!$I$32=$AR$9),$AS$6,IF(AND('Master Data'!$I$32=$AR$10),$AS$6,IF(AND('Master Data'!$I$32=$AR$11),$AS$6,IF(AND('Master Data'!$I$32=$AR$12),$AS$6,$AS$5))))))))),\"\")","v":""},{"$f":"IFERROR(IF(D24=\"\",\"\",IF(AND(E24=\"\"),\"\",IF(OR(D24=$AX$24,D24=$AX$25,D24=$AX$26,D24=$AX$27,D24=$AX$28,D24=$AX$29),\"\",IF(AND('Master Data'!$I$28='GA55 Check & Edit'!$AP$5),'Master Data'!$E$43,\"\")))),\"\")","v":""},{"$f":"IFERROR(IF(D24=\"\",\"\",IF(AND(E24=\"\"),\"\",IF(OR(D24=$AX$24,D24=$AX$25,D24=$AX$26,D24=$AX$27,D24=$AX$28,D24=$AX$29),\"\",IF(AND('Master Data'!$I$28='GA55 Check & Edit'!$AP$6),\"\",'Master Data'!$F$43)))),\"\")","v":""},null,{"$f":"IFERROR(IF(AND(D24=\"\"),\"\",IF(AND(D24=$AX$25,'Master Data'!$I$30='GA55 Check & Edit'!$AN$6),ROUND((E24+F24)*0.1,0),IF(AND(D24=$AX$29,'Master Data'!$I$30='GA55 Check & Edit'!$AN$6),ROUND((F24)*0.1,0),IF(AND(D24=$AX$26,'Master Data'!$I$30='GA55 Check & Edit'!$AN$6),ROUND((F24)*0.1,0),IF(AND(D24=$AX$27,'Master Data'!$I$30='GA55 Check & Edit'!$AN$6),ROUND((E24+F24)*0.1,0),IF(AND('Master Data'!$I$30='GA55 Check & Edit'!$AN$5),\"\",IF(AND('Master Data'!$I$30='GA55 Check & Edit'!$AN$6,'Master Data'!$I$28='GA55 Check & Edit'!$AP$6),ROUND((E24)*0.1,0),ROUND((E24+F24)*0.1,0)))))))),\"\")","v":""},{"$f":"IF(D24=\"\",\"\",IF('Master Data'!$H$18='GA55 Check & Edit'!$AO$5,SUM(E24:N24),SUM(E24:M24)))","v":523},{"$f":"IFERROR(IF(OR('Master Data'!$I$28='GA55 Check & Edit'!$AP$6,D24=\"\"),\"\",IF(AND(D24=$AX$24),\"\",IF(AND(D24=$AX$25),\"\",IF(AND(D24=$AX$26),\"\",IF(AND(D24=$AX$27),\"\",IF(AND(D24=$AX$28),\"\",IF(AND(D24=$AX$29),\"\",IF(AND(E24=\"\"),\"\",VLOOKUP(D24,ram,11,0))))))))),\"\")","v":""},{"$f":"IFERROR(IF(AND(D24=\"\",E24=\"\"),\"\",IF(AND(D24=$AX$25,'Master Data'!$I$30='GA55 Check & Edit'!$AN$6),ROUND((E24+F24)*0.1,0),IF(AND(D24=$AX$29,'Master Data'!$I$30='GA55 Check & Edit'!$AN$6),ROUND((F24)*0.1,0),IF(AND(D24=$AX$26,'Master Data'!$I$30='GA55 Check & Edit'!$AN$6),ROUND((F24)*0.1,0),IF(AND(D24=$AX$27,'Master Data'!$I$30='GA55 Check & Edit'!$AN$6),ROUND((E24+F24)*0.1,0),IF(AND('Master Data'!$I$30='GA55 Check & Edit'!$AN$6,'Master Data'!$I$28='GA55 Check & Edit'!$AP$6),ROUND((E24)*0.1,0),IF(AND('Master Data'!$I$30='GA55 Check & Edit'!$AN$6,'Master Data'!$I$28='GA55 Check & Edit'!$AP$5),ROUND((E24+F24)*0.1,0),IF(AND('Master Data'!$I$30='GA55 Check & Edit'!$AN$5,'Master Data'!$I$28='GA55 Check & Edit'!$AP$5),VLOOKUP(D24,ram,12,0))))))))),\"\")","v":""},{"$f":"IFERROR(IF(OR('Master Data'!$I$28='GA55 Check & Edit'!$AP$6,D24=\"\"),\"\",IF(AND(D24=$AX$24),\"\",IF(AND(D24=$AX$25),\"\",IF(AND(D24=$AX$26),\"\",IF(AND(D24=$AX$27),\"\",IF(AND(D24=$AX$28),\"\",IF(AND(D24=$AX$29),\"\",IF(AND(D24=$AX$32),\"\",IF(AND(E24=\"\"),\"\",'Master Data'!$I$43))))))))),\"\")","v":""},{"$f":"IFERROR(IF(OR('Master Data'!$I$28='GA55 Check & Edit'!$AP$6),\"\",IF(D24=\"\",\"\",IF(E24=\"\",\"\",IF(AND(D24=$AX$24),\"\",IF(AND(D24=$AX$25),\"\",IF(AND(D24=$AX$26),\"\",IF(AND(D24=$AX$27),\"\",IF(AND(D24=$AX$28),\"\",IF(AND(D24=$AX$29),\"\",VLOOKUP(D24,ram,10,0)))))))))),\"\")","v":""},{"$f":"IFERROR(IF(OR('Master Data'!$I$28='GA55 Check & Edit'!$AP$6,D24=\"\"),\"\",IF(AND(D24=$AX$24),\"\",IF(AND(D24=$AX$25),\"\",IF(AND(D24=$AX$26),\"\",IF(AND(D24=$AX$27),\"\",IF(AND(D24=$AX$28),\"\",IF(AND(D24=$AX$29),\"\",IF(AND(E24=\"\"),\"\",'Master Data'!$K$43)))))))),\"\")","v":""},{"$f":"IFERROR(IF(OR('Master Data'!$I$28='GA55 Check & Edit'!$AP$6,D24=\"\"),\"\",IF(AND(D24=$AX$24),\"\",IF(AND(D24=$AX$25),\"\",IF(AND(D24=$AX$26),\"\",IF(AND(D24=$AX$27),\"\",IF(AND(D24=$AX$28),\"\",IF(AND(D24=$AX$29),\"\",IF(AND(E24=\"\"),\"\",'Master Data'!$L$43)))))))),\"\")","v":""},{"$f":"IFERROR(IF(OR('Master Data'!$I$28='GA55 Check & Edit'!$AP$6,D24=\"\"),\"\",IF(AND(D24=$AX$24,'Master Data'!$I$28='GA55 Check & Edit'!$AP$5,'Master Data'!$I$30='GA55 Check & Edit'!$AN$6),ROUND(M24*50%,0),IF(AND(D24=$AX$25),\"\",IF(AND(D24=$AX$26,'Master Data'!$I$28='GA55 Check & Edit'!$AP$5,'Master Data'!$I$30='GA55 Check & Edit'!$AN$6),SUM(F24-N24),IF(AND(D24=$AX$27),\"\",IF(AND(D24=$AX$28),\"\",IF(AND(D24=$AX$29,'Master Data'!$I$28='GA55 Check & Edit'!$AP$5,'Master Data'!$I$30='GA55 Check & Edit'!$AN$6),SUM(F24-N24),IF(AND(E24=\"\"),\"\",'Master Data'!$M$43)))))))),\"\")","v":""},{"$f":"IFERROR(IF(OR('Master Data'!$I$28='GA55 Check & Edit'!$AP$6,D24=\"\"),\"\",IF(AND(D24=$AX$24),\"\",IF(AND(D24=$AX$25),\"\",IF(AND(D24=$AX$26),\"\",IF(AND(D24=$AX$27),\"\",IF(AND(D24=$AX$28),\"\",IF(AND(D24=$AX$29),\"\",IF(AND(E24=\"\"),\"\",'Master Data'!$O$43)))))))),\"\")","v":""},{"$f":"IFERROR(IF(OR('Master Data'!$I$28='GA55 Check & Edit'!$AP$6,D24=\"\"),\"\",IF(AND(E24=\"\"),\"\",IF(AND('GA55 Check & Edit'!D24='GA55 Check & Edit'!$AT$17,'Master Data'!$D$18=\"Gazetted\"),500,IF(AND('GA55 Check & Edit'!D24='GA55 Check & Edit'!$AT$17,'Master Data'!$D$18=\"Non-Gazetted\"),250,\"\")))),\"\")","v":""},{"$f":"IFERROR(IF(D24=\"\",\"\",IF(AND(E24=\"\"),\"\",IF(AND(D24=$AX$24),\"\",IF(AND(D24=$AX$25),\"\",IF(AND(D24=$AX$26),\"\",IF(AND(D24=$AX$27),\"\",IF(AND(D24=$AX$28),\"\",IF(AND(D24=$AX$29),\"\",IF(OR('Master Data'!$I$28='GA55 Check & Edit'!$AP$6,D24=\"\"),\"\",$Y$7))))))))),\"\")","v":""},null,{"$f":"IFERROR(IF(OR('Master Data'!$I$28='GA55 Check & Edit'!$AP$6,D24=\"\",'Master Data'!$N$38=\"\"),\"\",IF(AND(E24=\"\"),\"\",IF('GA55 Check & Edit'!D24='GA55 Check & Edit'!$AT$9,'Master Data'!$N$38,\"\"))),\"\")","v":""},{"$f":"IFERROR(IF(D24=\"\",\"\",IF(AND(O24=\"\"),\"\",IF(AND(N24=\"\"),SUM(P24:AA24),IF(AND('Master Data'!$H$18='GA55 Check & Edit'!$AO$5,'Master Data'!$I$30='GA55 Check & Edit'!$AN$6),SUM(P24:AA24)+N24,SUM(P24:AA24))))),\"0\")","v":0},523,null,null,null,null,null,null,null,null,null,null,null,null,null,null,null,{"$f":"MROUND('Master Data'!I36*1.03,100)","v":0},null,"L-17",null,null,{"$f":"BM24","v":"Bonus"},null,null,{"$f":"IF('Master Data'!$I$26=1,ROUND((6774/12)*1,0),IF('Master Data'!$I$26=2,ROUND((6774/12)*2,0),IF('Master Data'!$I$26=3,ROUND((6774/12)*3,0),IF('Master Data'!$I$26=4,ROUND((6774/12)*4,0),IF('Master Data'!$I$26=5,ROUND((6774/12)*5,0),IF('Master Data'!$I$26=6,ROUND((6774/12)*6,0),IF('Master Data'!$I$26=7,ROUND((6774/12)*7,0),IF('Master Data'!$I$26=8,ROUND((6774/12)*8,0),IF('Master Data'!$I$26=9,ROUND((6774/12)*9,0),IF('Master Data'!$I$26=10,ROUND((6774/12)*10,0),IF('Master Data'!$I$26=11,ROUND((6774/12)*11,0),IF('Master Data'!$I$26=12,ROUND((6774/12)*12,0),0))))))))))))","v":6774},null,null,{"$f":"IF(BC24=\"\",\"\",BC24)","v":""},null,null,null,null,{"$f":"IF(AND('Master Data'!$I$24='GA55 Check & Edit'!$AO$6),\"\",ROUND(BA24*50%,0))","v":3387},null,"2022-03-01",{"$f":"IFERROR(IF('Master Data'!$E$36=\"\",\"\",IF('Master Data'!$F$40=\"\",\"\",IF(AND($AZ$17>$AZ$9),\"\",DATE(YEAR(BL23),MONTH(BL23)+1,DAY(BL23))))),\"\")","v":"2022-03-01"},"Bonus","","Bonus",null,"",null,null,null,null,null,null,0]
[0,18,18,{"$f":"IFERROR(IF(BO29=\"\",\"\",BO29),\"\")","v":"PL Surrender Arrear"},{"$f":"IFERROR(IF(D25=\"\",\"\",IF(AND(BQ29=\"\"),\"\",IF(AND('Master Data'!$I$28='GA55 Check & Edit'!$AP$6),VLOOKUP(D25,ram,13,0),VLOOKUP(D25,ram,4,0)))),\"\")","v":""},{"$f":"IFERROR(IF(D25=\"\",\"\",IF(D25=$AX$24,\"\",IF(AND(D25=$AX$25),$BC$25,IF(AND(D25=$AX$27),\"\",IF(AND(D25=$AX$28),\"\",IF(AND('Master Data'!$I$28='GA55 Check & Edit'!$AP$5),VLOOKUP(D25,ram,7,0),\"\")))))),\"\")","v":0},{"$f":"IFERROR(IF(D25=\"\",\"\",IF(D25=$AX$24,\"\",IF(AND(D25=$AX$25),\"\",IF(AND(D25=$AX$26),\"\",IF(AND(D25=$AX$27),\"\",IF(AND(D25=$AX$29),\"\",IF(AND('Master Data'!$I$28='GA55 Check & Edit'!$AP$6),\"\",VLOOKUP(D25,ram,8,0)))))))),\"\")","v":""},{"$f":"IFERROR(IF(D25=\"\",\"\",IF(AND(E25=\"\"),\"\",IF(OR(D25=$AX$24,D25=$AX$25,D25=$AX$26,D25=$AX$27,D25=$AX$28,D25=$AX$29),\"\",IF(AND('Master Data'!$I$28='GA55 Check & Edit'!$AP$5),'Master Data'!$B$43,\"\")))),\"\")","v":""},{"$f":"IFERROR(IF(D25=\"\",\"\",IF(AND(E25=\"\"),\"\",IF(OR(D25=$AX$24,D25=$AX$25,D25=$AX$26,D25=$AX$27,D25=$AX$28,D25=$AX$29),\"\",IF(AND('Master Data'!$I$28='GA55 Check & Edit'!$AP$5,'Master Data'!$E$28='GA55 Check & Edit'!$AO$5),'Master Data'!$C$43,\"0\")))),\"\")","v":""},{"$f":"IFERROR(IF(OR('Master Data'!$E$32=$AO$6,'Master Data'!$E$32=\"\"),\"\",IF(D25=\"\",\"\",IF(AND(E25=\"\"),\"\",IF(OR(D25=$AX$24,D25=$AX$25,D25=$AX$26,D25=$AX$27,D25=$AX$28,D25=$AX$29),\"\",IF(AND('Master Data'!$I$28='GA55 Check & Edit'!$AP$6),\"\",IF(AND('Master Data'!$I$32=$AR$9),$AS$6,IF(AND('Master Data'!$I$32=$AR$10),$AS$6,IF(AND('Master Data'!$I$32=$AR$11),$AS$6,IF(AND('Master Data'!$I$32=$AR$12),$AS$6,$AS$5))))))))),\"\")","v":""},{"$f":"IFERROR(IF(D25=\"\",\"\",IF(AND(E25=\"\"),\"\",IF(OR(D25=$AX$24,D25=$AX$25,D25=$AX$26,D25=$AX$27,D25=$AX$28,D25=$AX$29),\"\",IF(AND('Master Data'!$I$28='GA55 Check & Edit'!$AP$5),'Master Data'!$E$43,\"\")))),\"\")","v":""},{"$f":"IFERROR(IF(D25=\"\",\"\",IF(AND(E25=\"\"),\"\",IF(OR(D25=$AX$24,D25=$AX$25,D25=$AX$26,D25=$AX$27,D25=$AX$28,D25=$AX$29),\"\",IF(AND('Master Data'!$I$28='GA55 Check & Edit'!$AP$6),\"\",'Master Data'!$F$43)))),\"\")","v":""},null,{"$f":"IFERROR(IF(AND(D25=\"\"),\"\",IF(AND(D25=$AX$25,'Master Data'!$I$30='GA55 Check & Edit'!$AN$6),ROUND((E25+F25)*0.1,0),IF(AND(D25=$AX$29,'Master Data'!$I$30='GA55 Check & Edit'!$AN$6),ROUND((F25)*0.1,0),IF(AND(D25=$AX$26,'Master Data'!$I$30='GA55 Check & Edit'!$AN$6),ROUND((F25)*0.1,0),IF(AND(D25=$AX$27,'Master Data'!$I$30='GA55 Check & Edit'!$AN$6),ROUND((E25+F25)*0.1,0),IF(AND('Master Data'!$I$30='GA55 Check & Edit'!$AN$5),\"\",IF(AND('Master Data'!$I$30='GA55 Check & Edit'!$AN$6,'Master Data'!$I$28='GA55 Check & Edit'!$AP$6),ROUND((E25)*0.1,0),ROUND((E25+F25)*0.1,0)))))))),\"\")","v":0},{"$f":"IF(D25=\"\",\"\",IF('Master Data'!$H$18='GA55 Check & Edit'!$AO$5,SUM(E25:N25),SUM(E25:M25)))","v":0},{"$f":"IFERROR(IF(OR('Master Data'!$I$28='GA55 Check & Edit'!$AP$6,D25=\"\"),\"\",IF(AND(D25=$AX$24),\"\",IF(AND(D25=$AX$25),\"\",IF(AND(D25=$AX$26),\"\",IF(AND(D25=$AX$27),\"\",IF(AND(D25=$AX$28),\"\",IF(AND(D25=$AX$29),\"\",IF(AND(E25=\"\"),\"\",VLOOKUP(D25,ram,11,0))))))))),\"\")","v":""},{"$f":"IFERROR(IF(AND(D25=\"\",E25=\"\"),\"\",IF(AND(D25=$AX$25,'Master Data'!$I$30='GA55 Check & Edit'!$AN$6),ROUND((E25+F25)*0.1,0),IF(AND(D25=$AX$29,'Master Data'!$I$30='GA55 Check & Edit'!$AN$6),ROUND((F25)*0.1,0),IF(AND(D25=$AX$26,'Master Data'!$I$30='GA55 Check & Edit'!$AN$6),ROUND((F25)*0.1,0),IF(AND(D25=$AX$27,'Master Data'!$I$30='GA55 Check & Edit'!$AN$6),ROUND((E25+F25)*0.1,0),IF(AND('Master Data'!$I$30='GA55 Check & Edit'!$AN$6,'Master Data'!$I$28='GA55 Check & Edit'!$AP$6),ROUND((E25)*0.1,0),IF(AND('Master Data'!$I$30='GA55 Check & Edit'!$AN$6,'Master Data'!$I$28='GA55 Check & Edit'!$AP$5),ROUND((E25+F25)*0.1,0),IF(AND('Master Data'!$I$30='GA55 Check & Edit'!$AN$5,'Master Data'!$I$28='GA55 Check & Edit'!$AP$5),VLOOKUP(D25,ram,12,0))))))))),\"\")","v":0},{"$f":"IFERROR(IF(OR('Master Data'!$I$28='GA55 Check & Edit'!$AP$6,D25=\"\"),\"\",IF(AND(D25=$AX$24),\"\",IF(AND(D25=$AX$25),\"\",IF(AND(D25=$AX$26),\"\",IF(AND(D25=$AX$27),\"\",IF(AND(D25=$AX$28),\"\",IF(AND(D25=$AX$29),\"\",IF(AND(D25=$AX$32),\"\",IF(AND(E25=\"\"),\"\",'Master Data'!$I$43))))))))),\"\")","v":""},{"$f":"IFERROR(IF(OR('Master Data'!$I$28='GA55 Check & Edit'!$AP$6),\"\",IF(D25=\"\",\"\",IF(E25=\"\",\"\",IF(AND(D25=$AX$24),\"\",IF(AND(D25=$AX$25),\"\",IF(AND(D25=$AX$26),\"\",IF(AND(D25=$AX$27),\"\",IF(AND(D25=$AX$28),\"\",IF(AND(D25=$AX$29),\"\",VLOOKUP(D25,ram,10,0)))))))))),\"\")","v":""},{"$f":"IFERROR(IF(OR('Master Data'!$I$28='GA55 Check & Edit'!$AP$6,D25=\"\"),\"\",IF(AND(D25=$AX$24),\"\",IF(AND(D25=$AX$25),\"\",IF(AND(D25=$AX$26),\"\",IF(AND(D25=$AX$27),\"\",IF(AND(D25=$AX$28),\"\",IF(AND(D25=$AX$29),\"\",IF(AND(E25=\"\"),\"\",'Master Data'!$K$43)))))))),\"\")","v":""},{"$f":"IFERROR(IF(OR('Master Data'!$I$28='GA55 Check & Edit'!$AP$6,D25=\"\"),\"\",IF(AND(D25=$AX$24),\"\",IF(AND(D25=$AX$25),\"\",IF(AND(D25=$AX$26),\"\",IF(AND(D25=$AX$27),\"\",IF(AND(D25=$AX$28),\"\",IF(AND(D25=$AX$29),\"\",IF(AND(E25=\"\"),\"\",'Master Data'!$L$43)))))))),\"\")","v":""},{"$f":"IFERROR(IF(OR('Master Data'!$I$28='GA55 Check & Edit'!$AP$6,D25=\"\"),\"\",IF(AND(D25=$AX$24,'Master Data'!$I$28='GA55 Check & Edit'!$AP$5,'Master Data'!$I$30='GA55 Check & Edit'!$AN$6),ROUND(M25*50%,0),IF(AND(D25=$AX$25),\"\",IF(AND(D25=$AX$26,'Master Data'!$I$28='GA55 Check & Edit'!$AP$5,'Master Data'!$I$30='GA55 Check & Edit'!$AN$6),SUM(F25-N25),IF(AND(D25=$AX$27),\"\",IF(AND(D25=$AX$28),\"\",IF(AND(D25=$AX$29,'Master Data'!$I$28='GA55 Check & Edit'!$AP$5,'Master Data'!$I$30='GA55 Check & Edit'!$AN$6),SUM(F25-N25),IF(AND(E25=\"\"),\"\",'Master Data'!$M$43)))))))),\"\")","v":0},{"$f":"IFERROR(IF(OR('Master Data'!$I$28='GA55 Check & Edit'!$AP$6,D25=\"\"),\"\",IF(AND(D25=$AX$24),\"\",IF(AND(D25=$AX$25),\"\",IF(AND(D25=$AX$26),\"\",IF(AND(D25=$AX$27),\"\",IF(AND(D25=$AX$28),\"\",IF(AND(D25=$AX$29),\"\",IF(AND(E25=\"\"),\"\",'Master Data'!$O$43)))))))),\"\")","v":""},{"$f":"IFERROR(IF(OR('Master Data'!$I$28='GA55 Check & Edit'!$AP$6,D25=\"\"),\"\",IF(AND(E25=\"\"),\"\",IF(AND('GA55 Check & Edit'!D25='GA55 Check & Edit'!$AT$17,'Master Data'!$D$18=\"Gazetted\"),500,IF(AND('GA55 Check & Edit'!D25='GA55 Check & Edit'!$AT$17,'Master Data'!$D$18=\"Non-Gazetted\"),250,\"\")))),\"\")","v":""},{"$f":"IFERROR(IF(D25=\"\",\"\",IF(AND(E25=\"\"),\"\",IF(AND(D25=$AX$24),\"\",IF(AND(D25=$AX$25),\"\",IF(AND(D25=$AX$26),\"\",IF(AND(D25=$AX$27),\"\",IF(AND(D25=$AX$28),\"\",IF(AND(D25=$AX$29),\"\",IF(OR('Master Data'!$I$28='GA55 Check & Edit'!$AP$6,D25=\"\"),\"\",$Y$7))))))))),\"\")","v":""},null,{"$f":"IFERROR(IF(OR('Master Data'!$I$28='GA55 Check & Edit'!$AP$6,D25=\"\",'Master Data'!$N$38=\"\"),\"\",IF(AND(E25=\"\"),\"\",IF('GA55 Check & Edit'!D25='GA55 Check & Edit'!$AT$9,'Master Data'!$N$38,\"\"))),\"\")","v":""},{"$f":"IFERROR(IF(D25=\"\",\"\",IF(AND(O25=\"\"),\"\",IF(AND(N25=\"\"),SUM(P25:AA25),IF(AND('Master Data'!$H$18='GA55 Check & Edit'!$AO$5,'Master Data'!$I$30='GA55 Check & Edit'!$AN$6),SUM(P25:AA25)+N25,SUM(P25:AA25))))),\"0\")","v":0},0,null,null,null,null,null,null,null,null,null,null,null,null,null,null,null,{"$f":"MROUND(AZ15*1.03,100)","v":52300},null,"L-18",null,null,{"$f":"BM25","v":"PL Surrender"},null,null,{"$f":"IF('Master Data'!$I$28='GA55 Check & Edit'!$AP$6,\"\",IF(OR('Master Data'!E22=\"NO\",'Master Data'!E22=\"\"),0,VLOOKUP('Master Data'!I22,AW12:BD29,5,0)/2))","v":0},null,{"$f":"IF('Master Data'!$I$28='GA55 Check & Edit'!$AP$6,\"\",IF(AND(BA25=\"\"),\"\",IF(OR('Master Data'!I22='GA55 Check & Edit'!AW12,'Master Data'!I22='GA55 Check & Edit'!AW13,'Master Data'!I22='GA55 Check & Edit'!AW14,'Master Data'!I22='GA55 Check & Edit'!AW15),ROUND(17%*BA25,0),IF(OR('Master Data'!I22='GA55 Check & Edit'!AW16,'Master Data'!I22='GA55 Check & Edit'!AW17,'Master Data'!I22='GA55 Check & Edit'!AW18),ROUND(28%*BA25,0),ROUND(31%*BA25,0)))))","v":0},{"$f":"IF(BC25=\"\",\"\",BC25)","v":0},null,null,null,null,null,null,"2022-04-01",{"$f":"IFERROR(IF('Master Data'!$E$36=\"\",\"\",IF('Master Data'!$F$40=\"\",\"\",IF(AND($AZ$17>$AZ$9),\"\",DATE(YEAR(BL24),MONTH(BL24)+1,DAY(BL24))))),\"\")","v":"2022-04-01"},"PL Surrender","","PL Surrender",null,"PL Surrender",null,null,null,null,null,null,0]
[0,0,"",{"$f":"IFERROR(IF(BO30=\"\",\"\",BO30),\"\")","v":""},{"$f":"IFERROR(IF(D26=\"\",\"\",IF(AND(BQ30=\"\"),\"\",IF(AND('Master Data'!$I$28='GA55 Check & Edit'!$AP$6),VLOOKUP(D26,ram,13,0),VLOOKUP(D26,ram,4,0)))),\"\")","v":""},{"$f":"IFERROR(IF(D26=\"\",\"\",IF(D26=$AX$24,\"\",IF(AND(D26=$AX$25),$BC$25,IF(AND(D26=$AX$27),\"\",IF(AND(D26=$AX$28),\"\",IF(AND('Master Data'!$I$28='GA55 Check & Edit'!$AP$5),VLOOKUP(D26,ram,7,0),\"\")))))),\"\")","v":""},{"$f":"IFERROR(IF(D26=\"\",\"\",IF(D26=$AX$24,\"\",IF(AND(D26=$AX$25),\"\",IF(AND(D26=$AX$26),\"\",IF(AND(D26=$AX$27),\"\",IF(AND(D26=$AX$29),\"\",IF(AND('Master Data'!$I$28='GA55 Check & Edit'!$AP$6),\"\",VLOOKUP(D26,ram,8,0)))))))),\"\")","v":""},{"$f":"IFERROR(IF(D26=\"\",\"\",IF(AND(E26=\"\"),\"\",IF(OR(D26=$AX$24,D26=$AX$25,D26=$AX$26,D26=$AX$27,D26=$AX$28,D26=$AX$29),\"\",IF(AND('Master Data'!$I$28='GA55 Check & Edit'!$AP$5),'Master Data'!$B$43,\"\")))),\"\")","v":""},{"$f":"IFERROR(IF(D26=\"\",\"\",IF(AND(E26=\"\"),\"\",IF(OR(D26=$AX$24,D26=$AX$25,D26=$AX$26,D26=$AX$27,D26=$AX$28,D26=$AX$29),\"\",IF(AND('Master Data'!$I$28='GA55 Check & Edit'!$AP$5,'Master Data'!$E$28='GA55 Check & Edit'!$AO$5),'Master Data'!$C$43,\"0\")))),\"\")","v":""},{"$f":"IFERROR(IF(OR('Master Data'!$E$32=$AO$6,'Master Data'!$E$32=\"\"),\"\",IF(D26=\"\",\"\",IF(AND(E26=\"\"),\"\",IF(OR(D26=$AX$24,D26=$AX$25,D26=$AX$26,D26=$AX$27,D26=$AX$28,D26=$AX$29),\"\",IF(AND('Master Data'!$I$28='GA55 Check & Edit'!$AP$6),\"\",IF(AND('Master Data'!$I$32=$AR$9),$AS$6,IF(AND('Master Data'!$I$32=$AR$10),$AS$6,IF(AND('Master Data'!$I$32=$AR$11),$AS$6,IF(AND('Master Data'!$I$32=$AR$12),$AS$6,$AS$5))))))))),\"\")","v":""},{"$f":"IFERROR(IF(D26=\"\",\"\",IF(AND(E26=\"\"),\"\",IF(OR(D26=$AX$24,D26=$AX$25,D26=$AX$26,D26=$AX$27,D26=$AX$28,D26=$AX$29),\"\",IF(AND('Master Data'!$I$28='GA55 Check & Edit'!$AP$5),'Master Data'!$E$43,\"\")))),\"\")","v":""},{"$f":"IFERROR(IF(D26=\"\",\"\",IF(AND(E26=\"\"),\"\",IF(OR(D26=$AX$24,D26=$AX$25,D26=$AX$26,D26=$AX$27,D26=$AX$28,D26=$AX$29),\"\",IF(AND('Master Data'!$I$28='GA55 Check & Edit'!$AP$6),\"\",'Master Data'!$F$43)))),\"\")","v":""},null,{"$f":"IFERROR(IF(AND(D26=\"\"),\"\",IF(AND(D26=$AX$25,'Master Data'!$I$30='GA55 Check & Edit'!$AN$6),ROUND((E26+F26)*0.1,0),IF(AND(D26=$AX$29,'Master Data'!$I$30='GA55 Check & Edit'!$AN$6),ROUND((F26)*0.1,0),IF(AND(D26=$AX$26,'Master Data'!$I$30='GA55 Check & Edit'!$AN$6),ROUND((F26)*0.1,0),IF(AND(D26=$AX$27,'Master Data'!$I$30='GA55 Check & Edit'!$AN$6),ROUND((E26+F26)*0.1,0),IF(AND('Master Data'!$I$30='GA55 Check & Edit'!$AN$5),\"\",IF(AND('Master Data'!$I$30='GA55 Check & Edit'!$AN$6,'Master Data'!$I$28='GA55 Check & Edit'!$AP$6),ROUND((E26)*0.1,0),ROUND((E26+F26)*0.1,0)))))))),\"\")","v":""},{"$f":"IF(D26=\"\",\"\",IF('Master Data'!$H$18='GA55 Check & Edit'!$AO$5,SUM(E26:N26),SUM(E26:M26)))","v":""},{"$f":"IFERROR(IF(OR('Master Data'!$I$28='GA55 Check & Edit'!$AP$6,D26=\"\"),\"\",IF(AND(D26=$AX$24),\"\",IF(AND(D26=$AX$25),\"\",IF(AND(D26=$AX$26),\"\",IF(AND(D26=$AX$27),\"\",IF(AND(D26=$AX$28),\"\",IF(AND(D26=$AX$29),\"\",IF(AND(E26=\"\"),\"\",VLOOKUP(D26,ram,11,0))))))))),\"\")","v":""},{"$f":"IFERROR(IF(AND(D26=\"\",E26=\"\"),\"\",IF(AND(D26=$AX$25,'Master Data'!$I$30='GA55 Check & Edit'!$AN$6),ROUND((E26+F26)*0.1,0),IF(AND(D26=$AX$29,'Master Data'!$I$30='GA55 Check & Edit'!$AN$6),ROUND((F26)*0.1,0),IF(AND(D26=$AX$26,'Master Data'!$I$30='GA55 Check & Edit'!$AN$6),ROUND((F26)*0.1,0),IF(AND(D26=$AX$27,'Master Data'!$I$30='GA55 Check & Edit'!$AN$6),ROUND((E26+F26)*0.1,0),IF(AND('Master Data'!$I$30='GA55 Check & Edit'!$AN$6,'Master Data'!$I$28='GA55 Check & Edit'!$AP$6),ROUND((E26)*0.1,0),IF(AND('Master Data'!$I$30='GA55 Check & Edit'!$AN$6,'Master Data'!$I$28='GA55 Check & Edit'!$AP$5),ROUND((E26+F26)*0.1,0),IF(AND('Master Data'!$I$30='GA55 Check & Edit'!$AN$5,'Master Data'!$I$28='GA55 Check & Edit'!$AP$5),VLOOKUP(D26,ram,12,0))))))))),\"\")","v":""},{"$f":"IFERROR(IF(OR('Master Data'!$I$28='GA55 Check & Edit'!$AP$6,D26=\"\"),\"\",IF(AND(D26=$AX$24),\"\",IF(AND(D26=$AX$25),\"\",IF(AND(D26=$AX$26),\"\",IF(AND(D26=$AX$27),\"\",IF(AND(D26=$AX$28),\"\",IF(AND(D26=$AX$29),\"\",IF(AND(D26=$AX$32),\"\",IF(AND(E26=\"\"),\"\",'Master Data'!$I$43))))))))),\"\")","v":""},{"$f":"IFERROR(IF(OR('Master Data'!$I$28='GA55 Check & Edit'!$AP$6),\"\",IF(D26=\"\",\"\",IF(E26=\"\",\"\",IF(AND(D26=$AX$24),\"\",IF(AND(D26=$AX$25),\"\",IF(AND(D26=$AX$26),\"\",IF(AND(D26=$AX$27),\"\",IF(AND(D26=$AX$28),\"\",IF(AND(D26=$AX$29),\"\",VLOOKUP(D26,ram,10,0)))))))))),\"\")","v":""},{"$f":"IFERROR(IF(OR('Master Data'!$I$28='GA55 Check & Edit'!$AP$6,D26=\"\"),\"\",IF(AND(D26=$AX$24),\"\",IF(AND(D26=$AX$25),\"\",IF(AND(D26=$AX$26),\"\",IF(AND(D26=$AX$27),\"\",IF(AND(D26=$AX$28),\"\",IF(AND(D26=$AX$29),\"\",IF(AND(E26=\"\"),\"\",'Master Data'!$K$43)))))))),\"\")","v":""},{"$f":"IFERROR(IF(OR('Master Data'!$I$28='GA55 Check & Edit'!$AP$6,D26=\"\"),\"\",IF(AND(D26=$AX$24),\"\",IF(AND(D26=$AX$25),\"\",IF(AND(D26=$AX$26),\"\",IF(AND(D26=$AX$27),\"\",IF(AND(D26=$AX$28),\"\",IF(AND(D26=$AX$29),\"\",IF(AND(E26=\"\"),\"\",'Master Data'!$L$43)))))))),\"\")","v":""},{"$f":"IFERROR(IF(OR('Master Data'!$I$28='GA55 Check & Edit'!$AP$6,D26=\"\"),\"\",IF(AND(D26=$AX$24,'Master Data'!$I$28='GA55 Check & Edit'!$AP$5,'Master Data'!$I$30='GA55 Check & Edit'!$AN$6),ROUND(M26*50%,0),IF(AND(D26=$AX$25),\"\",IF(AND(D26=$AX$26,'Master Data'!$I$28='GA55 Check & Edit'!$AP$5,'Master Data'!$I$30='GA55 Check & Edit'!$AN$6),SUM(F26-N26),IF(AND(D26=$AX$27),\"\",IF(AND(D26=$AX$28),\"\",IF(AND(D26=$AX$29,'Master Data'!$I$28='GA55 Check & Edit'!$AP$5,'Master Data'!$I$30='GA55 Check & Edit'!$AN$6),SUM(F26-N26),IF(AND(E26=\"\"),\"\",'Master Data'!$M$43)))))))),\"\")","v":""},{"$f":"IFERROR(IF(OR('Master Data'!$I$28='GA55 Check & Edit'!$AP$6,D26=\"\"),\"\",IF(AND(D26=$AX$24),\"\",IF(AND(D26=$AX$25),\"\",IF(AND(D26=$AX$26),\"\",IF(AND(D26=$AX$27),\"\",IF(AND(D26=$AX$28),\"\",IF(AND(D26=$AX$29),\"\",IF(AND(E26=\"\"),\"\",'Master Data'!$O$43)))))))),\"\")","v":""},{"$f":"IFERROR(IF(OR('Master Data'!$I$28='GA55 Check & Edit'!$AP$6,D26=\"\"),\"\",IF(AND(E26=\"\"),\"\",IF(AND('GA55 Check & Edit'!D26='GA55 Check & Edit'!$AT$17,'Master Data'!$D$18=\"Gazetted\"),500,IF(AND('GA55 Check & Edit'!D26='GA55 Check & Edit'!$AT$17,'Master Data'!$D$18=\"Non-Gazetted\"),250,\"\")))),\"\")","v":""},{"$f":"IFERROR(IF(D26=\"\",\"\",IF(AND(E26=\"\"),\"\",IF(AND(D26=$AX$24),\"\",IF(AND(D26=$AX$25),\"\",IF(AND(D26=$AX$26),\"\",IF(AND(D26=$AX$27),\"\",IF(AND(D26=$AX$28),\"\",IF(AND(D26=$AX$29),\"\",IF(OR('Master Data'!$I$28='GA55 Check & Edit'!$AP$6,D26=\"\"),\"\",$Y$7))))))))),\"\")","v":""},null,{"$f":"IFERROR(IF(OR('Master Data'!$I$28='GA55 Check & Edit'!$AP$6,D26=\"\",'Master Data'!$N$38=\"\"),\"\",IF(AND(E26=\"\"),\"\",IF('GA55 Check & Edit'!D26='GA55 Check & Edit'!$AT$9,'Master Data'!$N$38,\"\"))),\"\")","v":""},{"$f":"IFERROR(IF(D26=\"\",\"\",IF(AND(O26=\"\"),\"\",IF(AND(N26=\"\"),SUM(P26:AA26),IF(AND('Master Data'!$H$18='GA55 Check & Edit'!$AO$5,'Master Data'!$I$30='GA55 Check & Edit'!$AN$6),SUM(P26:AA26)+N26,SUM(P26:AA26))))),\"0\")","v":""},"",null,null,null,null,null,null,null,null,null,null,null,null,null,null,null,null,null,"L-19",null,null,"DA Arrear ",null,null,null,null,{"$f":"(ROUND((BA16*31%),0)-ROUND((BA16*28%),0))*3","v":4707},{"$f":"IF(BC26=\"\",\"\",BC26)","v":4707},null,null,null,null,{"$f":"BD26","v":4707},null,"2022-05-01",{"$f":"IFERROR(IF('Master Data'!$E$36=\"\",\"\",IF('Master Data'!$F$40=\"\",\"\",IF(AND($AZ$17>$AZ$9),\"\",DATE(YEAR(BL25),MONTH(BL25)+1,DAY(BL25))))),\"\")","v":"2022-05-01"},"DA Arrear ","","DA Arrear ",null,"",null,null,null,null,null,null,0]
[0,0,"","",{"$f":"IFERROR(IF(D27=\"\",\"\",IF(AND(BQ31=\"\"),\"\",IF(AND('Master Data'!$I$28='GA55 Check & Edit'!$AP$6),VLOOKUP(D27,ram,13,0),VLOOKUP(D27,ram,4,0)))),\"\")","v":""},{"$f":"IFERROR(IF(D27=\"\",\"\",IF(D27=$AX$24,\"\",IF(AND(D27=$AX$25),$BC$25,IF(AND(D27=$AX$27),\"\",IF(AND(D27=$AX$28),\"\",IF(AND('Master Data'!$I$28='GA55 Check & Edit'!$AP$5),VLOOKUP(D27,ram,7,0),\"\")))))),\"\")","v":""},{"$f":"IFERROR(IF(D27=\"\",\"\",IF(D27=$AX$24,\"\",IF(AND(D27=$AX$25),\"\",IF(AND(D27=$AX$26),\"\",IF(AND(D27=$AX$27),\"\",IF(AND(D27=$AX$29),\"\",IF(AND('Master Data'!$I$28='GA55 Check & Edit'!$AP$6),\"\",VLOOKUP(D27,ram,8,0)))))))),\"\")","v":""},{"$f":"IFERROR(IF(D27=\"\",\"\",IF(AND(E27=\"\"),\"\",IF(OR(D27=$AX$24,D27=$AX$25,D27=$AX$26,D27=$AX$27,D27=$AX$28,D27=$AX$29),\"\",IF(AND('Master Data'!$I$28='GA55 Check & Edit'!$AP$5),'Master Data'!$B$43,\"\")))),\"\")","v":""},{"$f":"IFERROR(IF(D27=\"\",\"\",IF(AND(E27=\"\"),\"\",IF(OR(D27=$AX$24,D27=$AX$25,D27=$AX$26,D27=$AX$27,D27=$AX$28,D27=$AX$29),\"\",IF(AND('Master Data'!$I$28='GA55 Check & Edit'!$AP$5,'Master Data'!$E$28='GA55 Check & Edit'!$AO$5),'Master Data'!$C$43,\"0\")))),\"\")","v":""},{"$f":"IFERROR(IF(OR('Master Data'!$E$32=$AO$6,'Master Data'!$E$32=\"\"),\"\",IF(D27=\"\",\"\",IF(AND(E27=\"\"),\"\",IF(OR(D27=$AX$24,D27=$AX$25,D27=$AX$26,D27=$AX$27,D27=$AX$28,D27=$AX$29),\"\",IF(AND('Master Data'!$I$28='GA55 Check & Edit'!$AP$6),\"\",IF(AND('Master Data'!$I$32=$AR$9),$AS$6,IF(AND('Master Data'!$I$32=$AR$10),$AS$6,IF(AND('Master Data'!$I$32=$AR$11),$AS$6,IF(AND('Master Data'!$I$32=$AR$12),$AS$6,$AS$5))))))))),\"\")","v":""},{"$f":"IFERROR(IF(D27=\"\",\"\",IF(AND(E27=\"\"),\"\",IF(OR(D27=$AX$24,D27=$AX$25,D27=$AX$26,D27=$AX$27,D27=$AX$28,D27=$AX$29),\"\",IF(AND('Master Data'!$I$28='GA55 Check & Edit'!$AP$5),'Master Data'!$E$43,\"\")))),\"\")","v":""},{"$f":"IFERROR(IF(D27=\"\",\"\",IF(AND(E27=\"\"),\"\",IF(OR(D27=$AX$24,D27=$AX$25,D27=$AX$26,D27=$AX$27,D27=$AX$28,D27=$AX$29),\"\",IF(AND('Master Data'!$I$28='GA55 Check & Edit'!$AP$6),\"\",'Master Data'!$F$43)))),\"\")","v":""},null,{"$f":"IFERROR(IF(AND(D27=\"\"),\"\",IF(AND(D27=$AX$25,'Master Data'!$I$30='GA55 Check & Edit'!$AN$6),ROUND((E27+F27)*0.1,0),IF(AND(D27=$AX$29,'Master Data'!$I$30='GA55 Check & Edit'!$AN$6),ROUND((F27)*0.1,0),IF(AND(D27=$AX$26,'Master Data'!$I$30='GA55 Check & Edit'!$AN$6),ROUND((F27)*0.1,0),IF(AND(D27=$AX$27,'Master Data'!$I$30='GA55 Check & Edit'!$AN$6),ROUND((E27+F27)*0.1,0),IF(AND('Master Data'!$I$30='GA55 Check & Edit'!$AN$5),\"\",IF(AND('Master Data'!$I$30='GA55 Check & Edit'!$AN$6,'Master Data'!$I$28='GA55 Check & Edit'!$AP$6),ROUND((E27)*0.1,0),ROUND((E27+F27)*0.1,0)))))))),\"\")","v":""},{"$f":"IF(D27=\"\",\"\",IF('Master Data'!$H$18='GA55 Check & Edit'!$AO$5,SUM(E27:N27),SUM(E27:M27)))","v":""},{"$f":"IFERROR(IF(OR('Master Data'!$I$28='GA55 Check & Edit'!$AP$6,D27=\"\"),\"\",IF(AND(D27=$AX$24),\"\",IF(AND(D27=$AX$25),\"\",IF(AND(D27=$AX$26),\"\",IF(AND(D27=$AX$27),\"\",IF(AND(D27=$AX$28),\"\",IF(AND(D27=$AX$29),\"\",IF(AND(E27=\"\"),\"\",VLOOKUP(D27,ram,11,0))))))))),\"\")","v":""},{"$f":"IFERROR(IF(AND(D27=\"\",E27=\"\"),\"\",IF(AND(D27=$AX$25,'Master Data'!$I$30='GA55 Check & Edit'!$AN$6),ROUND((E27+F27)*0.1,0),IF(AND(D27=$AX$29,'Master Data'!$I$30='GA55 Check & Edit'!$AN$6),ROUND((F27)*0.1,0),IF(AND(D27=$AX$26,'Master Data'!$I$30='GA55 Check & Edit'!$AN$6),ROUND((F27)*0.1,0),IF(AND(D27=$AX$27,'Master Data'!$I$30='GA55 Check & Edit'!$AN$6),ROUND((E27+F27)*0.1,0),IF(AND('Master Data'!$I$30='GA55 Check & Edit'!$AN$6,'Master Data'!$I$28='GA55 Check & Edit'!$AP$6),ROUND((E27)*0.1,0),IF(AND('Master Data'!$I$30='GA55 Check & Edit'!$AN$6,'Master Data'!$I$28='GA55 Check & Edit'!$AP$5),ROUND((E27+F27)*0.1,0),IF(AND('Master Data'!$I$30='GA55 Check & Edit'!$AN$5,'Master Data'!$I$28='GA55 Check & Edit'!$AP$5),VLOOKUP(D27,ram,12,0))))))))),\"\")","v":""},{"$f":"IFERROR(IF(OR('Master Data'!$I$28='GA55 Check & Edit'!$AP$6,D27=\"\"),\"\",IF(AND(D27=$AX$24),\"\",IF(AND(D27=$AX$25),\"\",IF(AND(D27=$AX$26),\"\",IF(AND(D27=$AX$27),\"\",IF(AND(D27=$AX$28),\"\",IF(AND(D27=$AX$29),\"\",IF(AND(D27=$AX$32),\"\",IF(AND(E27=\"\"),\"\",'Master Data'!$I$43))))))))),\"\")","v":""},{"$f":"IFERROR(IF(OR('Master Data'!$I$28='GA55 Check & Edit'!$AP$6),\"\",IF(D27=\"\",\"\",IF(E27=\"\",\"\",IF(AND(D27=$AX$24),\"\",IF(AND(D27=$AX$25),\"\",IF(AND(D27=$AX$26),\"\",IF(AND(D27=$AX$27),\"\",IF(AND(D27=$AX$28),\"\",IF(AND(D27=$AX$29),\"\",VLOOKUP(D27,ram,10,0)))))))))),\"\")","v":""},{"$f":"IFERROR(IF(OR('Master Data'!$I$28='GA55 Check & Edit'!$AP$6,D27=\"\"),\"\",IF(AND(D27=$AX$24),\"\",IF(AND(D27=$AX$25),\"\",IF(AND(D27=$AX$26),\"\",IF(AND(D27=$AX$27),\"\",IF(AND(D27=$AX$28),\"\",IF(AND(D27=$AX$29),\"\",IF(AND(E27=\"\"),\"\",'Master Data'!$K$43)))))))),\"\")","v":""},{"$f":"IFERROR(IF(OR('Master Data'!$I$28='GA55 Check & Edit'!$AP$6,D27=\"\"),\"\",IF(AND(D27=$AX$24),\"\",IF(AND(D27=$AX$25),\"\",IF(AND(D27=$AX$26),\"\",IF(AND(D27=$AX$27),\"\",IF(AND(D27=$AX$28),\"\",IF(AND(D27=$AX$29),\"\",IF(AND(E27=\"\"),\"\",'Master Data'!$L$43)))))))),\"\")","v":""},{"$f":"IFERROR(IF(OR('Master Data'!$I$28='GA55 Check & Edit'!$AP$6,D27=\"\"),\"\",IF(AND(D27=$AX$24,'Master Data'!$I$28='GA55 Check & Edit'!$AP$5,'Master Data'!$I$30='GA55 Check & Edit'!$AN$6),ROUND(M27*50%,0),IF(AND(D27=$AX$25),\"\",IF(AND(D27=$AX$26,'Master Data'!$I$28='GA55 Check & Edit'!$AP$5,'Master Data'!$I$30='GA55 Check & Edit'!$AN$6),SUM(F27-N27),IF(AND(D27=$AX$27),\"\",IF(AND(D27=$AX$28),\"\",IF(AND(D27=$AX$29,'Master Data'!$I$28='GA55 Check & Edit'!$AP$5,'Master Data'!$I$30='GA55 Check & Edit'!$AN$6),SUM(F27-N27),IF(AND(E27=\"\"),\"\",'Master Data'!$M$43)))))))),\"\")","v":""},{"$f":"IFERROR(IF(OR('Master Data'!$I$28='GA55 Check & Edit'!$AP$6,D27=\"\"),\"\",IF(AND(D27=$AX$24),\"\",IF(AND(D27=$AX$25),\"\",IF(AND(D27=$AX$26),\"\",IF(AND(D27=$AX$27),\"\",IF(AND(D27=$AX$28),\"\",IF(AND(D27=$AX$29),\"\",IF(AND(E27=\"\"),\"\",'Master Data'!$O$43)))))))),\"\")","v":""},{"$f":"IFERROR(IF(OR('Master Data'!$I$28='GA55 Check & Edit'!$AP$6,D27=\"\"),\"\",IF(AND(E27=\"\"),\"\",IF(AND('GA55 Check & Edit'!D27='GA55 Check & Edit'!$AT$17,'Master Data'!$D$18=\"Gazetted\"),500,IF(AND('GA55 Check & Edit'!D27='GA55 Check & Edit'!$AT$17,'Master Data'!$D$18=\"Non-Gazetted\"),250,\"\")))),\"\")","v":""},{"$f":"IFERROR(IF(D27=\"\",\"\",IF(AND(E27=\"\"),\"\",IF(AND(D27=$AX$24),\"\",IF(AND(D27=$AX$25),\"\",IF(AND(D27=$AX$26),\"\",IF(AND(D27=$AX$27),\"\",IF(AND(D27=$AX$28),\"\",IF(AND(D27=$AX$29),\"\",IF(OR('Master Data'!$I$28='GA55 Check & Edit'!$AP$6,D27=\"\"),\"\",$Y$7))))))))),\"\")","v":""},null,{"$f":"IFERROR(IF(OR('Master Data'!$I$28='GA55 Check & Edit'!$AP$6,D27=\"\",'Master Data'!$N$38=\"\"),\"\",IF(AND(E27=\"\"),\"\",IF('GA55 Check & Edit'!D27='GA55 Check & Edit'!$AT$9,'Master Data'!$N$38,\"\"))),\"\")","v":""},{"$f":"IFERROR(IF(D27=\"\",\"\",IF(AND(O27=\"\"),\"\",IF(AND(N27=\"\"),SUM(P27:AA27),IF(AND('Master Data'!$H$18='GA55 Check & Edit'!$AO$5,'Master Data'!$I$30='GA55 Check & Edit'!$AN$6),SUM(P27:AA27)+N27,SUM(P27:AA27))))),\"0\")","v":""},"",null,null,null,null,null,null,null,null,null,null,null,null,null,null,null,null,null,"L-20",null,null,"Fixation arear",null,null,null,null,null,{"$f":"IF(BC27=\"\",\"\",BC27)","v":""},null,null,null,null,null,null,"2022-06-01",{"$f":"IFERROR(IF('Master Data'!$E$36=\"\",\"\",IF('Master Data'!$F$40=\"\",\"\",IF(AND($AZ$17>$AZ$9),\"\",DATE(YEAR(BL26),MONTH(BL26)+1,DAY(BL26))))),\"\")","v":"2022-06-01"},"Fixation arear","","Fixation arear",null,"",null,null,null,null,null,null,0]
[0,0,"","",{"$f":"IFERROR(IF(D28=\"\",\"\",IF(AND(BQ32=\"\"),\"\",IF(AND('Master Data'!$I$28='GA55 Check & Edit'!$AP$6),VLOOKUP(D28,ram,13,0),VLOOKUP(D28,ram,4,0)))),\"\")","v":""},{"$f":"IFERROR(IF(D28=\"\",\"\",IF(D28=$AX$24,\"\",IF(AND(D28=$AX$25),$BC$25,IF(AND(D28=$AX$27),\"\",IF(AND(D28=$AX$28),\"\",IF(AND('Master Data'!$I$28='GA55 Check & Edit'!$AP$5),VLOOKUP(D28,ram,7,0),\"\")))))),\"\")","v":""},{"$f":"IFERROR(IF(D28=\"\",\"\",IF(D28=$AX$24,\"\",IF(AND(D28=$AX$25),\"\",IF(AND(D28=$AX$26),\"\",IF(AND(D28=$AX$27),\"\",IF(AND(D28=$AX$29),\"\",IF(AND('Master Data'!$I$28='GA55 Check & Edit'!$AP$6),\"\",VLOOKUP(D28,ram,8,0)))))))),\"\")","v":""},{"$f":"IFERROR(IF(D28=\"\",\"\",IF(AND(E28=\"\"),\"\",IF(OR(D28=$AX$24,D28=$AX$25,D28=$AX$26,D28=$AX$27,D28=$AX$28,D28=$AX$29),\"\",IF(AND('Master Data'!$I$28='GA55 Check & Edit'!$AP$5),'Master Data'!$B$43,\"\")))),\"\")","v":""},{"$f":"IFERROR(IF(D28=\"\",\"\",IF(AND(E28=\"\"),\"\",IF(OR(D28=$AX$24,D28=$AX$25,D28=$AX$26,D28=$AX$27,D28=$AX$28,D28=$AX$29),\"\",IF(AND('Master Data'!$I$28='GA55 Check & Edit'!$AP$5,'Master Data'!$E$28='GA55 Check & Edit'!$AO$5),'Master Data'!$C$43,\"0\")))),\"\")","v":""},{"$f":"IFERROR(IF(OR('Master Data'!$E$32=$AO$6,'Master Data'!$E$32=\"\"),\"\",IF(D28=\"\",\"\",IF(AND(E28=\"\"),\"\",IF(OR(D28=$AX$24,D28=$AX$25,D28=$AX$26,D28=$AX$27,D28=$AX$28,D28=$AX$29),\"\",IF(AND('Master Data'!$I$28='GA55 Check & Edit'!$AP$6),\"\",IF(AND('Master Data'!$I$32=$AR$9),$AS$6,IF(AND('Master Data'!$I$32=$AR$10),$AS$6,IF(AND('Master Data'!$I$32=$AR$11),$AS$6,IF(AND('Master Data'!$I$32=$AR$12),$AS$6,$AS$5))))))))),\"\")","v":""},{"$f":"IFERROR(IF(D28=\"\",\"\",IF(AND(E28=\"\"),\"\",IF(OR(D28=$AX$24,D28=$AX$25,D28=$AX$26,D28=$AX$27,D28=$AX$28,D28=$AX$29),\"\",IF(AND('Master Data'!$I$28='GA55 Check & Edit'!$AP$5),'Master Data'!$E$43,\"\")))),\"\")","v":""},{"$f":"IFERROR(IF(D28=\"\",\"\",IF(AND(E28=\"\"),\"\",IF(OR(D28=$AX$24,D28=$AX$25,D28=$AX$26,D28=$AX$27,D28=$AX$28,D28=$AX$29),\"\",IF(AND('Master Data'!$I$28='GA55 Check & Edit'!$AP$6),\"\",'Master Data'!$F$43)))),\"\")","v":""},null,{"$f":"IFERROR(IF(AND(D28=\"\"),\"\",IF(AND(D28=$AX$25,'Master Data'!$I$30='GA55 Check & Edit'!$AN$6),ROUND((E28+F28)*0.1,0),IF(AND(D28=$AX$29,'Master Data'!$I$30='GA55 Check & Edit'!$AN$6),ROUND((F28)*0.1,0),IF(AND(D28=$AX$26,'Master Data'!$I$30='GA55 Check & Edit'!$AN$6),ROUND((F28)*0.1,0),IF(AND(D28=$AX$27,'Master Data'!$I$30='GA55 Check & Edit'!$AN$6),ROUND((E28+F28)*0.1,0),IF(AND('Master Data'!$I$30='GA55 Check & Edit'!$AN$5),\"\",IF(AND('Master Data'!$I$30='GA55 Check & Edit'!$AN$6,'Master Data'!$I$28='GA55 Check & Edit'!$AP$6),ROUND((E28)*0.1,0),ROUND((E28+F28)*0.1,0)))))))),\"\")","v":""},{"$f":"IF(D28=\"\",\"\",IF('Master Data'!$H$18='GA55 Check & Edit'!$AO$5,SUM(E28:N28),SUM(E28:M28)))","v":""},{"$f":"IFERROR(IF(OR('Master Data'!$I$28='GA55 Check & Edit'!$AP$6,D28=\"\"),\"\",IF(AND(D28=$AX$24),\"\",IF(AND(D28=$AX$25),\"\",IF(AND(D28=$AX$26),\"\",IF(AND(D28=$AX$27),\"\",IF(AND(D28=$AX$28),\"\",IF(AND(D28=$AX$29),\"\",IF(AND(E28=\"\"),\"\",VLOOKUP(D28,ram,11,0))))))))),\"\")","v":""},{"$f":"IFERROR(IF(AND(D28=\"\",E28=\"\"),\"\",IF(AND(D28=$AX$25,'Master Data'!$I$30='GA55 Check & Edit'!$AN$6),ROUND((E28+F28)*0.1,0),IF(AND(D28=$AX$29,'Master Data'!$I$30='GA55 Check & Edit'!$AN$6),ROUND((F28)*0.1,0),IF(AND(D28=$AX$26,'Master Data'!$I$30='GA55 Check & Edit'!$AN$6),ROUND((F28)*0.1,0),IF(AND(D28=$AX$27,'Master Data'!$I$30='GA55 Check & Edit'!$AN$6),ROUND((E28+F28)*0.1,0),IF(AND('Master Data'!$I$30='GA55 Check & Edit'!$AN$6,'Master Data'!$I$28='GA55 Check & Edit'!$AP$6),ROUND((E28)*0.1,0),IF(AND('Master Data'!$I$30='GA55 Check & Edit'!$AN$6,'Master Data'!$I$28='GA55 Check & Edit'!$AP$5),ROUND((E28+F28)*0.1,0),IF(AND('Master Data'!$I$30='GA55 Check & Edit'!$AN$5,'Master Data'!$I$28='GA55 Check & Edit'!$AP$5),VLOOKUP(D28,ram,12,0))))))))),\"\")","v":""},{"$f":"IFERROR(IF(OR('Master Data'!$I$28='GA55 Check & Edit'!$AP$6,D28=\"\"),\"\",IF(AND(D28=$AX$24),\"\",IF(AND(D28=$AX$25),\"\",IF(AND(D28=$AX$26),\"\",IF(AND(D28=$AX$27),\"\",IF(AND(D28=$AX$28),\"\",IF(AND(D28=$AX$29),\"\",IF(AND(D28=$AX$32),\"\",IF(AND(E28=\"\"),\"\",'Master Data'!$I$43))))))))),\"\")","v":""},{"$f":"IFERROR(IF(OR('Master Data'!$I$28='GA55 Check & Edit'!$AP$6),\"\",IF(D28=\"\",\"\",IF(E28=\"\",\"\",IF(AND(D28=$AX$24),\"\",IF(AND(D28=$AX$25),\"\",IF(AND(D28=$AX$26),\"\",IF(AND(D28=$AX$27),\"\",IF(AND(D28=$AX$28),\"\",IF(AND(D28=$AX$29),\"\",VLOOKUP(D28,ram,10,0)))))))))),\"\")","v":""},{"$f":"IFERROR(IF(OR('Master Data'!$I$28='GA55 Check & Edit'!$AP$6,D28=\"\"),\"\",IF(AND(D28=$AX$24),\"\",IF(AND(D28=$AX$25),\"\",IF(AND(D28=$AX$26),\"\",IF(AND(D28=$AX$27),\"\",IF(AND(D28=$AX$28),\"\",IF(AND(D28=$AX$29),\"\",IF(AND(E28=\"\"),\"\",'Master Data'!$K$43)))))))),\"\")","v":""},{"$f":"IFERROR(IF(OR('Master Data'!$I$28='GA55 Check & Edit'!$AP$6,D28=\"\"),\"\",IF(AND(D28=$AX$24),\"\",IF(AND(D28=$AX$25),\"\",IF(AND(D28=$AX$26),\"\",IF(AND(D28=$AX$27),\"\",IF(AND(D28=$AX$28),\"\",IF(AND(D28=$AX$29),\"\",IF(AND(E28=\"\"),\"\",'Master Data'!$L$43)))))))),\"\")","v":""},{"$f":"IFERROR(IF(OR('Master Data'!$I$28='GA55 Check & Edit'!$AP$6,D28=\"\"),\"\",IF(AND(D28=$AX$24,'Master Data'!$I$28='GA55 Check & Edit'!$AP$5,'Master Data'!$I$30='GA55 Check & Edit'!$AN$6),ROUND(M28*50%,0),IF(AND(D28=$AX$25),\"\",IF(AND(D28=$AX$26,'Master Data'!$I$28='GA55 Check & Edit'!$AP$5,'Master Data'!$I$30='GA55 Check & Edit'!$AN$6),SUM(F28-N28),IF(AND(D28=$AX$27),\"\",IF(AND(D28=$AX$28),\"\",IF(AND(D28=$AX$29,'Master Data'!$I$28='GA55 Check & Edit'!$AP$5,'Master Data'!$I$30='GA55 Check & Edit'!$AN$6),SUM(F28-N28),IF(AND(E28=\"\"),\"\",'Master Data'!$M$43)))))))),\"\")","v":""},{"$f":"IFERROR(IF(OR('Master Data'!$I$28='GA55 Check & Edit'!$AP$6,D28=\"\"),\"\",IF(AND(D28=$AX$24),\"\",IF(AND(D28=$AX$25),\"\",IF(AND(D28=$AX$26),\"\",IF(AND(D28=$AX$27),\"\",IF(AND(D28=$AX$28),\"\",IF(AND(D28=$AX$29),\"\",IF(AND(E28=\"\"),\"\",'Master Data'!$O$43)))))))),\"\")","v":""},{"$f":"IFERROR(IF(OR('Master Data'!$I$28='GA55 Check & Edit'!$AP$6,D28=\"\"),\"\",IF(AND(E28=\"\"),\"\",IF(AND('GA55 Check & Edit'!D28='GA55 Check & Edit'!$AT$17,'Master Data'!$D$18=\"Gazetted\"),500,IF(AND('GA55 Check & Edit'!D28='GA55 Check & Edit'!$AT$17,'Master Data'!$D$18=\"Non-Gazetted\"),250,\"\")))),\"\")","v":""},{"$f":"IFERROR(IF(D28=\"\",\"\",IF(AND(E28=\"\"),\"\",IF(AND(D28=$AX$24),\"\",IF(AND(D28=$AX$25),\"\",IF(AND(D28=$AX$26),\"\",IF(AND(D28=$AX$27),\"\",IF(AND(D28=$AX$28),\"\",IF(AND(D28=$AX$29),\"\",IF(OR('Master Data'!$I$28='GA55 Check & Edit'!$AP$6,D28=\"\"),\"\",$Y$7))))))))),\"\")","v":""},null,{"$f":"IFERROR(IF(OR('Master Data'!$I$28='GA55 Check & Edit'!$AP$6,D28=\"\",'Master Data'!$N$38=\"\"),\"\",IF(AND(E28=\"\"),\"\",IF('GA55 Check & Edit'!D28='GA55 Check & Edit'!$AT$9,'Master Data'!$N$38,\"\"))),\"\")","v":""},{"$f":"IFERROR(IF(D28=\"\",\"\",IF(AND(O28=\"\"),\"\",IF(AND(N28=\"\"),SUM(P28:AA28),IF(AND('Master Data'!$H$18='GA55 Check & Edit'!$AO$5,'Master Data'!$I$30='GA55 Check & Edit'!$AN$6),SUM(P28:AA28)+N28,SUM(P28:AA28))))),\"0\")","v":""},"",null,null,null,null,null,null,null,null,null,null,null,null,null,null,null,null,null,"L-21",null,null,"HRA Arrear",null,null,null,null,null,{"$f":"IF(BC28=\"\",\"\",BC28)","v":""},{"$f":"SUM(ROUND(AZ18*'Master Data'!E34%,0)-ROUND('GA55 Check & Edit'!AZ18*'Master Data'!E30%,0))","v":523},null,null,null,null,null,"2022-07-01",{"$f":"IFERROR(IF('Master Data'!$E$36=\"\",\"\",IF('Master Data'!$F$40=\"\",\"\",IF(AND($AZ$17>$AZ$9),\"\",DATE(YEAR(BL27),MONTH(BL27)+1,DAY(BL27))))),\"\")","v":"2022-07-01"},"HRA Arrear","","HRA Arrear",null,"",null,null,null,null,null,null,0]
[null,null,null,null,null,null,null,null,null,null,null,null,null,null,null,null,null,null,null,null,null,null,{"$f":"IFERROR(IF(OR('Master Data'!$I$28='GA55 Check & Edit'!$AP$6,D29=\"\"),\"\",IF(AND(D29=$AX$24),\"\",IF(AND(D29=$AX$25),\"\",IF(AND(D29=$AX$26),\"\",IF(AND(D29=$AX$27),\"\",IF(AND(D29=$AX$28),\"\",IF(AND(D29=$AX$29),\"\",IF(AND(E29=\"\"),\"\",'Master Data'!$O$43)))))))),\"\")","v":""},null,null,null,null,null,null,null,null,null,null,null,null,null,null,null,null,null,null,null,null,null,null,null,null,null,null,{"$f":"IF(BM29=\"\",\"\",BM29)","v":"PL Surrender Arrear"},null,null,null,null,{"$f":"IF('Master Data'!$I$28='GA55 Check & Edit'!$AP$6,\"\",IF(AND(BA25=\"\"),\"\",IF(OR('Master Data'!I22='GA55 Check & Edit'!AW16,'Master Data'!I22='GA55 Check & Edit'!AW17,'Master Data'!I22='GA55 Check & Edit'!AW18),ROUND(3%*BA25,0),\"\")))","v":0},0,null,null,null,null,{"$f":"BD29","v":0},null,"2022-08-01",{"$f":"IFERROR(IF('Master Data'!$E$36=\"\",\"\",IF('Master Data'!$F$40=\"\",\"\",IF(AND($AZ$17>$AZ$9),\"\",DATE(YEAR(BL28),MONTH(BL28)+1,DAY(BL28))))),\"\")","v":"2022-08-01"},"PL Surrender Arrear","","PL Surrender Arrear",null,"",null,null,null,null,null,null,0]
[null,null,null,null,null,null,null,null,null,null,null,null,null,null,null,null,null,null,null,null,null,null,null,null,null,null,null,null,null,null,null,null,null,null,null,null,null,null,null,null,null,null,null,{"$f":"ROUND(BA24*50%,0)","v":3387},null,null,null,null,null,{"$f":"IF(BM30=\"\",\"\",BM30)","v":""},null,null,{"$f":"IF(AND('Master Data'!$E$36=\"\"),\"\",IF('Master Data'!$N$32='GA55 Check & Edit'!$AO$5,'Master Data'!$E$36,\"\"))","v":""},{"$f":"IF('Master Data'!$N$32='GA55 Check & Edit'!$AO$5,BA30,\"\")","v":""},{"$f":"IFERROR(IF(AND('Master Data'!$E$36=\"\"),\"\",ROUND(17%*BB30,0)),\"\")","v":""},{"$f":"IF(BC30=\"\",\"\",BC30)","v":""},{"$f":"IFERROR(IF(AND('Master Data'!$E$36=\"\"),\"\",ROUND('Master Data'!$E$30%*BB30,0)),\"\")","v":""},null,{"$f":"IF(AND('Master Data'!$I$28='GA55 Check & Edit'!$AP$6),\"\",IF(AND('Master Data'!$I$30='GA55 Check & Edit'!$AN$6,'Master Data'!$N$36='GA55 Check & Edit'!$AO$6),0,IF(AND('Master Data'!$I$30='GA55 Check & Edit'!$AN$6,'Master Data'!$N$36='GA55 Check & Edit'!$AO$5),'Master Data'!$J$43,IF(AND('Master Data'!$I$30='GA55 Check & Edit'!$AN$5),IF($AZ$15<18001,265,IF($AZ$15<33501,440,IF($AZ$15<54001,658,875)))))))","v":0},{"$f":"IFERROR(IF(OR('Master Data'!$I$28='GA55 Check & Edit'!$AP$6),\"\",IF('Master Data'!$N$32='GA55 Check & Edit'!$AO$5,'Master Data'!$G$43,\"\")),\"\")","v":""},{"$f":"IFERROR(IF('Master Data'!$N$32='GA55 Check & Edit'!$AO$6,\"\",IF(AND('Master Data'!I$30='GA55 Check & Edit'!$AN$6),ROUND((BB30)*0.1,0),IF(AND('Master Data'!$I$28='GA55 Check & Edit'!$AP$6),ROUND((BB30+BD30)*0.1,0),'Master Data'!$H$43))),\"\")","v":""},null,"2022-09-01",{"$f":"IFERROR(IF('Master Data'!$E$36=\"\",\"\",IF('Master Data'!$F$40=\"\",\"\",IF(AND($AZ$17>$AZ$9),\"\",DATE(YEAR(BL29),MONTH(BL29)+1,DAY(BL29))))),\"\")","v":"2022-09-01"},{"$f":"IF(OR('Master Data'!N34='GA55 Check & Edit'!AO5,'Master Data'!N32='GA55 Check & Edit'!AO5,'Master Data'!N40='GA55 Check & Edit'!AO5),'GA55 Check & Edit'!AX10,\"\")","v":""},"","",null,{"$f":"IFERROR(IF(BM30=\"\",\"\",IF(D26=$AX$25,$AX$25,IF(D26=$AX$30,$AX$30,IF(D26=$AX$31,$AX$31,IF(D26=$AX$32,$AX$32,IF(BM30>$AZ$17,\"\",BM30)))))),\"\")","v":""},null,null,null,null,null,null,0]
[null,null,null,null,null,null,null,null,null,null,null,null,null,null,null,null,null,null,null,null,null,null,null,null,null,null,null,null,null,null,null,null,null,null,null,null,null,null,null,null,null,null,null,null,null,null,null,null,null,{"$f":"IF(BM31=\"\",\"\",BM31)","v":""},null,null,{"$f":"IF(AND('Master Data'!$E$36=\"\"),\"\",IF('Master Data'!$N$34='GA55 Check & Edit'!$AO$5,'Master Data'!$E$36,\"\"))","v":""},{"$f":"IF('Master Data'!$N$34='GA55 Check & Edit'!$AO$5,BA31,\"\")","v":""},{"$f":"IFERROR(IF(AND('Master Data'!$E$36=\"\"),\"\",ROUND(17%*BB31,0)),\"\")","v":""},{"$f":"IF(BC31=\"\",\"\",BC31)","v":""},{"$f":"IFERROR(IF(AND('Master Data'!$E$36=\"\"),\"\",ROUND('Master Data'!$E$30%*BB31,0)),\"\")","v":""},null,{"$f":"IF(AND('Master Data'!$I$28='GA55 Check & Edit'!$AP$6),\"\",IF(AND('Master Data'!$I$30='GA55 Check & Edit'!$AN$6,'Master Data'!$N$36='GA55 Check & Edit'!$AO$6),0,IF(AND('Master Data'!$I$30='GA55 Check & Edit'!$AN$6,'Master Data'!$N$36='GA55 Check & Edit'!$AO$5),'Master Data'!$J$43,IF(AND('Master Data'!$I$30='GA55 Check & Edit'!$AN$5),IF($AZ$15<18001,265,IF($AZ$15<33501,440,IF($AZ$15<54001,658,875)))))))","v":0},{"$f":"IFERROR(IF(OR('Master Data'!$I$28='GA55 Check & Edit'!$AP$6),\"\",IF('Master Data'!$N$34='GA55 Check & Edit'!$AO$5,'Master Data'!$G$43,\"\")),\"\")","v":""},{"$f":"IFERROR(IF('Master Data'!$N$34='GA55 Check & Edit'!$AO$6,\"\",IF(AND('Master Data'!I$30='GA55 Check & Edit'!$AN$6),ROUND((BB31)*0.1,0),IF(AND('Master Data'!$I$28='GA55 Check & Edit'!$AP$6),ROUND((BB31+BD31)*0.1,0),'Master Data'!$H$43))),\"\")","v":""},null,"2022-10-01",{"$f":"IFERROR(IF('Master Data'!$E$36=\"\",\"\",IF('Master Data'!$F$40=\"\",\"\",IF(AND($AZ$17>$AZ$9),\"\",DATE(YEAR(BL30),MONTH(BL30)+1,DAY(BL30))))),\"\")","v":"2022-10-01"},{"$f":"IF(OR('Master Data'!N34='GA55 Check & Edit'!AO5,'Master Data'!N40='GA55 Check & Edit'!AO5),'GA55 Check & Edit'!AX11,\"\")","v":""},"","",null,""]
[null,null,null,null,null,null,null,null,null,null,null,null,null,null,null,null,null,null,null,null,null,null,null,null,null,null,null,null,null,null,null,null,null,null,null,null,null,null,null,null,null,null,null,null,null,null,null,null,null,{"$f":"IF(BM32=\"\",\"\",BM32)","v":""},null,null,{"$f":"IF('Master Data'!N40='GA55 Check & Edit'!$AO$5,(AZ3-AZ1),\"\")","v":""},{"$f":"IF('Master Data'!N40='GA55 Check & Edit'!$AO$5,BA32,\"\")","v":""},{"$f":"IF(OR('Master Data'!$E$36=\"\",BB32=\"\"),\"\",ROUND(17%*BB32,0))","v":""},{"$f":"IF(BC32=\"\",\"\",BC32)","v":""},{"$f":"IFERROR(IF(AND('Master Data'!$E$36=\"\"),\"\",ROUND('Master Data'!$E$30%*BB32,0)),\"\")","v":""},null,null,null,{"$f":"IFERROR(IF(AND('Master Data'!$I$30='GA55 Check & Edit'!$AN$6),ROUND((E19)*0.1,0),IF(AND('Master Data'!$I$28='GA55 Check & Edit'!$AP$6),ROUND((E19+F19)*0.1,0),'Master Data'!$H$43)),\"\")","v":5230},null,"2022-11-01",{"$f":"IFERROR(IF('Master Data'!$E$36=\"\",\"\",IF('Master Data'!$F$40=\"\",\"\",IF(AND($AZ$17>$AZ$9),\"\",DATE(YEAR(BL31),MONTH(BL31)+1,DAY(BL31))))),\"\")","v":"2022-11-01"},{"$f":"IF('Master Data'!N40='GA55 Check & Edit'!AO5,CONCATENATE(\"Defer Salary\",\" - \",\"March-20\"),\"\")","v":""},"",{"$f":"IFERROR(IF(BM32=\"\",\"\",IF(AND(BL32=$BK$24),$BM$24,IF(AND(BL32=$BK$25),$BM$25,IF(AND(BL32=$BK$26),$BM$26,IF(AND(BL32=$BK$27),$BM$27,IF(AND(BL32=$BK$28),$BM$28,IF(AND(BL32=$BK$29),$BM$29,IF(AND(BL32=$BK$30),$BM$30,IF(AND(BL32=$BK$31),$BM$31,IF(AND(BL32=$BK$32),$BM$32,BN32)))))))))),\"\")","v":""},null,""]
[]
[]
[]
[]
[]
[]
[]
[]
[null,null,null,null,null,null,null,null,null,null,null,null,null,null,null,null,null,null,null,null,null,null,null,null,null,null,null,null,null,null,null,null,null,null,null,null,null,null,null,null,null,null,null,null,null,null,null,null,null,{"$f":"IFERROR(IF(D23=\"\",\"\",IF(AND(D23=AX34),VLOOKUP(D23,ram,4,0),IF(AND('Master Data'!$I$28='GA55 Check & Edit'!$AP$6),'Master Data'!$E$36,VLOOKUP(D23,ram,4,0)))),\"\")","v":0}]

{"sheet":"Extra Ded ","index":3,"n_rows":25,"n_cols":9,"rows_kept":25,"cut":false,"hidden":true,"merged":[[23,2,23,3],[17,2,17,3],[18,2,18,3],[19,2,19,3],[20,2,20,3],[21,2,21,3],[16,2,16,3],[22,6,22,7],[16,6,16,7],[17,6,17,7],[18,6,18,7],[22,2,22,3],[15,6,15,7],[6,6,6,7],[25,2,25,8],[5,9,23,9],[20,6,20,7],[21,6,21,7],[6,2,6,3],[7,2,7,3],[8,2,8,3],[9,2,9,3],[10,2,10,3],[11,2,11,3],[12,2,12,3],[13,2,13,3],[14,2,14,3],[15,2,15,3],[5,2,5,3],[23,6,23,7],[0,0,0,2],[1,1,1,2],[2,2,2,8],[5,5,23,5],[19,6,19,7],[5,6,5,7],[7,6,7,7],[8,6,8,7],[9,6,9,7],[10,6,10,7],[11,6,11,7],[12,6,12,7],[13,6,13,7],[14,6,14,7]]}
["https://www.youtube.com/watch?v=NWwIhkhEUoc"]
[null,"अधिक जानकारी के लिए ऊपर Youtube video का लिंक दिया गया है। "]
[null,null,"osru dVkSrh ds vfrfjDr dVkSfr;k ftlds rgr vki vk;dj esa NwV pkgrs gSa] rFkk vfrfjDr ¼vU;½ vk; dks ;gkW ij bUnzkt djsA"]
[]
[]
[null,null,"1- edku fdjk;k HkRrk ¼;fn jlhn ds ek/;e ls NwV ysuh gS rks jkf'k fy[ksas½",null,null,null,"20- bfDoVh fyad lsfoax Ldhe"]
[null,null,"2- LVs.MMZ fMMsD'ku (Standard Deduction)  50]000 ¼vf/kdre½",null,50000,null,"21- x`g fdjk;k] /kkjk 10¼13-A½ ds vUrxrZ ,oa /kkjk 10¼14½ds vUrxrZ vU; Hkrs tks dj eqDÙk gSA "]
[null,null,"3- euksjatu Hkrk /kkjk 16 (ii) ds vUrxZr ",null,null,null,"22- LFkfxr okf\"kZdh ¼Defferred Annuty)"]
[null,null,"4- O;o;k; dj /kkjk 16 ¼iii½ ds vUrxrZ ",null,null,null,"23- osru ds vykok tek djk;k x;k aavk;dj (TDS)"]
[null,null,"5- x`g lEifr ls izkIr fdjk;k & vk;",null,null,null,"24- vU; vk; ¼/kkjk 80 lh ds vUrxZr½ "]
[null,null,"6- x`gdj ",null,null,null,"25- vU; dksbZ Hkh izdkj NqV feyrh gSa tks /kkjk 10¼13&,½ o 10¼13½ds vUrxZr vkrh gks rks ;gk fy[ks ,oa vU; dj eqDr HkRrk ;gkW fy[ksaA"]
[null,null,"7- x`g _.k dh ewy fdLr ;gkW fy[kuh gSaA tks NwV ysuh gSaA",null,null,null,"26- /kkjk 80CCC - isa'ku Iyku gsrq va'knku"]
[null,null,"8- x`g _.k fdLr ij C;kt tks NwV ysuk gS] ;gkW fy[ksA",null,null,null,"27- vU; tek jkf'k ¼/kkjk 80 lh ds vUrxZr½ o E;qpvy QaM"]
[null,null,"9- thou chek izhfe;e ¼tks osru ls ugh dkVk x;k½ LIC",null,null,null,"28- /kkjk 80CCD(1B) -uohu isa'ku ;kstuk esa vfrfjDr va'knku ¼vf/kdre :- 50]000½"]
[null,null,"10- ih-,y-vkbZ- (PLI)",null,null,null,"29- /kkjk 80D - fpfdRlk chek izhfe;e "]
[null,null,"11- V;w'ku Qhl (Tution Fees)",null,null,null,"30- /kkjk 80DD - fodykax vkfJrksa ds fpfdRlk mipkj "]
[null,null,"12- ;w- ,y- vkbZ- ih-@okf\"kZd Iyku",null,null,null,"31- /kkjk 80DDB - fof'k\"V jksxksa ds mipkj gsrq dVkSrh ¼vf/kdre 40000 :½"]
[null,null,"13- jk\"Vªh; cpr i= (NSC)",null,null,null,"32- /kkjk 80E - mPp f'k{kk gsrq fy, _.k dk C;kt ¼/kkjk 80E½"]
[null,null,"14- jk\"Vªh; cpr i= ij vnr C;kt",null,null,null,"33- /kkjk 80G - /kekZFkZ laLFkkvksa vkfn dks fn;s nku ¼d Js.kh 100% ,oa [k Js.kh 50%½",null,{"$f":"SUM(E25)+ROUND(I25/2,0)","v":0}]
[null,null,"15- yksd Hkfo\"; fuf/k (PPF)",null,null,null,"34- /kkjk 80U - LFkkbZ :i ls 'kkjhfjd vleFkZrrk "]
[null,null,"16- jk\"Vªh; cpr Ldhe (NSS)",null,null,null,"35- /kkjk 80TTA - cpr [kkrs ij vf/kdre C;kt :- 10]000 194(IA)",null,1500]
[null,null,"17- lqdU;k le`f) ;kstuk (SSY)",null,null,null,"36- /kkjk 80 GGA - vuqeksfnr oSKkfud]lkekftd]xzkeh.k fodkl vkfn gsrq fn;k x;k nku"]
[null,null,"18-  Bonds ls C;kt",null,null,null,"37-   ,QMh vkfn vU; tek jkf'k ij izkIr dqy C;kt ¼ihih,Q dks NksM+dj½"]
[null,null,"19- vU; vk;  %",null,null,null,"38- jkgr /kkjk 89 ds rgr ¼ vxj NwV ysuh gS rks jkf'k fy[ksaA½",null,0]
[null,null,"/kkjk 80G - /kekZFkZ laLFkkvksa vkfn dks fn;s nku ¼d Js.kh 100 %½",null,null,null,"/kkjk 80G - /kekZFkZ laLFkkvksa vkfn dks fn;s nku ¼[k Js.kh 50 %½"]

{"sheet":"GA 55 ","index":4,"n_rows":31,"n_cols":29,"rows_kept":31,"cut":false,"hidden":true,"merged":[[1,1,1,25],[3,22,3,25],[3,26,3,28],[4,0,4,12],[4,13,4,25],[4,26,5,26],[4,27,5,27],[4,28,5,28],[3,0,3,1],[3,2,3,4],[3,6,3,8],[3,10,3,13],[2,12,2,15],[2,16,2,19],[2,20,2,26],[2,27,2,28],[2,8,2,11],[2,0,2,2],[2,3,2,7],[30,2,30,7],[30,18,30,26],[3,14,3,16],[3,17,3,21],[29,2,29,7],[29,18,29,26]]}
[]
[null,{"$f":"IF(AND('Master Data'!D4=\"\"),\"\",CONCATENATE(\"Office Name :- \",PROPER('Master Data'!D4)))","v":"Office Name :- Mahatma Gandhi Govt. School (English Medium) Bar, Pali"}]
["Employee Name :-",null,null,{"$f":"UPPER(IF('Master Data'!D6=\"\",\"\",'Master Data'!D6))","v":"HEERALAL JAT"},null,null,null,null,"Designation :-",null,null,null,{"$f":"UPPER(IF('Master Data'!H6=\"\",\"\",'Master Data'!H6))","v":"SR TEACHER"},null,null,null,"Posting Place :-",null,null,null,{"$f":"UPPER(IF('Master Data'!D8=\"\",\"\",'Master Data'!D8))","v":"M.G.G.S. BAR"},null,null,null,null,null,null,"osru Mªk ekufp="]
["PAN No. :-",null,{"$f":"UPPER(IF('Master Data'!D12=\"\",\"\",'Master Data'!D12))","v":"ABCDE1234H"},null,null,"SI No.",{"$f":"IF(AND('Master Data'!H14=\"\"),\"\",'Master Data'!H14)","v":123456},null,null,"GPF",{"$f":"IF(AND('Master Data'!D14=\"\"),\"\",'Master Data'!D14)","v":11},null,null,null,"PRAN No. :-",null,null,{"$f":"IF(AND('Master Data'!D16=\"\"),\"\",'Master Data'!D16)","v":12134545454541},null,null,null,null,"Bank A/C.",null,null,null,{"$f":"IF(AND('Master Data'!H16=\"\"),\"\",'Master Data'!H16)","v":121212121212121}]
["osru tks fn;k x;k",null,null,null,null,null,null,null,null,null,null,null,null,"dVkSfr;kWa tks dh xbZ",null,null,null,null,null,null,null,null,null,null,null,null,{"$f":"'GA55 Check & Edit'!AC6","v":"NET PAY"},{"$f":"'GA55 Check & Edit'!AD6","v":"TV.NO."},{"$f":"'GA55 Check & Edit'!AE6","v":"Enc.  DATE"}]
[{"$f":"IF(AND('GA55 Check & Edit'!C6=\"\"),\"\",'GA55 Check & Edit'!C6)","v":"S.N."},{"$f":"IF(AND('GA55 Check & Edit'!D6=\"\"),\"\",'GA55 Check & Edit'!D6)","v":"Month"},{"$f":"IF(AND('GA55 Check & Edit'!E6=\"\"),\"\",'GA55 Check & Edit'!E6)","v":"Basic with Grade Pay"},{"$f":"IF(AND('GA55 Check & Edit'!F6=\"\"),\"\",'GA55 Check & Edit'!F6)","v":"DA"},{"$f":"IF(AND('GA55 Check & Edit'!G6=\"\"),\"\",'GA55 Check & Edit'!G6)","v":"HRA"},{"$f":"IF(AND('GA55 Check & Edit'!H6=\"\"),\"\",'GA55 Check & Edit'!H6)","v":"Wash All."},{"$f":"IF(AND('GA55 Check & Edit'!I6=\"\"),\"\",'GA55 Check & Edit'!I6)","v":"Handi. All."},{"$f":"IF(AND('GA55 Check & Edit'!J6=\"\"),\"\",'GA55 Check & Edit'!J6)","v":"CCA"},{"$f":"IF(AND('GA55 Check & Edit'!K6=\"\"),\"\",'GA55 Check & Edit'!K6)","v":"other-1"},{"$f":"IF(AND('GA55 Check & Edit'!L6=\"\"),\"\",'GA55 Check & Edit'!L6)","v":"other-2"},{"$f":"IF(AND('GA55 Check & Edit'!M6=\"\"),\"\",'GA55 Check & Edit'!M6)","v":"Bonus"},{"$f":"IF(AND('GA55 Check & Edit'!N6=\"\"),\"\",'GA55 Check & Edit'!N6)","v":"N.P.S. By Govt."},{"$f":"IF(AND('GA55 Check & Edit'!O6=\"\"),\"\",'GA55 Check & Edit'!O6)","v":"TOTAL"},{"$f":"IF(AND('GA55 Check & Edit'!P6=\"\"),\"\",'GA55 Check & Edit'!P6)","v":"SI"},{"$f":"IF(AND('GA55 Check & Edit'!Q6=\"\"),\"\",'GA55 Check & Edit'!Q6)","v":"GPF / NPS"},{"$f":"IF(AND('GA55 Check & Edit'!R6=\"\"),\"\",'GA55 Check & Edit'!R6)","v":"L.I.C."},{"$f":"IF(AND('GA55 Check & Edit'!S6=\"\"),\"\",'GA55 Check & Edit'!S6)","v":"RPMF / RGHS"},{"$f":"IF(AND('GA55 Check & Edit'!T6=\"\"),\"\",'GA55 Check & Edit'!T6)","v":"SI Loan"},{"$f":"IF(AND('GA55 Check & Edit'!U6=\"\"),\"\",'GA55 Check & Edit'!U6)","v":"GPF Loan"},{"$f":"IF(AND('GA55 Check & Edit'!V6=\"\"),\"\",'GA55 Check & Edit'!V6)","v":"GPF 2004 (NPS)"},{"$f":"IF(AND('GA55 Check & Edit'!W6=\"\"),\"\",'GA55 Check & Edit'!W6)","v":"SI Int."},{"$f":"IF(AND('GA55 Check & Edit'!X6=\"\"),\"\",'GA55 Check & Edit'!X6)","v":"HITKARI NIDHI"},{"$f":"IF(AND('GA55 Check & Edit'!Y6=\"\"),\"\",'GA55 Check & Edit'!Y6)","v":"Other "},{"$f":"IF(AND('GA55 Check & Edit'!Z6=\"\"),\"\",'GA55 Check & Edit'!Z6)","v":"Income Tax"},{"$f":"IF(AND('GA55 Check & Edit'!AA6=\"\"),\"\",'GA55 Check & Edit'!AA6)","v":"G.I. + S. Tax"},{"$f":"IF(AND('GA55 Check & Edit'!AB6=\"\"),\"\",'GA55 Check & Edit'!AB6)","v":"Total Ded."}]
[1,{"$f":"IF(AND('GA55 Check & Edit'!D8=\"\"),\"\",'GA55 Check & Edit'!D8)","v":"2021-03-01"},{"$f":"IF(AND('GA55 Check & Edit'!E8=\"\"),\"\",'GA55 Check & Edit'!E8)","v":50800},{"$f":"IF(AND('GA55 Check & Edit'!F8=\"\"),\"\",'GA55 Check & Edit'!F8)","v":8636},{"$f":"IF(AND('GA55 Check & Edit'!G8=\"\"),\"\",'GA55 Check & Edit'!G8)","v":4064},{"$f":"IF(AND('GA55 Check & Edit'!H8=\"\"),\"\",'GA55 Check & Edit'!H8)","v":0},{"$f":"IF(AND('GA55 Check & Edit'!I8=\"\"),\"\",'GA55 Check & Edit'!I8)","v":"0"},{"$f":"IF(AND('GA55 Check & Edit'!J8=\"\"),\"\",'GA55 Check & Edit'!J8)","v":""},{"$f":"IF(AND('GA55 Check & Edit'!K8=\"\"),\"\",'GA55 Check & Edit'!K8)","v":0},{"$f":"IF(AND('GA55 Check & Edit'!L8=\"\"),\"\",'GA55 Check & Edit'!L8)","v":0},{"$f":"IF(AND('GA55 Check & Edit'!M8=\"\"),\"\",'GA55 Check & Edit'!M8)","v":""},{"$f":"IF(AND('GA55 Check & Edit'!N8=\"\"),\"\",'GA55 Check & Edit'!N8)","v":5944},{"$f":"IF(B7=\"\",\"\",IF('Master Data'!$H$18='GA55 Check & Edit'!$AO$5,SUM(C7:L7),SUM(C7:K7)))","v":63500},{"$f":"IF(AND('GA55 Check & Edit'!P8=\"\"),\"\",'GA55 Check & Edit'!P8)","v":7000},{"$f":"IF(AND('GA55 Check & Edit'!Q8=\"\"),\"\",'GA55 Check & Edit'!Q8)","v":5944},{"$f":"IF(AND('GA55 Check & Edit'!R8=\"\"),\"\",'GA55 Check & Edit'!R8)","v":1880},{"$f":"IF(AND('GA55 Check & Edit'!S8=\"\"),\"\",'GA55 Check & Edit'!S8)","v":0},{"$f":"IF(AND('GA55 Check & Edit'!T8=\"\"),\"\",'GA55 Check & Edit'!T8)","v":0},{"$f":"IF(AND('GA55 Check & Edit'!U8=\"\"),\"\",'GA55 Check & Edit'!U8)","v":0},{"$f":"IF(AND('GA55 Check & Edit'!V8=\"\"),\"\",'GA55 Check & Edit'!V8)","v":0},{"$f":"IF(AND('GA55 Check & Edit'!W8=\"\"),\"\",'GA55 Check & Edit'!W8)","v":0},{"$f":"IF(AND('GA55 Check & Edit'!X8=\"\"),\"\",'GA55 Check & Edit'!X8)","v":""},{"$f":"IF(AND('GA55 Check & Edit'!Y8=\"\"),\"\",'GA55 Check & Edit'!Y8)","v":0},{"$f":"IF(AND('GA55 Check & Edit'!Z8=\"\"),\"\",'GA55 Check & Edit'!Z8)","v":0},{"$f":"IF(AND('GA55 Check & Edit'!AA8=\"\"),\"\",'GA55 Check & Edit'!AA8)","v":""},{"$f":"IFERROR(IF(B7=\"\",\"\",IF(L7=\"\",SUM(N7:Y7),IF('Master Data'!$H$18='GA55 Check & Edit'!$AO$5,SUM(N7:Y7)+L7,SUM(N7:Y7)))),0)","v":14824},{"$f":"IFERROR(IF(AND(C7=\"\",M7=\"\",Z7=\"\"),\"\",SUM(M7-Z7)),\"\")","v":48676}]
[2,{"$f":"IF(AND('GA55 Check & Edit'!D9=\"\"),\"\",'GA55 Check & Edit'!D9)","v":"2021-04-01"},{"$f":"IF(AND('GA55 Check & Edit'!E9=\"\"),\"\",'GA55 Check & Edit'!E9)","v":50800},{"$f":"IF(AND('GA55 Check & Edit'!F9=\"\"),\"\",'GA55 Check & Edit'!F9)","v":8636},{"$f":"IF(AND('GA55 Check & Edit'!G9=\"\"),\"\",'GA55 Check & Edit'!G9)","v":4064},{"$f":"IF(AND('GA55 Check & Edit'!H9=\"\"),\"\",'GA55 Check & Edit'!H9)","v":0},{"$f":"IF(AND('GA55 Check & Edit'!I9=\"\"),\"\",'GA55 Check & Edit'!I9)","v":"0"},{"$f":"IF(AND('GA55 Check & Edit'!J9=\"\"),\"\",'GA55 Check & Edit'!J9)","v":""},{"$f":"IF(AND('GA55 Check & Edit'!K9=\"\"),\"\",'GA55 Check & Edit'!K9)","v":0},{"$f":"IF(AND('GA55 Check & Edit'!L9=\"\"),\"\",'GA55 Check & Edit'!L9)","v":0},{"$f":"IF(AND('GA55 Check & Edit'!M9=\"\"),\"\",'GA55 Check & Edit'!M9)","v":""},{"$f":"IF(AND('GA55 Check & Edit'!N9=\"\"),\"\",'GA55 Check & Edit'!N9)","v":5944},{"$f":"IF(B8=\"\",\"\",IF('Master Data'!$H$18='GA55 Check & Edit'!$AO$5,SUM(C8:L8),SUM(C8:K8)))","v":63500},{"$f":"IF(AND('GA55 Check & Edit'!P9=\"\"),\"\",'GA55 Check & Edit'!P9)","v":7000},{"$f":"IF(AND('GA55 Check & Edit'!Q9=\"\"),\"\",'GA55 Check & Edit'!Q9)","v":5944},{"$f":"IF(AND('GA55 Check & Edit'!R9=\"\"),\"\",'GA55 Check & Edit'!R9)","v":1880},{"$f":"IF(AND('GA55 Check & Edit'!S9=\"\"),\"\",'GA55 Check & Edit'!S9)","v":0},{"$f":"IF(AND('GA55 Check & Edit'!T9=\"\"),\"\",'GA55 Check & Edit'!T9)","v":0},{"$f":"IF(AND('GA55 Check & Edit'!U9=\"\"),\"\",'GA55 Check & Edit'!U9)","v":0},{"$f":"IF(AND('GA55 Check & Edit'!V9=\"\"),\"\",'GA55 Check & Edit'!V9)","v":0},{"$f":"IF(AND('GA55 Check & Edit'!W9=\"\"),\"\",'GA55 Check & Edit'!W9)","v":0},{"$f":"IF(AND('GA55 Check & Edit'!X9=\"\"),\"\",'GA55 Check & Edit'!X9)","v":""},{"$f":"IF(AND('GA55 Check & Edit'!Y9=\"\"),\"\",'GA55 Check & Edit'!Y9)","v":0},{"$f":"IF(AND('GA55 Check & Edit'!Z9=\"\"),\"\",'GA55 Check & Edit'!Z9)","v":1500},{"$f":"IF(AND('GA55 Check & Edit'!AA9=\"\"),\"\",'GA55 Check & Edit'!AA9)","v":220},{"$f":"IFERROR(IF(B8=\"\",\"\",IF(L8=\"\",SUM(N8:Y8),IF('Master Data'!$H$18='GA55 Check & Edit'!$AO$5,SUM(N8:Y8)+L8,SUM(N8:Y8)))),0)","v":16544},{"$f":"IFERROR(IF(AND(C8=\"\",M8=\"\",Z8=\"\"),\"\",SUM(M8-Z8)),\"\")","v":46956}]
[3,{"$f":"IF(AND('GA55 Check & Edit'!D10=\"\"),\"\",'GA55 Check & Edit'!D10)","v":"2021-05-01"},{"$f":"IF(AND('GA55 Check & Edit'!E10=\"\"),\"\",'GA55 Check & Edit'!E10)","v":50800},{"$f":"IF(AND('GA55 Check & Edit'!F10=\"\"),\"\",'GA55 Check & Edit'!F10)","v":8636},{"$f":"IF(AND('GA55 Check & Edit'!G10=\"\"),\"\",'GA55 Check & Edit'!G10)","v":4064},{"$f":"IF(AND('GA55 Check & Edit'!H10=\"\"),\"\",'GA55 Check & Edit'!H10)","v":0},{"$f":"IF(AND('GA55 Check & Edit'!I10=\"\"),\"\",'GA55 Check & Edit'!I10)","v":"0"},{"$f":"IF(AND('GA55 Check & Edit'!J10=\"\"),\"\",'GA55 Check & Edit'!J10)","v":""},{"$f":"IF(AND('GA55 Check & Edit'!K10=\"\"),\"\",'GA55 Check & Edit'!K10)","v":0},{"$f":"IF(AND('GA55 Check & Edit'!L10=\"\"),\"\",'GA55 Check & Edit'!L10)","v":0},{"$f":"IF(AND('GA55 Check & Edit'!M10=\"\"),\"\",'GA55 Check & Edit'!M10)","v":""},{"$f":"IF(AND('GA55 Check & Edit'!N10=\"\"),\"\",'GA55 Check & Edit'!N10)","v":5944},{"$f":"IF(B9=\"\",\"\",IF('Master Data'!$H$18='GA55 Check & Edit'!$AO$5,SUM(C9:L9),SUM(C9:K9)))","v":63500},{"$f":"IF(AND('GA55 Check & Edit'!P10=\"\"),\"\",'GA55 Check & Edit'!P10)","v":7000},{"$f":"IF(AND('GA55 Check & Edit'!Q10=\"\"),\"\",'GA55 Check & Edit'!Q10)","v":5944},{"$f":"IF(AND('GA55 Check & Edit'!R10=\"\"),\"\",'GA55 Check & Edit'!R10)","v":1880},{"$f":"IF(AND('GA55 Check & Edit'!S10=\"\"),\"\",'GA55 Check & Edit'!S10)","v":0},{"$f":"IF(AND('GA55 Check & Edit'!T10=\"\"),\"\",'GA55 Check & Edit'!T10)","v":0},{"$f":"IF(AND('GA55 Check & Edit'!U10=\"\"),\"\",'GA55 Check & Edit'!U10)","v":0},{"$f":"IF(AND('GA55 Check & Edit'!V10=\"\"),\"\",'GA55 Check & Edit'!V10)","v":0},{"$f":"IF(AND('GA55 Check & Edit'!W10=\"\"),\"\",'GA55 Check & Edit'!W10)","v":0},{"$f":"IF(AND('GA55 Check & Edit'!X10=\"\"),\"\",'GA55 Check & Edit'!X10)","v":""},{"$f":"IF(AND('GA55 Check & Edit'!Y10=\"\"),\"\",'GA55 Check & Edit'!Y10)","v":0},{"$f":"IF(AND('GA55 Check & Edit'!Z10=\"\"),\"\",'GA55 Check & Edit'!Z10)","v":1500},{"$f":"IF(AND('GA55 Check & Edit'!AA10=\"\"),\"\",'GA55 Check & Edit'!AA10)","v":""},{"$f":"IFERROR(IF(B9=\"\",\"\",IF(L9=\"\",SUM(N9:Y9),IF('Master Data'!$H$18='GA55 Check & Edit'!$AO$5,SUM(N9:Y9)+L9,SUM(N9:Y9)))),0)","v":16324},47176]
[4,{"$f":"IF(AND('GA55 Check & Edit'!D11=\"\"),\"\",'GA55 Check & Edit'!D11)","v":"2021-06-01"},{"$f":"IF(AND('GA55 Check & Edit'!E11=\"\"),\"\",'GA55 Check & Edit'!E11)","v":50800},{"$f":"IF(AND('GA55 Check & Edit'!F11=\"\"),\"\",'GA55 Check & Edit'!F11)","v":8636},{"$f":"IF(AND('GA55 Check & Edit'!G11=\"\"),\"\",'GA55 Check & Edit'!G11)","v":4064},{"$f":"IF(AND('GA55 Check & Edit'!H11=\"\"),\"\",'GA55 Check & Edit'!H11)","v":0},{"$f":"IF(AND('GA55 Check & Edit'!I11=\"\"),\"\",'GA55 Check & Edit'!I11)","v":"0"},{"$f":"IF(AND('GA55 Check & Edit'!J11=\"\"),\"\",'GA55 Check & Edit'!J11)","v":""},{"$f":"IF(AND('GA55 Check & Edit'!K11=\"\"),\"\",'GA55 Check & Edit'!K11)","v":0},{"$f":"IF(AND('GA55 Check & Edit'!L11=\"\"),\"\",'GA55 Check & Edit'!L11)","v":0},{"$f":"IF(AND('GA55 Check & Edit'!M11=\"\"),\"\",'GA55 Check & Edit'!M11)","v":""},{"$f":"IF(AND('GA55 Check & Edit'!N11=\"\"),\"\",'GA55 Check & Edit'!N11)","v":5944},{"$f":"IF(B10=\"\",\"\",IF('Master Data'!$H$18='GA55 Check & Edit'!$AO$5,SUM(C10:L10),SUM(C10:K10)))","v":63500},{"$f":"IF(AND('GA55 Check & Edit'!P11=\"\"),\"\",'GA55 Check & Edit'!P11)","v":7000},{"$f":"IF(AND('GA55 Check & Edit'!Q11=\"\"),\"\",'GA55 Check & Edit'!Q11)","v":5944},{"$f":"IF(AND('GA55 Check & Edit'!R11=\"\"),\"\",'GA55 Check & Edit'!R11)","v":1880},{"$f":"IF(AND('GA55 Check & Edit'!S11=\"\"),\"\",'GA55 Check & Edit'!S11)","v":0},{"$f":"IF(AND('GA55 Check & Edit'!T11=\"\"),\"\",'GA55 Check & Edit'!T11)","v":0},{"$f":"IF(AND('GA55 Check & Edit'!U11=\"\"),\"\",'GA55 Check & Edit'!U11)","v":0},{"$f":"IF(AND('GA55 Check & Edit'!V11=\"\"),\"\",'GA55 Check & Edit'!V11)","v":0},{"$f":"IF(AND('GA55 Check & Edit'!W11=\"\"),\"\",'GA55 Check & Edit'!W11)","v":0},{"$f":"IF(AND('GA55 Check & Edit'!X11=\"\"),\"\",'GA55 Check & Edit'!X11)","v":""},{"$f":"IF(AND('GA55 Check & Edit'!Y11=\"\"),\"\",'GA55 Check & Edit'!Y11)","v":0},{"$f":"IF(AND('GA55 Check & Edit'!Z11=\"\"),\"\",'GA55 Check & Edit'!Z11)","v":1500},{"$f":"IF(AND('GA55 Check & Edit'!AA11=\"\"),\"\",'GA55 Check & Edit'!AA11)","v":""},{"$f":"IFERROR(IF(B10=\"\",\"\",IF(L10=\"\",SUM(N10:Y10),IF('Master Data'!$H$18='GA55 Check & Edit'!$AO$5,SUM(N10:Y10)+L10,SUM(N10:Y10)))),0)","v":16324},47176]
[5,{"$f":"IF(AND('GA55 Check & Edit'!D12=\"\"),\"\",'GA55 Check & Edit'!D12)","v":"2021-07-01"},{"$f":"IF(AND('GA55 Check & Edit'!E12=\"\"),\"\",'GA55 Check & Edit'!E12)","v":52300},{"$f":"IF(AND('GA55 Check & Edit'!F12=\"\"),\"\",'GA55 Check & Edit'!F12)","v":14644},{"$f":"IF(AND('GA55 Check & Edit'!G12=\"\"),\"\",'GA55 Check & Edit'!G12)","v":4184},{"$f":"IF(AND('GA55 Check & Edit'!H12=\"\"),\"\",'GA55 Check & Edit'!H12)","v":0},{"$f":"IF(AND('GA55 Check & Edit'!I12=\"\"),\"\",'GA55 Check & Edit'!I12)","v":"0"},{"$f":"IF(AND('GA55 Check & Edit'!J12=\"\"),\"\",'GA55 Check & Edit'!J12)","v":""},{"$f":"IF(AND('GA55 Check & Edit'!K12=\"\"),\"\",'GA55 Check & Edit'!K12)","v":0},{"$f":"IF(AND('GA55 Check & Edit'!L12=\"\"),\"\",'GA55 Check & Edit'!L12)","v":0},{"$f":"IF(AND('GA55 Check & Edit'!M12=\"\"),\"\",'GA55 Check & Edit'!M12)","v":""},{"$f":"IF(AND('GA55 Check & Edit'!N12=\"\"),\"\",'GA55 Check & Edit'!N12)","v":6694},{"$f":"IF(B11=\"\",\"\",IF('Master Data'!$H$18='GA55 Check & Edit'!$AO$5,SUM(C11:L11),SUM(C11:K11)))","v":71128},{"$f":"IF(AND('GA55 Check & Edit'!P12=\"\"),\"\",'GA55 Check & Edit'!P12)","v":7000},{"$f":"IF(AND('GA55 Check & Edit'!Q12=\"\"),\"\",'GA55 Check & Edit'!Q12)","v":6694},{"$f":"IF(AND('GA55 Check & Edit'!R12=\"\"),\"\",'GA55 Check & Edit'!R12)","v":1880},{"$f":"IF(AND('GA55 Check & Edit'!S12=\"\"),\"\",'GA55 Check & Edit'!S12)","v":0},{"$f":"IF(AND('GA55 Check & Edit'!T12=\"\"),\"\",'GA55 Check & Edit'!T12)","v":0},{"$f":"IF(AND('GA55 Check & Edit'!U12=\"\"),\"\",'GA55 Check & Edit'!U12)","v":0},{"$f":"IF(AND('GA55 Check & Edit'!V12=\"\"),\"\",'GA55 Check & Edit'!V12)","v":0},{"$f":"IF(AND('GA55 Check & Edit'!W12=\"\"),\"\",'GA55 Check & Edit'!W12)","v":0},{"$f":"IF(AND('GA55 Check & Edit'!X12=\"\"),\"\",'GA55 Check & Edit'!X12)","v":""},{"$f":"IF(AND('GA55 Check & Edit'!Y12=\"\"),\"\",'GA55 Check & Edit'!Y12)","v":0},{"$f":"IF(AND('GA55 Check & Edit'!Z12=\"\"),\"\",'GA55 Check & Edit'!Z12)","v":1500},{"$f":"IF(AND('GA55 Check & Edit'!AA12=\"\"),\"\",'GA55 Check & Edit'!AA12)","v":""},{"$f":"IFERROR(IF(B11=\"\",\"\",IF(L11=\"\",SUM(N11:Y11),IF('Master Data'!$H$18='GA55 Check & Edit'!$AO$5,SUM(N11:Y11)+L11,SUM(N11:Y11)))),0)","v":17074},54054]
[6,{"$f":"IF(AND('GA55 Check & Edit'!D13=\"\"),\"\",'GA55 Check & Edit'!D13)","v":"2021-08-01"},{"$f":"IF(AND('GA55 Check & Edit'!E13=\"\"),\"\",'GA55 Check & Edit'!E13)","v":52300},{"$f":"IF(AND('GA55 Check & Edit'!F13=\"\"),\"\",'GA55 Check & Edit'!F13)","v":14644},{"$f":"IF(AND('GA55 Check & Edit'!G13=\"\"),\"\",'GA55 Check & Edit'!G13)","v":4707},{"$f":"IF(AND('GA55 Check & Edit'!H13=\"\"),\"\",'GA55 Check & Edit'!H13)","v":0},{"$f":"IF(AND('GA55 Check & Edit'!I13=\"\"),\"\",'GA55 Check & Edit'!I13)","v":"0"},{"$f":"IF(AND('GA55 Check & Edit'!J13=\"\"),\"\",'GA55 Check & Edit'!J13)","v":""},{"$f":"IF(AND('GA55 Check & Edit'!K13=\"\"),\"\",'GA55 Check & Edit'!K13)","v":0},{"$f":"IF(AND('GA55 Check & Edit'!L13=\"\"),\"\",'GA55 Check & Edit'!L13)","v":0},{"$f":"IF(AND('GA55 Check & Edit'!M13=\"\"),\"\",'GA55 Check & Edit'!M13)","v":""},{"$f":"IF(AND('GA55 Check & Edit'!N13=\"\"),\"\",'GA55 Check & Edit'!N13)","v":6694},{"$f":"IF(B12=\"\",\"\",IF('Master Data'!$H$18='GA55 Check & Edit'!$AO$5,SUM(C12:L12),SUM(C12:K12)))","v":71651},{"$f":"IF(AND('GA55 Check & Edit'!P13=\"\"),\"\",'GA55 Check & Edit'!P13)","v":7000},{"$f":"IF(AND('GA55 Check & Edit'!Q13=\"\"),\"\",'GA55 Check & Edit'!Q13)","v":6694},{"$f":"IF(AND('GA55 Check & Edit'!R13=\"\"),\"\",'GA55 Check & Edit'!R13)","v":1880},{"$f":"IF(AND('GA55 Check & Edit'!S13=\"\"),\"\",'GA55 Check & Edit'!S13)","v":0},{"$f":"IF(AND('GA55 Check & Edit'!T13=\"\"),\"\",'GA55 Check & Edit'!T13)","v":0},{"$f":"IF(AND('GA55 Check & Edit'!U13=\"\"),\"\",'GA55 Check & Edit'!U13)","v":0},{"$f":"IF(AND('GA55 Check & Edit'!V13=\"\"),\"\",'GA55 Check & Edit'!V13)","v":0},{"$f":"IF(AND('GA55 Check & Edit'!W13=\"\"),\"\",'GA55 Check & Edit'!W13)","v":0},{"$f":"IF(AND('GA55 Check & Edit'!X13=\"\"),\"\",'GA55 Check & Edit'!X13)","v":""},{"$f":"IF(AND('GA55 Check & Edit'!Y13=\"\"),\"\",'GA55 Check & Edit'!Y13)","v":0},{"$f":"IF(AND('GA55 Check & Edit'!Z13=\"\"),\"\",'GA55 Check & Edit'!Z13)","v":1500},{"$f":"IF(AND('GA55 Check & Edit'!AA13=\"\"),\"\",'GA55 Check & Edit'!AA13)","v":""},{"$f":"IFERROR(IF(B12=\"\",\"\",IF(L12=\"\",SUM(N12:Y12),IF('Master Data'!$H$18='GA55 Check & Edit'!$AO$5,SUM(N12:Y12)+L12,SUM(N12:Y12)))),0)","v":17074},54577]
[7,{"$f":"IF(AND('GA55 Check & Edit'!D14=\"\"),\"\",'GA55 Check & Edit'!D14)","v":"2021-09-01"},{"$f":"IF(AND('GA55 Check & Edit'!E14=\"\"),\"\",'GA55 Check & Edit'!E14)","v":52300},{"$f":"IF(AND('GA55 Check & Edit'!F14=\"\"),\"\",'GA55 Check & Edit'!F14)","v":14644},{"$f":"IF(AND('GA55 Check & Edit'!G14=\"\"),\"\",'GA55 Check & Edit'!G14)","v":4707},{"$f":"IF(AND('GA55 Check & Edit'!H14=\"\"),\"\",'GA55 Check & Edit'!H14)","v":0},{"$f":"IF(AND('GA55 Check & Edit'!I14=\"\"),\"\",'GA55 Check & Edit'!I14)","v":"0"},{"$f":"IF(AND('GA55 Check & Edit'!J14=\"\"),\"\",'GA55 Check & Edit'!J14)","v":""},{"$f":"IF(AND('GA55 Check & Edit'!K14=\"\"),\"\",'GA55 Check & Edit'!K14)","v":0},{"$f":"IF(AND('GA55 Check & Edit'!L14=\"\"),\"\",'GA55 Check & Edit'!L14)","v":0},{"$f":"IF(AND('GA55 Check & Edit'!M14=\"\"),\"\",'GA55 Check & Edit'!M14)","v":""},{"$f":"IF(AND('GA55 Check & Edit'!N14=\"\"),\"\",'GA55 Check & Edit'!N14)","v":6694},{"$f":"IF(B13=\"\",\"\",IF('Master Data'!$H$18='GA55 Check & Edit'!$AO$5,SUM(C13:L13),SUM(C13:K13)))","v":71651},{"$f":"IF(AND('GA55 Check & Edit'!P14=\"\"),\"\",'GA55 Check & Edit'!P14)","v":7000},{"$f":"IF(AND('GA55 Check & Edit'!Q14=\"\"),\"\",'GA55 Check & Edit'!Q14)","v":6694},{"$f":"IF(AND('GA55 Check & Edit'!R14=\"\"),\"\",'GA55 Check & Edit'!R14)","v":1880},{"$f":"IF(AND('GA55 Check & Edit'!S14=\"\"),\"\",'GA55 Check & Edit'!S14)","v":0},{"$f":"IF(AND('GA55 Check & Edit'!T14=\"\"),\"\",'GA55 Check & Edit'!T14)","v":0},{"$f":"IF(AND('GA55 Check & Edit'!U14=\"\"),\"\",'GA55 Check & Edit'!U14)","v":0},{"$f":"IF(AND('GA55 Check & Edit'!V14=\"\"),\"\",'GA55 Check & Edit'!V14)","v":0},{"$f":"IF(AND('GA55 Check & Edit'!W14=\"\"),\"\",'GA55 Check & Edit'!W14)","v":0},{"$f":"IF(AND('GA55 Check & Edit'!X14=\"\"),\"\",'GA55 Check & Edit'!X14)","v":""},{"$f":"IF(AND('GA55 Check & Edit'!Y14=\"\"),\"\",'GA55 Check & Edit'!Y14)","v":0},{"$f":"IF(AND('GA55 Check & Edit'!Z14=\"\"),\"\",'GA55 Check & Edit'!Z14)","v":1500},{"$f":"IF(AND('GA55 Check & Edit'!AA14=\"\"),\"\",'GA55 Check & Edit'!AA14)","v":""},{"$f":"IFERROR(IF(B13=\"\",\"\",IF(L13=\"\",SUM(N13:Y13),IF('Master Data'!$H$18='GA55 Check & Edit'!$AO$5,SUM(N13:Y13)+L13,SUM(N13:Y13)))),0)","v":17074},54577]
[8,{"$f":"IF(AND('GA55 Check & Edit'!D15=\"\"),\"\",'GA55 Check & Edit'!D15)","v":"2021-10-01"},{"$f":"IF(AND('GA55 Check & Edit'!E15=\"\"),\"\",'GA55 Check & Edit'!E15)","v":52300},{"$f":"IF(AND('GA55 Check & Edit'!F15=\"\"),\"\",'GA55 Check & Edit'!F15)","v":16213},{"$f":"IF(AND('GA55 Check & Edit'!G15=\"\"),\"\",'GA55 Check & Edit'!G15)","v":4707},{"$f":"IF(AND('GA55 Check & Edit'!H15=\"\"),\"\",'GA55 Check & Edit'!H15)","v":0},{"$f":"IF(AND('GA55 Check & Edit'!I15=\"\"),\"\",'GA55 Check & Edit'!I15)","v":"0"},{"$f":"IF(AND('GA55 Check & Edit'!J15=\"\"),\"\",'GA55 Check & Edit'!J15)","v":""},{"$f":"IF(AND('GA55 Check & Edit'!K15=\"\"),\"\",'GA55 Check & Edit'!K15)","v":0},{"$f":"IF(AND('GA55 Check & Edit'!L15=\"\"),\"\",'GA55 Check & Edit'!L15)","v":0},{"$f":"IF(AND('GA55 Check & Edit'!M15=\"\"),\"\",'GA55 Check & Edit'!M15)","v":""},{"$f":"IF(AND('GA55 Check & Edit'!N15=\"\"),\"\",'GA55 Check & Edit'!N15)","v":6851},{"$f":"IF(B14=\"\",\"\",IF('Master Data'!$H$18='GA55 Check & Edit'!$AO$5,SUM(C14:L14),SUM(C14:K14)))","v":73220},{"$f":"IF(AND('GA55 Check & Edit'!P15=\"\"),\"\",'GA55 Check & Edit'!P15)","v":7000},{"$f":"IF(AND('GA55 Check & Edit'!Q15=\"\"),\"\",'GA55 Check & Edit'!Q15)","v":6851},{"$f":"IF(AND('GA55 Check & Edit'!R15=\"\"),\"\",'GA55 Check & Edit'!R15)","v":1880},{"$f":"IF(AND('GA55 Check & Edit'!S15=\"\"),\"\",'GA55 Check & Edit'!S15)","v":0},{"$f":"IF(AND('GA55 Check & Edit'!T15=\"\"),\"\",'GA55 Check & Edit'!T15)","v":0},{"$f":"IF(AND('GA55 Check & Edit'!U15=\"\"),\"\",'GA55 Check & Edit'!U15)","v":0},{"$f":"IF(AND('GA55 Check & Edit'!V15=\"\"),\"\",'GA55 Check & Edit'!V15)","v":0},{"$f":"IF(AND('GA55 Check & Edit'!W15=\"\"),\"\",'GA55 Check & Edit'!W15)","v":0},{"$f":"IF(AND('GA55 Check & Edit'!X15=\"\"),\"\",'GA55 Check & Edit'!X15)","v":""},{"$f":"IF(AND('GA55 Check & Edit'!Y15=\"\"),\"\",'GA55 Check & Edit'!Y15)","v":0},{"$f":"IF(AND('GA55 Check & Edit'!Z15=\"\"),\"\",'GA55 Check & Edit'!Z15)","v":1500},{"$f":"IF(AND('GA55 Check & Edit'!AA15=\"\"),\"\",'GA55 Check & Edit'!AA15)","v":""},{"$f":"IFERROR(IF(B14=\"\",\"\",IF(L14=\"\",SUM(N14:Y14),IF('Master Data'!$H$18='GA55 Check & Edit'!$AO$5,SUM(N14:Y14)+L14,SUM(N14:Y14)))),0)","v":17231},55989]
[9,{"$f":"IF(AND('GA55 Check & Edit'!D16=\"\"),\"\",'GA55 Check & Edit'!D16)","v":"2021-11-01"},{"$f":"IF(AND('GA55 Check & Edit'!E16=\"\"),\"\",'GA55 Check & Edit'!E16)","v":52300},{"$f":"IF(AND('GA55 Check & Edit'!F16=\"\"),\"\",'GA55 Check & Edit'!F16)","v":16213},{"$f":"IF(AND('GA55 Check & Edit'!G16=\"\"),\"\",'GA55 Check & Edit'!G16)","v":4707},{"$f":"IF(AND('GA55 Check & Edit'!H16=\"\"),\"\",'GA55 Check & Edit'!H16)","v":0},{"$f":"IF(AND('GA55 Check & Edit'!I16=\"\"),\"\",'GA55 Check & Edit'!I16)","v":"0"},{"$f":"IF(AND('GA55 Check & Edit'!J16=\"\"),\"\",'GA55 Check & Edit'!J16)","v":""},{"$f":"IF(AND('GA55 Check & Edit'!K16=\"\"),\"\",'GA55 Check & Edit'!K16)","v":0},{"$f":"IF(AND('GA55 Check & Edit'!L16=\"\"),\"\",'GA55 Check & Edit'!L16)","v":0},{"$f":"IF(AND('GA55 Check & Edit'!M16=\"\"),\"\",'GA55 Check & Edit'!M16)","v":""},{"$f":"IF(AND('GA55 Check & Edit'!N16=\"\"),\"\",'GA55 Check & Edit'!N16)","v":6851},{"$f":"IF(B15=\"\",\"\",IF('Master Data'!$H$18='GA55 Check & Edit'!$AO$5,SUM(C15:L15),SUM(C15:K15)))","v":73220},{"$f":"IF(AND('GA55 Check & Edit'!P16=\"\"),\"\",'GA55 Check & Edit'!P16)","v":7000},{"$f":"IF(AND('GA55 Check & Edit'!Q16=\"\"),\"\",'GA55 Check & Edit'!Q16)","v":6851},{"$f":"IF(AND('GA55 Check & Edit'!R16=\"\"),\"\",'GA55 Check & Edit'!R16)","v":1880},{"$f":"IF(AND('GA55 Check & Edit'!S16=\"\"),\"\",'GA55 Check & Edit'!S16)","v":0},{"$f":"IF(AND('GA55 Check & Edit'!T16=\"\"),\"\",'GA55 Check & Edit'!T16)","v":0},{"$f":"IF(AND('GA55 Check & Edit'!U16=\"\"),\"\",'GA55 Check & Edit'!U16)","v":0},{"$f":"IF(AND('GA55 Check & Edit'!V16=\"\"),\"\",'GA55 Check & Edit'!V16)","v":0},{"$f":"IF(AND('GA55 Check & Edit'!W16=\"\"),\"\",'GA55 Check & Edit'!W16)","v":0},{"$f":"IF(AND('GA55 Check & Edit'!X16=\"\"),\"\",'GA55 Check & Edit'!X16)","v":""},{"$f":"IF(AND('GA55 Check & Edit'!Y16=\"\"),\"\",'GA55 Check & Edit'!Y16)","v":0},{"$f":"IF(AND('GA55 Check & Edit'!Z16=\"\"),\"\",'GA55 Check & Edit'!Z16)","v":1500},{"$f":"IF(AND('GA55 Check & Edit'!AA16=\"\"),\"\",'GA55 Check & Edit'!AA16)","v":""},{"$f":"IFERROR(IF(B15=\"\",\"\",IF(L15=\"\",SUM(N15:Y15),IF('Master Data'!$H$18='GA55 Check & Edit'!$AO$5,SUM(N15:Y15)+L15,SUM(N15:Y15)))),0)","v":17231},55989]
[10,{"$f":"IF(AND('GA55 Check & Edit'!D17=\"\"),\"\",'GA55 Check & Edit'!D17)","v":"2021-12-01"},{"$f":"IF(AND('GA55 Check & Edit'!E17=\"\"),\"\",'GA55 Check & Edit'!E17)","v":52300},{"$f":"IF(AND('GA55 Check & Edit'!F17=\"\"),\"\",'GA55 Check & Edit'!F17)","v":16213},{"$f":"IF(AND('GA55 Check & Edit'!G17=\"\"),\"\",'GA55 Check & Edit'!G17)","v":4707},{"$f":"IF(AND('GA55 Check & Edit'!H17=\"\"),\"\",'GA55 Check & Edit'!H17)","v":0},{"$f":"IF(AND('GA55 Check & Edit'!I17=\"\"),\"\",'GA55 Check & Edit'!I17)","v":"0"},{"$f":"IF(AND('GA55 Check & Edit'!J17=\"\"),\"\",'GA55 Check & Edit'!J17)","v":""},{"$f":"IF(AND('GA55 Check & Edit'!K17=\"\"),\"\",'GA55 Check & Edit'!K17)","v":0},{"$f":"IF(AND('GA55 Check & Edit'!L17=\"\"),\"\",'GA55 Check & Edit'!L17)","v":0},{"$f":"IF(AND('GA55 Check & Edit'!M17=\"\"),\"\",'GA55 Check & Edit'!M17)","v":""},{"$f":"IF(AND('GA55 Check & Edit'!N17=\"\"),\"\",'GA55 Check & Edit'!N17)","v":6851},{"$f":"IF(B16=\"\",\"\",IF('Master Data'!$H$18='GA55 Check & Edit'!$AO$5,SUM(C16:L16),SUM(C16:K16)))","v":73220},{"$f":"IF(AND('GA55 Check & Edit'!P17=\"\"),\"\",'GA55 Check & Edit'!P17)","v":7000},{"$f":"IF(AND('GA55 Check & Edit'!Q17=\"\"),\"\",'GA55 Check & Edit'!Q17)","v":6851},{"$f":"IF(AND('GA55 Check & Edit'!R17=\"\"),\"\",'GA55 Check & Edit'!R17)","v":1880},{"$f":"IF(AND('GA55 Check & Edit'!S17=\"\"),\"\",'GA55 Check & Edit'!S17)","v":0},{"$f":"IF(AND('GA55 Check & Edit'!T17=\"\"),\"\",'GA55 Check & Edit'!T17)","v":0},{"$f":"IF(AND('GA55 Check & Edit'!U17=\"\"),\"\",'GA55 Check & Edit'!U17)","v":0},{"$f":"IF(AND('GA55 Check & Edit'!V17=\"\"),\"\",'GA55 Check & Edit'!V17)","v":0},{"$f":"IF(AND('GA55 Check & Edit'!W17=\"\"),\"\",'GA55 Check & Edit'!W17)","v":0},{"$f":"IF(AND('GA55 Check & Edit'!X17=\"\"),\"\",'GA55 Check & Edit'!X17)","v":250},{"$f":"IF(AND('GA55 Check & Edit'!Y17=\"\"),\"\",'GA55 Check & Edit'!Y17)","v":0},{"$f":"IF(AND('GA55 Check & Edit'!Z17=\"\"),\"\",'GA55 Check & Edit'!Z17)","v":1500},{"$f":"IF(AND('GA55 Check & Edit'!AA17=\"\"),\"\",'GA55 Check & Edit'!AA17)","v":""},{"$f":"IFERROR(IF(B16=\"\",\"\",IF(L16=\"\",SUM(N16:Y16),IF('Master Data'!$H$18='GA55 Check & Edit'!$AO$5,SUM(N16:Y16)+L16,SUM(N16:Y16)))),0)","v":17481},55739]
[11,{"$f":"IF(AND('GA55 Check & Edit'!D18=\"\"),\"\",'GA55 Check & Edit'!D18)","v":"2022-01-01"},{"$f":"IF(AND('GA55 Check & Edit'!E18=\"\"),\"\",'GA55 Check & Edit'!E18)","v":52300},{"$f":"IF(AND('GA55 Check & Edit'!F18=\"\"),\"\",'GA55 Check & Edit'!F18)","v":16213},{"$f":"IF(AND('GA55 Check & Edit'!G18=\"\"),\"\",'GA55 Check & Edit'!G18)","v":4707},{"$f":"IF(AND('GA55 Check & Edit'!H18=\"\"),\"\",'GA55 Check & Edit'!H18)","v":0},{"$f":"IF(AND('GA55 Check & Edit'!I18=\"\"),\"\",'GA55 Check & Edit'!I18)","v":"0"},{"$f":"IF(AND('GA55 Check & Edit'!J18=\"\"),\"\",'GA55 Check & Edit'!J18)","v":""},{"$f":"IF(AND('GA55 Check & Edit'!K18=\"\"),\"\",'GA55 Check & Edit'!K18)","v":0},{"$f":"IF(AND('GA55 Check & Edit'!L18=\"\"),\"\",'GA55 Check & Edit'!L18)","v":0},{"$f":"IF(AND('GA55 Check & Edit'!M18=\"\"),\"\",'GA55 Check & Edit'!M18)","v":""},{"$f":"IF(AND('GA55 Check & Edit'!N18=\"\"),\"\",'GA55 Check & Edit'!N18)","v":6851},{"$f":"IF(B17=\"\",\"\",IF('Master Data'!$H$18='GA55 Check & Edit'!$AO$5,SUM(C17:L17),SUM(C17:K17)))","v":73220},{"$f":"IF(AND('GA55 Check & Edit'!P18=\"\"),\"\",'GA55 Check & Edit'!P18)","v":7000},{"$f":"IF(AND('GA55 Check & Edit'!Q18=\"\"),\"\",'GA55 Check & Edit'!Q18)","v":6851},{"$f":"IF(AND('GA55 Check & Edit'!R18=\"\"),\"\",'GA55 Check & Edit'!R18)","v":1880},{"$f":"IF(AND('GA55 Check & Edit'!S18=\"\"),\"\",'GA55 Check & Edit'!S18)","v":0},{"$f":"IF(AND('GA55 Check & Edit'!T18=\"\"),\"\",'GA55 Check & Edit'!T18)","v":0},{"$f":"IF(AND('GA55 Check & Edit'!U18=\"\"),\"\",'GA55 Check & Edit'!U18)","v":0},{"$f":"IF(AND('GA55 Check & Edit'!V18=\"\"),\"\",'GA55 Check & Edit'!V18)","v":0},{"$f":"IF(AND('GA55 Check & Edit'!W18=\"\"),\"\",'GA55 Check & Edit'!W18)","v":0},{"$f":"IF(AND('GA55 Check & Edit'!X18=\"\"),\"\",'GA55 Check & Edit'!X18)","v":""},{"$f":"IF(AND('GA55 Check & Edit'!Y18=\"\"),\"\",'GA55 Check & Edit'!Y18)","v":0},{"$f":"IF(AND('GA55 Check & Edit'!Z18=\"\"),\"\",'GA55 Check & Edit'!Z18)","v":1500},{"$f":"IF(AND('GA55 Check & Edit'!AA18=\"\"),\"\",'GA55 Check & Edit'!AA18)","v":""},{"$f":"IFERROR(IF(B17=\"\",\"\",IF(L17=\"\",SUM(N17:Y17),IF('Master Data'!$H$18='GA55 Check & Edit'!$AO$5,SUM(N17:Y17)+L17,SUM(N17:Y17)))),0)","v":17231},55989]
[12,{"$f":"IF(AND('GA55 Check & Edit'!D19=\"\"),\"\",'GA55 Check & Edit'!D19)","v":"2022-02-01"},{"$f":"IF(AND('GA55 Check & Edit'!E19=\"\"),\"\",'GA55 Check & Edit'!E19)","v":52300},{"$f":"IF(AND('GA55 Check & Edit'!F19=\"\"),\"\",'GA55 Check & Edit'!F19)","v":16213},{"$f":"IF(AND('GA55 Check & Edit'!G19=\"\"),\"\",'GA55 Check & Edit'!G19)","v":4707},{"$f":"IF(AND('GA55 Check & Edit'!H19=\"\"),\"\",'GA55 Check & Edit'!H19)","v":0},{"$f":"IF(AND('GA55 Check & Edit'!I19=\"\"),\"\",'GA55 Check & Edit'!I19)","v":"0"},{"$f":"IF(AND('GA55 Check & Edit'!J19=\"\"),\"\",'GA55 Check & Edit'!J19)","v":""},{"$f":"IF(AND('GA55 Check & Edit'!K19=\"\"),\"\",'GA55 Check & Edit'!K19)","v":0},{"$f":"IF(AND('GA55 Check & Edit'!L19=\"\"),\"\",'GA55 Check & Edit'!L19)","v":0},{"$f":"IF(AND('GA55 Check & Edit'!M19=\"\"),\"\",'GA55 Check & Edit'!M19)","v":""},{"$f":"IF(AND('GA55 Check & Edit'!N19=\"\"),\"\",'GA55 Check & Edit'!N19)","v":6851},{"$f":"IF(B18=\"\",\"\",IF('Master Data'!$H$18='GA55 Check & Edit'!$AO$5,SUM(C18:L18),SUM(C18:K18)))","v":73220},{"$f":"IF(AND('GA55 Check & Edit'!P19=\"\"),\"\",'GA55 Check & Edit'!P19)","v":7000},{"$f":"IF(AND('GA55 Check & Edit'!Q19=\"\"),\"\",'GA55 Check & Edit'!Q19)","v":6851},{"$f":"IF(AND('GA55 Check & Edit'!R19=\"\"),\"\",'GA55 Check & Edit'!R19)","v":1880},{"$f":"IF(AND('GA55 Check & Edit'!S19=\"\"),\"\",'GA55 Check & Edit'!S19)","v":0},{"$f":"IF(AND('GA55 Check & Edit'!T19=\"\"),\"\",'GA55 Check & Edit'!T19)","v":0},{"$f":"IF(AND('GA55 Check & Edit'!U19=\"\"),\"\",'GA55 Check & Edit'!U19)","v":0},{"$f":"IF(AND('GA55 Check & Edit'!V19=\"\"),\"\",'GA55 Check & Edit'!V19)","v":0},{"$f":"IF(AND('GA55 Check & Edit'!W19=\"\"),\"\",'GA55 Check & Edit'!W19)","v":0},{"$f":"IF(AND('GA55 Check & Edit'!X19=\"\"),\"\",'GA55 Check & Edit'!X19)","v":""},{"$f":"IF(AND('GA55 Check & Edit'!Y19=\"\"),\"\",'GA55 Check & Edit'!Y19)","v":0},{"$f":"IF(AND('GA55 Check & Edit'!Z19=\"\"),\"\",'GA55 Check & Edit'!Z19)","v":0},{"$f":"IF(AND('GA55 Check & Edit'!AA19=\"\"),\"\",'GA55 Check & Edit'!AA19)","v":""},{"$f":"IFERROR(IF(B18=\"\",\"\",IF(L18=\"\",SUM(N18:Y18),IF('Master Data'!$H$18='GA55 Check & Edit'!$AO$5,SUM(N18:Y18)+L18,SUM(N18:Y18)))),0)","v":15731},57489]
[13,{"$f":"IF(AND('GA55 Check & Edit'!D20=\"\"),\"\",'GA55 Check & Edit'!D20)","v":"Bonus"},{"$f":"IF(AND('GA55 Check & Edit'!E20=\"\"),\"\",'GA55 Check & Edit'!E20)","v":""},{"$f":"IF(AND('GA55 Check & Edit'!F20=\"\"),\"\",'GA55 Check & Edit'!F20)","v":""},{"$f":"IF(AND('GA55 Check & Edit'!G20=\"\"),\"\",'GA55 Check & Edit'!G20)","v":""},{"$f":"IF(AND('GA55 Check & Edit'!H20=\"\"),\"\",'GA55 Check & Edit'!H20)","v":""},{"$f":"IF(AND('GA55 Check & Edit'!I20=\"\"),\"\",'GA55 Check & Edit'!I20)","v":""},{"$f":"IF(AND('GA55 Check & Edit'!J20=\"\"),\"\",'GA55 Check & Edit'!J20)","v":""},{"$f":"IF(AND('GA55 Check & Edit'!K20=\"\"),\"\",'GA55 Check & Edit'!K20)","v":""},{"$f":"IF(AND('GA55 Check & Edit'!L20=\"\"),\"\",'GA55 Check & Edit'!L20)","v":""},{"$f":"IF(AND('GA55 Check & Edit'!M20=\"\"),\"\",'GA55 Check & Edit'!M20)","v":6774},{"$f":"IF(AND('GA55 Check & Edit'!N20=\"\"),\"\",'GA55 Check & Edit'!N20)","v":""},{"$f":"IF(B19=\"\",\"\",IF('Master Data'!$H$18='GA55 Check & Edit'!$AO$5,SUM(C19:L19),SUM(C19:K19)))","v":6774},{"$f":"IF(AND('GA55 Check & Edit'!P20=\"\"),\"\",'GA55 Check & Edit'!P20)","v":""},{"$f":"IF(AND('GA55 Check & Edit'!Q20=\"\"),\"\",'GA55 Check & Edit'!Q20)","v":""},{"$f":"IF(AND('GA55 Check & Edit'!R20=\"\"),\"\",'GA55 Check & Edit'!R20)","v":""},{"$f":"IF(AND('GA55 Check & Edit'!S20=\"\"),\"\",'GA55 Check & Edit'!S20)","v":""},{"$f":"IF(AND('GA55 Check & Edit'!T20=\"\"),\"\",'GA55 Check & Edit'!T20)","v":""},{"$f":"IF(AND('GA55 Check & Edit'!U20=\"\"),\"\",'GA55 Check & Edit'!U20)","v":""},{"$f":"IF(AND('GA55 Check & Edit'!V20=\"\"),\"\",'GA55 Check & Edit'!V20)","v":3387},{"$f":"IF(AND('GA55 Check & Edit'!W20=\"\"),\"\",'GA55 Check & Edit'!W20)","v":""},{"$f":"IF(AND('GA55 Check & Edit'!X20=\"\"),\"\",'GA55 Check & Edit'!X20)","v":""},{"$f":"IF(AND('GA55 Check & Edit'!Y20=\"\"),\"\",'GA55 Check & Edit'!Y20)","v":""},{"$f":"IF(AND('GA55 Check & Edit'!Z20=\"\"),\"\",'GA55 Check & Edit'!Z20)","v":""},{"$f":"IF(AND('GA55 Check & Edit'!AA20=\"\"),\"\",'GA55 Check & Edit'!AA20)","v":""},{"$f":"IFERROR(IF(B19=\"\",\"\",IF(L19=\"\",SUM(N19:Y19),IF('Master Data'!$H$18='GA55 Check & Edit'!$AO$5,SUM(N19:Y19)+L19,SUM(N19:Y19)))),0)","v":3387},3387]
[14,{"$f":"IF(AND('GA55 Check & Edit'!D21=\"\"),\"\",'GA55 Check & Edit'!D21)","v":"PL Surrender"},{"$f":"IF(AND('GA55 Check & Edit'!E21=\"\"),\"\",'GA55 Check & Edit'!E21)","v":0},{"$f":"IF(AND('GA55 Check & Edit'!F21=\"\"),\"\",'GA55 Check & Edit'!F21)","v":0},{"$f":"IF(AND('GA55 Check & Edit'!G21=\"\"),\"\",'GA55 Check & Edit'!G21)","v":""},{"$f":"IF(AND('GA55 Check & Edit'!H21=\"\"),\"\",'GA55 Check & Edit'!H21)","v":""},{"$f":"IF(AND('GA55 Check & Edit'!I21=\"\"),\"\",'GA55 Check & Edit'!I21)","v":""},{"$f":"IF(AND('GA55 Check & Edit'!J21=\"\"),\"\",'GA55 Check & Edit'!J21)","v":""},{"$f":"IF(AND('GA55 Check & Edit'!K21=\"\"),\"\",'GA55 Check & Edit'!K21)","v":""},{"$f":"IF(AND('GA55 Check & Edit'!L21=\"\"),\"\",'GA55 Check & Edit'!L21)","v":""},{"$f":"IF(AND('GA55 Check & Edit'!M21=\"\"),\"\",'GA55 Check & Edit'!M21)","v":""},{"$f":"IF(AND('GA55 Check & Edit'!N21=\"\"),\"\",'GA55 Check & Edit'!N21)","v":0},{"$f":"IF(B20=\"\",\"\",IF('Master Data'!$H$18='GA55 Check & Edit'!$AO$5,SUM(C20:L20),SUM(C20:K20)))","v":0},{"$f":"IF(AND('GA55 Check & Edit'!P21=\"\"),\"\",'GA55 Check & Edit'!P21)","v":""},{"$f":"IF(AND('GA55 Check & Edit'!Q21=\"\"),\"\",'GA55 Check & Edit'!Q21)","v":0},{"$f":"IF(AND('GA55 Check & Edit'!R21=\"\"),\"\",'GA55 Check & Edit'!R21)","v":""},{"$f":"IF(AND('GA55 Check & Edit'!S21=\"\"),\"\",'GA55 Check & Edit'!S21)","v":""},{"$f":"IF(AND('GA55 Check & Edit'!T21=\"\"),\"\",'GA55 Check & Edit'!T21)","v":""},{"$f":"IF(AND('GA55 Check & Edit'!U21=\"\"),\"\",'GA55 Check & Edit'!U21)","v":""},{"$f":"IF(AND('GA55 Check & Edit'!V21=\"\"),\"\",'GA55 Check & Edit'!V21)","v":""},{"$f":"IF(AND('GA55 Check & Edit'!W21=\"\"),\"\",'GA55 Check & Edit'!W21)","v":""},{"$f":"IF(AND('GA55 Check & Edit'!X21=\"\"),\"\",'GA55 Check & Edit'!X21)","v":""},{"$f":"IF(AND('GA55 Check & Edit'!Y21=\"\"),\"\",'GA55 Check & Edit'!Y21)","v":""},{"$f":"IF(AND('GA55 Check & Edit'!Z21=\"\"),\"\",'GA55 Check & Edit'!Z21)","v":""},{"$f":"IF(AND('GA55 Check & Edit'!AA21=\"\"),\"\",'GA55 Check & Edit'!AA21)","v":""},{"$f":"IFERROR(IF(B20=\"\",\"\",IF(L20=\"\",SUM(N20:Y20),IF('Master Data'!$H$18='GA55 Check & Edit'!$AO$5,SUM(N20:Y20)+L20,SUM(N20:Y20)))),0)","v":0},0]
[15,{"$f":"IF(AND('GA55 Check & Edit'!D22=\"\"),\"\",'GA55 Check & Edit'!D22)","v":"DA Arrear "},{"$f":"IF(AND('GA55 Check & Edit'!E22=\"\"),\"\",'GA55 Check & Edit'!E22)","v":""},{"$f":"IF(AND('GA55 Check & Edit'!F22=\"\"),\"\",'GA55 Check & Edit'!F22)","v":4707},{"$f":"IF(AND('GA55 Check & Edit'!G22=\"\"),\"\",'GA55 Check & Edit'!G22)","v":""},{"$f":"IF(AND('GA55 Check & Edit'!H22=\"\"),\"\",'GA55 Check & Edit'!H22)","v":""},{"$f":"IF(AND('GA55 Check & Edit'!I22=\"\"),\"\",'GA55 Check & Edit'!I22)","v":""},{"$f":"IF(AND('GA55 Check & Edit'!J22=\"\"),\"\",'GA55 Check & Edit'!J22)","v":""},{"$f":"IF(AND('GA55 Check & Edit'!K22=\"\"),\"\",'GA55 Check & Edit'!K22)","v":""},{"$f":"IF(AND('GA55 Check & Edit'!L22=\"\"),\"\",'GA55 Check & Edit'!L22)","v":""},{"$f":"IF(AND('GA55 Check & Edit'!M22=\"\"),\"\",'GA55 Check & Edit'!M22)","v":""},{"$f":"IF(AND('GA55 Check & Edit'!N22=\"\"),\"\",'GA55 Check & Edit'!N22)","v":471},{"$f":"IF(B21=\"\",\"\",IF('Master Data'!$H$18='GA55 Check & Edit'!$AO$5,SUM(C21:L21),SUM(C21:K21)))","v":4707},{"$f":"IF(AND('GA55 Check & Edit'!P22=\"\"),\"\",'GA55 Check & Edit'!P22)","v":""},{"$f":"IF(AND('GA55 Check & Edit'!Q22=\"\"),\"\",'GA55 Check & Edit'!Q22)","v":471},{"$f":"IF(AND('GA55 Check & Edit'!R22=\"\"),\"\",'GA55 Check & Edit'!R22)","v":""},{"$f":"IF(AND('GA55 Check & Edit'!S22=\"\"),\"\",'GA55 Check & Edit'!S22)","v":""},{"$f":"IF(AND('GA55 Check & Edit'!T22=\"\"),\"\",'GA55 Check & Edit'!T22)","v":""},{"$f":"IF(AND('GA55 Check & Edit'!U22=\"\"),\"\",'GA55 Check & Edit'!U22)","v":""},{"$f":"IF(AND('GA55 Check & Edit'!V22=\"\"),\"\",'GA55 Check & Edit'!V22)","v":4236},{"$f":"IF(AND('GA55 Check & Edit'!W22=\"\"),\"\",'GA55 Check & Edit'!W22)","v":""},{"$f":"IF(AND('GA55 Check & Edit'!X22=\"\"),\"\",'GA55 Check & Edit'!X22)","v":""},{"$f":"IF(AND('GA55 Check & Edit'!Y22=\"\"),\"\",'GA55 Check & Edit'!Y22)","v":""},{"$f":"IF(AND('GA55 Check & Edit'!Z22=\"\"),\"\",'GA55 Check & Edit'!Z22)","v":""},{"$f":"IF(AND('GA55 Check & Edit'!AA22=\"\"),\"\",'GA55 Check & Edit'!AA22)","v":""},{"$f":"IFERROR(IF(B21=\"\",\"\",IF(L21=\"\",SUM(N21:Y21),IF('Master Data'!$H$18='GA55 Check & Edit'!$AO$5,SUM(N21:Y21)+L21,SUM(N21:Y21)))),0)","v":4707},0]
[16,{"$f":"IF(AND('GA55 Check & Edit'!D23=\"\"),\"\",'GA55 Check & Edit'!D23)","v":"Fixation arear"},{"$f":"IF(AND('GA55 Check & Edit'!E23=\"\"),\"\",'GA55 Check & Edit'!E23)","v":""},{"$f":"IF(AND('GA55 Check & Edit'!F23=\"\"),\"\",'GA55 Check & Edit'!F23)","v":""},{"$f":"IF(AND('GA55 Check & Edit'!G23=\"\"),\"\",'GA55 Check & Edit'!G23)","v":""},{"$f":"IF(AND('GA55 Check & Edit'!H23=\"\"),\"\",'GA55 Check & Edit'!H23)","v":""},{"$f":"IF(AND('GA55 Check & Edit'!I23=\"\"),\"\",'GA55 Check & Edit'!I23)","v":""},{"$f":"IF(AND('GA55 Check & Edit'!J23=\"\"),\"\",'GA55 Check & Edit'!J23)","v":""},{"$f":"IF(AND('GA55 Check & Edit'!K23=\"\"),\"\",'GA55 Check & Edit'!K23)","v":""},{"$f":"IF(AND('GA55 Check & Edit'!L23=\"\"),\"\",'GA55 Check & Edit'!L23)","v":""},{"$f":"IF(AND('GA55 Check & Edit'!M23=\"\"),\"\",'GA55 Check & Edit'!M23)","v":""},{"$f":"IF(AND('GA55 Check & Edit'!N23=\"\"),\"\",'GA55 Check & Edit'!N23)","v":""},{"$f":"IF(B22=\"\",\"\",IF('Master Data'!$H$18='GA55 Check & Edit'!$AO$5,SUM(C22:L22),SUM(C22:K22)))","v":0},{"$f":"IF(AND('GA55 Check & Edit'!P23=\"\"),\"\",'GA55 Check & Edit'!P23)","v":""},{"$f":"IF(AND('GA55 Check & Edit'!Q23=\"\"),\"\",'GA55 Check & Edit'!Q23)","v":""},{"$f":"IF(AND('GA55 Check & Edit'!R23=\"\"),\"\",'GA55 Check & Edit'!R23)","v":""},{"$f":"IF(AND('GA55 Check & Edit'!S23=\"\"),\"\",'GA55 Check & Edit'!S23)","v":""},{"$f":"IF(AND('GA55 Check & Edit'!T23=\"\"),\"\",'GA55 Check & Edit'!T23)","v":""},{"$f":"IF(AND('GA55 Check & Edit'!U23=\"\"),\"\",'GA55 Check & Edit'!U23)","v":""},{"$f":"IF(AND('GA55 Check & Edit'!V23=\"\"),\"\",'GA55 Check & Edit'!V23)","v":""},{"$f":"IF(AND('GA55 Check & Edit'!W23=\"\"),\"\",'GA55 Check & Edit'!W23)","v":""},{"$f":"IF(AND('GA55 Check & Edit'!X23=\"\"),\"\",'GA55 Check & Edit'!X23)","v":""},{"$f":"IF(AND('GA55 Check & Edit'!Y23=\"\"),\"\",'GA55 Check & Edit'!Y23)","v":""},{"$f":"IF(AND('GA55 Check & Edit'!Z23=\"\"),\"\",'GA55 Check & Edit'!Z23)","v":""},{"$f":"IF(AND('GA55 Check & Edit'!AA23=\"\"),\"\",'GA55 Check & Edit'!AA23)","v":""},{"$f":"IFERROR(IF(B22=\"\",\"\",IF(L22=\"\",SUM(N22:Y22),IF('Master Data'!$H$18='GA55 Check & Edit'!$AO$5,SUM(N22:Y22)+L22,SUM(N22:Y22)))),0)","v":0},0]
[17,{"$f":"IF(AND('GA55 Check & Edit'!D24=\"\"),\"\",'GA55 Check & Edit'!D24)","v":"HRA Arrear"},{"$f":"IF(AND('GA55 Check & Edit'!E24=\"\"),\"\",'GA55 Check & Edit'!E24)","v":""},{"$f":"IF(AND('GA55 Check & Edit'!F24=\"\"),\"\",'GA55 Check & Edit'!F24)","v":""},{"$f":"IF(AND('GA55 Check & Edit'!G24=\"\"),\"\",'GA55 Check & Edit'!G24)","v":523},{"$f":"IF(AND('GA55 Check & Edit'!H24=\"\"),\"\",'GA55 Check & Edit'!H24)","v":""},{"$f":"IF(AND('GA55 Check & Edit'!I24=\"\"),\"\",'GA55 Check & Edit'!I24)","v":""},{"$f":"IF(AND('GA55 Check & Edit'!J24=\"\"),\"\",'GA55 Check & Edit'!J24)","v":""},{"$f":"IF(AND('GA55 Check & Edit'!K24=\"\"),\"\",'GA55 Check & Edit'!K24)","v":""},{"$f":"IF(AND('GA55 Check & Edit'!L24=\"\"),\"\",'GA55 Check & Edit'!L24)","v":""},{"$f":"IF(AND('GA55 Check & Edit'!M24=\"\"),\"\",'GA55 Check & Edit'!M24)","v":""},{"$f":"IF(AND('GA55 Check & Edit'!N24=\"\"),\"\",'GA55 Check & Edit'!N24)","v":""},{"$f":"IF(B23=\"\",\"\",IF('Master Data'!$H$18='GA55 Check & Edit'!$AO$5,SUM(C23:L23),SUM(C23:K23)))","v":523},{"$f":"IF(AND('GA55 Check & Edit'!P24=\"\"),\"\",'GA55 Check & Edit'!P24)","v":""},{"$f":"IF(AND('GA55 Check & Edit'!Q24=\"\"),\"\",'GA55 Check & Edit'!Q24)","v":""},{"$f":"IF(AND('GA55 Check & Edit'!R24=\"\"),\"\",'GA55 Check & Edit'!R24)","v":""},{"$f":"IF(AND('GA55 Check & Edit'!S24=\"\"),\"\",'GA55 Check & Edit'!S24)","v":""},{"$f":"IF(AND('GA55 Check & Edit'!T24=\"\"),\"\",'GA55 Check & Edit'!T24)","v":""},{"$f":"IF(AND('GA55 Check & Edit'!U24=\"\"),\"\",'GA55 Check & Edit'!U24)","v":""},{"$f":"IF(AND('GA55 Check & Edit'!V24=\"\"),\"\",'GA55 Check & Edit'!V24)","v":""},{"$f":"IF(AND('GA55 Check & Edit'!W24=\"\"),\"\",'GA55 Check & Edit'!W24)","v":""},{"$f":"IF(AND('GA55 Check & Edit'!X24=\"\"),\"\",'GA55 Check & Edit'!X24)","v":""},{"$f":"IF(AND('GA55 Check & Edit'!Y24=\"\"),\"\",'GA55 Check & Edit'!Y24)","v":""},{"$f":"IF(AND('GA55 Check & Edit'!Z24=\"\"),\"\",'GA55 Check & Edit'!Z24)","v":""},{"$f":"IF(AND('GA55 Check & Edit'!AA24=\"\"),\"\",'GA55 Check & Edit'!AA24)","v":""},{"$f":"IFERROR(IF(B23=\"\",\"\",IF(L23=\"\",SUM(N23:Y23),IF('Master Data'!$H$18='GA55 Check & Edit'!$AO$5,SUM(N23:Y23)+L23,SUM(N23:Y23)))),0)","v":0},523]
[18,{"$f":"IF(AND('GA55 Check & Edit'!D25=\"\"),\"\",'GA55 Check & Edit'!D25)","v":"PL Surrender Arrear"},{"$f":"IF(AND('GA55 Check & Edit'!E25=\"\"),\"\",'GA55 Check & Edit'!E25)","v":""},{"$f":"IF(AND('GA55 Check & Edit'!F25=\"\"),\"\",'GA55 Check & Edit'!F25)","v":0},{"$f":"IF(AND('GA55 Check & Edit'!G25=\"\"),\"\",'GA55 Check & Edit'!G25)","v":""},{"$f":"IF(AND('GA55 Check & Edit'!H25=\"\"),\"\",'GA55 Check & Edit'!H25)","v":""},{"$f":"IF(AND('GA55 Check & Edit'!I25=\"\"),\"\",'GA55 Check & Edit'!I25)","v":""},{"$f":"IF(AND('GA55 Check & Edit'!J25=\"\"),\"\",'GA55 Check & Edit'!J25)","v":""},{"$f":"IF(AND('GA55 Check & Edit'!K25=\"\"),\"\",'GA55 Check & Edit'!K25)","v":""},{"$f":"IF(AND('GA55 Check & Edit'!L25=\"\"),\"\",'GA55 Check & Edit'!L25)","v":""},{"$f":"IF(AND('GA55 Check & Edit'!M25=\"\"),\"\",'GA55 Check & Edit'!M25)","v":""},{"$f":"IF(AND('GA55 Check & Edit'!N25=\"\"),\"\",'GA55 Check & Edit'!N25)","v":0},{"$f":"IF(B24=\"\",\"\",IF('Master Data'!$H$18='GA55 Check & Edit'!$AO$5,SUM(C24:L24),SUM(C24:K24)))","v":0},{"$f":"IF(AND('GA55 Check & Edit'!P25=\"\"),\"\",'GA55 Check & Edit'!P25)","v":""},{"$f":"IF(AND('GA55 Check & Edit'!Q25=\"\"),\"\",'GA55 Check & Edit'!Q25)","v":0},{"$f":"IF(AND('GA55 Check & Edit'!R25=\"\"),\"\",'GA55 Check & Edit'!R25)","v":""},{"$f":"IF(AND('GA55 Check & Edit'!S25=\"\"),\"\",'GA55 Check & Edit'!S25)","v":""},{"$f":"IF(AND('GA55 Check & Edit'!T25=\"\"),\"\",'GA55 Check & Edit'!T25)","v":""},{"$f":"IF(AND('GA55 Check & Edit'!U25=\"\"),\"\",'GA55 Check & Edit'!U25)","v":""},{"$f":"IF(AND('GA55 Check & Edit'!V25=\"\"),\"\",'GA55 Check & Edit'!V25)","v":0},{"$f":"IF(AND('GA55 Check & Edit'!W25=\"\"),\"\",'GA55 Check & Edit'!W25)","v":""},{"$f":"IF(AND('GA55 Check & Edit'!X25=\"\"),\"\",'GA55 Check & Edit'!X25)","v":""},{"$f":"IF(AND('GA55 Check & Edit'!Y25=\"\"),\"\",'GA55 Check & Edit'!Y25)","v":""},{"$f":"IF(AND('GA55 Check & Edit'!Z25=\"\"),\"\",'GA55 Check & Edit'!Z25)","v":""},{"$f":"IF(AND('GA55 Check & Edit'!AA25=\"\"),\"\",'GA55 Check & Edit'!AA25)","v":""},{"$f":"IFERROR(IF(B24=\"\",\"\",IF(L24=\"\",SUM(N24:Y24),IF('Master Data'!$H$18='GA55 Check & Edit'!$AO$5,SUM(N24:Y24)+L24,SUM(N24:Y24)))),0)","v":0},0]
[19,{"$f":"IF(AND('GA55 Check & Edit'!D26=\"\"),\"\",'GA55 Check & Edit'!D26)","v":""},{"$f":"IF(AND('GA55 Check & Edit'!E26=\"\"),\"\",'GA55 Check & Edit'!E26)","v":""},{"$f":"IF(AND('GA55 Check & Edit'!F26=\"\"),\"\",'GA55 Check & Edit'!F26)","v":""},{"$f":"IF(AND('GA55 Check & Edit'!G26=\"\"),\"\",'GA55 Check & Edit'!G26)","v":""},{"$f":"IF(AND('GA55 Check & Edit'!H26=\"\"),\"\",'GA55 Check & Edit'!H26)","v":""},{"$f":"IF(AND('GA55 Check & Edit'!I26=\"\"),\"\",'GA55 Check & Edit'!I26)","v":""},{"$f":"IF(AND('GA55 Check & Edit'!J26=\"\"),\"\",'GA55 Check & Edit'!J26)","v":""},{"$f":"IF(AND('GA55 Check & Edit'!K26=\"\"),\"\",'GA55 Check & Edit'!K26)","v":""},{"$f":"IF(AND('GA55 Check & Edit'!L26=\"\"),\"\",'GA55 Check & Edit'!L26)","v":""},{"$f":"IF(AND('GA55 Check & Edit'!M26=\"\"),\"\",'GA55 Check & Edit'!M26)","v":""},{"$f":"IF(AND('GA55 Check & Edit'!N26=\"\"),\"\",'GA55 Check & Edit'!N26)","v":""},{"$f":"IF(B25=\"\",\"\",IF('Master Data'!$H$18='GA55 Check & Edit'!$AO$5,SUM(C25:L25),SUM(C25:K25)))","v":""},{"$f":"IF(AND('GA55 Check & Edit'!P26=\"\"),\"\",'GA55 Check & Edit'!P26)","v":""},{"$f":"IF(AND('GA55 Check & Edit'!Q26=\"\"),\"\",'GA55 Check & Edit'!Q26)","v":""},{"$f":"IF(AND('GA55 Check & Edit'!R26=\"\"),\"\",'GA55 Check & Edit'!R26)","v":""},{"$f":"IF(AND('GA55 Check & Edit'!S26=\"\"),\"\",'GA55 Check & Edit'!S26)","v":""},{"$f":"IF(AND('GA55 Check & Edit'!T26=\"\"),\"\",'GA55 Check & Edit'!T26)","v":""},{"$f":"IF(AND('GA55 Check & Edit'!U26=\"\"),\"\",'GA55 Check & Edit'!U26)","v":""},{"$f":"IF(AND('GA55 Check & Edit'!V26=\"\"),\"\",'GA55 Check & Edit'!V26)","v":""},{"$f":"IF(AND('GA55 Check & Edit'!W26=\"\"),\"\",'GA55 Check & Edit'!W26)","v":""},{"$f":"IF(AND('GA55 Check & Edit'!X26=\"\"),\"\",'GA55 Check & Edit'!X26)","v":""},{"$f":"IF(AND('GA55 Check & Edit'!Y26=\"\"),\"\",'GA55 Check & Edit'!Y26)","v":""},{"$f":"IF(AND('GA55 Check & Edit'!Z26=\"\"),\"\",'GA55 Check & Edit'!Z26)","v":""},{"$f":"IF(AND('GA55 Check & Edit'!AA26=\"\"),\"\",'GA55 Check & Edit'!AA26)","v":""},{"$f":"IFERROR(IF(B25=\"\",\"\",IF(L25=\"\",SUM(N25:Y25),IF('Master Data'!$H$18='GA55 Check & Edit'!$AO$5,SUM(N25:Y25)+L25,SUM(N25:Y25)))),0)","v":""},""]
[20,{"$f":"IF(AND('GA55 Check & Edit'!D27=\"\"),\"\",'GA55 Check & Edit'!D27)","v":""},{"$f":"IF(AND('GA55 Check & Edit'!E27=\"\"),\"\",'GA55 Check & Edit'!E27)","v":""},{"$f":"IF(AND('GA55 Check & Edit'!F27=\"\"),\"\",'GA55 Check & Edit'!F27)","v":""},{"$f":"IF(AND('GA55 Check & Edit'!G27=\"\"),\"\",'GA55 Check & Edit'!G27)","v":""},{"$f":"IF(AND('GA55 Check & Edit'!H27=\"\"),\"\",'GA55 Check & Edit'!H27)","v":""},{"$f":"IF(AND('GA55 Check & Edit'!I27=\"\"),\"\",'GA55 Check & Edit'!I27)","v":""},{"$f":"IF(AND('GA55 Check & Edit'!J27=\"\"),\"\",'GA55 Check & Edit'!J27)","v":""},{"$f":"IF(AND('GA55 Check & Edit'!K27=\"\"),\"\",'GA55 Check & Edit'!K27)","v":""},{"$f":"IF(AND('GA55 Check & Edit'!L27=\"\"),\"\",'GA55 Check & Edit'!L27)","v":""},{"$f":"IF(AND('GA55 Check & Edit'!M27=\"\"),\"\",'GA55 Check & Edit'!M27)","v":""},{"$f":"IF(AND('GA55 Check & Edit'!N27=\"\"),\"\",'GA55 Check & Edit'!N27)","v":""},{"$f":"IF(B26=\"\",\"\",IF('Master Data'!$H$18='GA55 Check & Edit'!$AO$5,SUM(C26:L26),SUM(C26:K26)))","v":""},{"$f":"IF(AND('GA55 Check & Edit'!P27=\"\"),\"\",'GA55 Check & Edit'!P27)","v":""},{"$f":"IF(AND('GA55 Check & Edit'!Q27=\"\"),\"\",'GA55 Check & Edit'!Q27)","v":""},{"$f":"IF(AND('GA55 Check & Edit'!R27=\"\"),\"\",'GA55 Check & Edit'!R27)","v":""},{"$f":"IF(AND('GA55 Check & Edit'!S27=\"\"),\"\",'GA55 Check & Edit'!S27)","v":""},{"$f":"IF(AND('GA55 Check & Edit'!T27=\"\"),\"\",'GA55 Check & Edit'!T27)","v":""},{"$f":"IF(AND('GA55 Check & Edit'!U27=\"\"),\"\",'GA55 Check & Edit'!U27)","v":""},{"$f":"IF(AND('GA55 Check & Edit'!V27=\"\"),\"\",'GA55 Check & Edit'!V27)","v":""},{"$f":"IF(AND('GA55 Check & Edit'!W27=\"\"),\"\",'GA55 Check & Edit'!W27)","v":""},{"$f":"IF(AND('GA55 Check & Edit'!X27=\"\"),\"\",'GA55 Check & Edit'!X27)","v":""},{"$f":"IF(AND('GA55 Check & Edit'!Y27=\"\"),\"\",'GA55 Check & Edit'!Y27)","v":""},{"$f":"IF(AND('GA55 Check & Edit'!Z27=\"\"),\"\",'GA55 Check & Edit'!Z27)","v":""},{"$f":"IF(AND('GA55 Check & Edit'!AA27=\"\"),\"\",'GA55 Check & Edit'!AA27)","v":""},{"$f":"IFERROR(IF(B26=\"\",\"\",IF(L26=\"\",SUM(N26:Y26),IF('Master Data'!$H$18='GA55 Check & Edit'!$AO$5,SUM(N26:Y26)+L26,SUM(N26:Y26)))),0)","v":""},""]
[21,{"$f":"IF(AND('GA55 Check & Edit'!D28=\"\"),\"\",'GA55 Check & Edit'!D28)","v":""},{"$f":"IF(AND('GA55 Check & Edit'!E28=\"\"),\"\",'GA55 Check & Edit'!E28)","v":""},{"$f":"IF(AND('GA55 Check & Edit'!F28=\"\"),\"\",'GA55 Check & Edit'!F28)","v":""},{"$f":"IF(AND('GA55 Check & Edit'!G28=\"\"),\"\",'GA55 Check & Edit'!G28)","v":""},{"$f":"IF(AND('GA55 Check & Edit'!H28=\"\"),\"\",'GA55 Check & Edit'!H28)","v":""},{"$f":"IF(AND('GA55 Check & Edit'!I28=\"\"),\"\",'GA55 Check & Edit'!I28)","v":""},{"$f":"IF(AND('GA55 Check & Edit'!J28=\"\"),\"\",'GA55 Check & Edit'!J28)","v":""},{"$f":"IF(AND('GA55 Check & Edit'!K28=\"\"),\"\",'GA55 Check & Edit'!K28)","v":""},{"$f":"IF(AND('GA55 Check & Edit'!L28=\"\"),\"\",'GA55 Check & Edit'!L28)","v":""},{"$f":"IF(AND('GA55 Check & Edit'!M28=\"\"),\"\",'GA55 Check & Edit'!M28)","v":""},{"$f":"IF(AND('GA55 Check & Edit'!N28=\"\"),\"\",'GA55 Check & Edit'!N28)","v":""},{"$f":"IF(B27=\"\",\"\",IF('Master Data'!$H$18='GA55 Check & Edit'!$AO$5,SUM(C27:L27),SUM(C27:K27)))","v":""},{"$f":"IF(AND('GA55 Check & Edit'!P28=\"\"),\"\",'GA55 Check & Edit'!P28)","v":""},{"$f":"IF(AND('GA55 Check & Edit'!Q28=\"\"),\"\",'GA55 Check & Edit'!Q28)","v":""},{"$f":"IF(AND('GA55 Check & Edit'!R28=\"\"),\"\",'GA55 Check & Edit'!R28)","v":""},{"$f":"IF(AND('GA55 Check & Edit'!S28=\"\"),\"\",'GA55 Check & Edit'!S28)","v":""},{"$f":"IF(AND('GA55 Check & Edit'!T28=\"\"),\"\",'GA55 Check & Edit'!T28)","v":""},{"$f":"IF(AND('GA55 Check & Edit'!U28=\"\"),\"\",'GA55 Check & Edit'!U28)","v":""},{"$f":"IF(AND('GA55 Check & Edit'!V28=\"\"),\"\",'GA55 Check & Edit'!V28)","v":""},{"$f":"IF(AND('GA55 Check & Edit'!W28=\"\"),\"\",'GA55 Check & Edit'!W28)","v":""},{"$f":"IF(AND('GA55 Check & Edit'!X28=\"\"),\"\",'GA55 Check & Edit'!X28)","v":""},{"$f":"IF(AND('GA55 Check & Edit'!Y28=\"\"),\"\",'GA55 Check & Edit'!Y28)","v":""},{"$f":"IF(AND('GA55 Check & Edit'!Z28=\"\"),\"\",'GA55 Check & Edit'!Z28)","v":""},{"$f":"IF(AND('GA55 Check & Edit'!AA28=\"\"),\"\",'GA55 Check & Edit'!AA28)","v":""},{"$f":"IFERROR(IF(B27=\"\",\"\",IF(L27=\"\",SUM(N27:Y27),IF('Master Data'!$H$18='GA55 Check & Edit'!$AO$5,SUM(N27:Y27)+L27,SUM(N27:Y27)))),0)","v":""},""]
[null,"TOTAL F",{"$f":"IF(AND($D$3=\"\",$M$3=\"\",$U$3=\"\",$C$4=\"\"),\"\",SUM(C7:C27))","v":621600},{"$f":"IF(AND($D$3=\"\",$M$3=\"\",$U$3=\"\",$C$4=\"\"),\"\",SUM(D7:D27))","v":164248},53912,0,0,0,0,0,6774,78584,846534,84000,78584,22560,0,0,0,7623,0,250,0,15000,220,208237,638297]
[]
[null,null,{"$f":"IF(AND('Master Data'!D6=\"\"),\"\",'Master Data'!D6)","v":"Heeralal jat"},null,null,null,null,null,null,null,null,null,null,null,null,null,null,null,{"$f":"IF(AND('Master Data'!H8=\"\"),\"\",'Master Data'!H8)","v":"Usha Paliya"}]
[null,null,"Signature of Employee",null,null,null,null,null,null,null,null,null,null,null,null,null,null,null,"Signature of DDO"]

{"sheet":"COMPUTATION","index":5,"n_rows":69,"n_cols":34,"rows_kept":69,"cut":false,"hidden":true,"merged":[[48,17,48,20],[49,17,49,20],[21,16,23,20],[22,33,23,36],[25,16,30,18],[0,0,0,14],[2,1,2,2],[2,3,2,7],[2,9,2,11],[2,13,2,14],[1,2,1,4],[1,5,1,6],[1,7,1,8],[1,11,1,14],[1,9,1,10],[9,1,9,9],[9,10,9,12],[10,1,10,12],[11,0,13,0],[11,1,11,7],[11,8,11,9],[11,10,11,12],[3,17,7,21],[5,1,5,12],[6,1,6,12],[7,0,9,0],[7,1,7,9],[7,10,7,12],[7,13,8,14],[8,1,8,9],[8,10,8,12],[4,1,4,12],[3,0,4,0],[3,1,3,8],[3,9,3,12],[33,1,33,12],[34,1,34,12],[28,8,28,10],[23,8,23,10],[14,1,14,12],[15,1,15,3],[15,9,15,12],[16,1,16,3],[11,13,13,14],[12,1,13,2],[12,3,12,4],[12,5,12,7],[12,8,12,9],[12,10,12,12],[13,3,13,4],[13,5,13,7],[13,8,13,9],[13,10,13,12],[15,4,15,5],[16,4,16,5],[15,6,15,7],[16,6,16,7],[16,9,16,12],[17,1,17,12],[22,2,22,4],[29,2,29,4],[29,8,29,10],[30,2,30,4],[31,1,31,12],[26,2,26,4],[26,8,26,10],[27,2,27,4],[27,8,27,10],[28,2,28,4],[22,8,22,10],[68,11,68,13],[60,2,60,12],[61,1,61,12],[62,1,62,12],[63,1,63,12],[66,0,66,12],[48,0,61,0],[48,1,48,14],[49,1,49,4],[49,5,49,8],[49,9,49,12],[50,1,50,3],[54,1,54,3],[54,5,54,7],[54,9,54,11],[55,1,55,3],[55,5,55,7],[55,9,55,11],[56,1,56,3],[51,1,51,3],[51,5,51,7],[51,9,51,11],[50,9,50,11],[50,5,50,7],[58,16,59,18],[54,17,56,21],[56,5,56,7],[56,9,56,11],[58,1,58,12],[59,1,59,12],[53,1,53,3],[18,17,18,18],[31,18,33,18],[40,17,42,21],[43,17,44,18],[45,1,45,12],[46,1,46,12],[52,1,52,3],[52,5,52,7],[52,9,52,11],[39,1,39,12],[40,1,40,12],[23,2,23,4],[24,2,24,4],[24,8,24,10],[25,2,25,4],[25,8,25,10],[44,1,44,12],[64,0,65,0],[64,1,65,3],[64,4,64,6],[64,7,64,8],[64,10,64,11],[64,12,64,13],[65,4,65,6],[65,7,65,8],[65,10,65,11],[65,12,65,13],[35,0,44,0],[53,5,53,7],[53,9,53,11],[57,1,57,12],[30,7,30,10],[48,23,48,25],[48,27,48,29],[41,1,41,12],[42,1,42,12],[43,1,43,12],[47,1,47,12],[35,1,35,14],[32,1,32,12],[36,1,36,12],[37,1,37,12],[38,1,38,12],[18,0,34,0],[18,1,18,14],[19,1,19,14],[20,2,20,4],[20,8,20,10],[20,13,30,14],[21,2,21,4],[21,8,21,10]]}
[{"$f":"IF(AND('Master Data'!D4=\"\"),\"\",CONCATENATE(\"Office Name :- \",PROPER('Master Data'!D4)))","v":"Office Name :- Mahatma Gandhi Govt. School (English Medium) Bar, Pali"},null,null,null,null,null,null,null,null,null,null,null,null,null,null,null,null,null,null,2]
[null,null,"vk;dj x.kuk izi= o\"kZ &",null,null,"2021-2022",null,"¼dj fu/kkZj.k o\"kZ &",null,"2022-2023)",null,{"$f":"IF(T14=T2,\"Old Tax Regime\",\"New Tax Regime\")","v":"Old Tax Regime"},null,null,null,null,null,null,null,1]
[1,"uke deZpkjh %",null,{"$f":"UPPER('Master Data'!D6)","v":"HEERALAL JAT"},null,null,null,null," in %",{"$f":"UPPER('Master Data'!H6)","v":"SR TEACHER"},null,null,"PAN :",{"$f":"UPPER('Master Data'!D12)","v":"ABCDE1234H"}]
[2,"vk; % o\"kZ&2021&22 esa izkIr dqy osru ¼ dj ;ksX; lqfo/kkvksa ds eqY; lfgr ½",null,null,null,null,null,null,null,{"$f":"IF('Master Data'!H18=\"Yes\",\"सरकार द्वारा देय NPS की राशि सहित कुल वेतन -\",\"\")","v":""},null,null,null,"#-",{"$f":"'GA 55 '!M28","v":846534},null,null,"आप विद्यमान आयकर दर या नवीन आयकर दर दोनों में से किसी एक विकल्प को चुनकर आयकर गणना प्रपत्र तैयार कर सकते है।  "]
[null,{"$f":"IF('Master Data'!H18=\"Yes\",\"\",\"सरकार द्वारा देय NPS की राशि -\")","v":"सरकार द्वारा देय NPS की राशि -"},null,null,null,null,null,null,null,null,null,null,null,"#-",{"$f":"IF('Master Data'!H18=\"Yes\",0,IF('Master Data'!I30='GA55 Check & Edit'!AN6,'GA 55 '!O28,0))","v":78584}]
[3,"x`g fdjk;k] /kkjk 10¼13-A½ ds vUrxrZ ,oa /kkjk 10¼14½ds vUrxrZ vU; Hkrs tks dj eqDÙk gSA ",null,null,null,null,null,null,null,null,null,null,null,"#-",{"$f":"IF(T14=T2,SUM('Extra Ded '!I7+'Extra Ded '!E6+'GA 55 '!G28),\"0\")","v":0},null,"E"]
[4,"                                                              'ks\"k ¼2&3½",null,null,null,null,null,null,null,null,null,null,null,"#-",{"$f":"(O4+O5)-O6","v":925118}]
[5," ¼i½euksjatu Hkrk /kkjk 16 ¼ii½ ds vUrxrZ ",null,null,null,null,null,null,null,null,{"$f":"IF(T14=T2,'Extra Ded '!E8,\"0\")","v":0}]
[null," ¼ii½ O;o;k; dj /kkjk 16 ¼iii½ ds vUrxrZ ",null,null,null,null,null,null,null,null,{"$f":"IF(T14=T2,'Extra Ded '!E9,\"0\")","v":0}]
[null," ¼iii½ LVs.MMZ fMMsD'ku (Standard Deduction)  50]000 ¼vf/kdre½",null,null,null,null,null,null,null,null,{"$f":"IF(T14=T2,'Extra Ded '!E7,\"0\")","v":50000},null,null,"#-",{"$f":"SUM(K8:M10)","v":50000}]
[6,"                                                           'ks\"k ¼4&5½",null,null,null,null,null,null,null,null,null,null,null,"#-",{"$f":"O7-O10","v":875118}]
[7,"¼v½x`g lEifr ls vk;%¼1½ Loa; ds mi;ksx esa &'kwU;",null,null,null,null,null,null,"¼2½ izkIr fdjk;k #-",null,{"$f":"'Extra Ded '!E10","v":0}]
[null,"¼c½ ?kVk;sa ",null," fdjk;s dk 30%",null," x`g _.k ij C;kt",null,null," x`gdj ",null,"  ;ksx 7¼c½"]
[null,null,null,{"$f":"IF(T14=T2,ROUND(K12*0.3,0),\"0\")","v":0},null,{"$f":"IF(T14=T2,'Extra Ded '!E13,\"0\")","v":0},null,null,{"$f":"IF(T14=T2,'Extra Ded '!E11,\"0\")","v":0},null,{"$f":"D14+F14+I14","v":0},null,null,null,null,null,null,null,null,1]
[null," 'ks\"k &@$¼7¼v½ ,oa ;ksx 7¼c½ dk½  ",null,null,null,null,null,null,null,null,null,null,null,"#-",{"$f":"K12-K14","v":0}]
[8,"cpr [kkrs ij C;kt %",null,null,{"$f":"'Extra Ded '!I21","v":1500},null,"vU; vk;  %",null,{"$f":"'Extra Ded '!E24","v":0},"dqy 'ks\"k &@$¼6,oa 7½",null,null,null,"#-",{"$f":"O11+O15","v":875118},null,null,null,null,null,null,null,null,null,null,null,null,null,null,null,null,null,null,{"$f":"IF(AM24=AM12,SUM('Extra Ded '!AB17+'Extra Ded '!X16+'GA 55 '!Z38),\"0\")","v":0}]
[9,",QMh vkfn vU; tek jkf'k ij izkIr dqy C;kt",null,null,{"$f":"'Extra Ded '!I23","v":0},null,"Bonds ls C;kt",null,{"$f":"'Extra Ded '!E23","v":0}," ;ksx ¼8$9½",null,null,null,"#-",{"$f":"E16+E17+I16+I17","v":1500}]
[10,"ldy vk;                                                                                     ",null,null,null,null,null,null,null,null,null,null,null,"#-",{"$f":"O16+O17","v":876618}]
[11,"?kVkb;s dVkSSfr;k¡ %& /kkjk US 80C, 80CCC,80CCD (1)",null,null,null,null,null,null,null,null,null,null,null,null,null,null,null,"Move Curser Here"]
[null,"(A) vf/kdre lhek 1]50]000@& ¼/kkjk 80CCE ½ ] ¼/kkjk 80CCD (2), ds vykok"]
[null,"(i)","jkT; chek ¼SI)",null,null,"#-",{"$f":"IF(T14=T2,SUM('GA 55 '!N28),\"0\")","v":84000},"(xi)","isa'ku ;kstuk esa va'knku ECPF /kkjk 80ccd(1½\n",null,null,"#-",{"$f":"IF('Master Data'!I30='GA55 Check & Edit'!AN5,0,IF(T14=T1,0,IF(T34=T36,AA27,AB23)))","v":78584}]
[null,"(ii)","thou chek izhfe;e ¼LIC)",null,null,"#-",{"$f":"IF(T14=T2,'GA 55 '!P28,\"0\")","v":22560},"(xii)","isa'ku Iyku gsrq va'knku ¼/kkjk 80ccc½",null,null,"#-",{"$f":"IF(T14=T2,'Extra Ded '!I12,\"0\")","v":0},null,null,null,"https://www.youtube.com/watch?v=TJ5dWmZplAk"]
[null,"(iii)","jk\"Vªh; cpr i= ¼NSC)",null,null,"#-",{"$f":"IF(T14=T2,'Extra Ded '!E18,\"0\")","v":0},"(xiii)","jk\"Vªh; cpr i= ij vnr C;kt",null,null,"#-",{"$f":"IF(T14=T2,'Extra Ded '!E19,\"0\")","v":0},null,null,null,null,null,null,null,null,null,null,null,null,{"$f":"IF(AA23>AB23,AB23,AA23)","v":78584},{"$f":"IF('Master Data'!I30='GA55 Check & Edit'!AN5,0,ROUND(10%*'GA 55 '!M28,0))","v":84653},{"$f":"IF('Master Data'!I30='GA55 Check & Edit'!AN6,'GA 55 '!O28,0)","v":78584},null,null,null,null,null,"E अधिक जानकारी के लिए देखें Youtube वीडियो"]
[null,"(iv)","yksd Hkfo\"; fuf/k ¼PPF)",null,null,"#-",{"$f":"IF(T14=T2,'Extra Ded '!E20,\"0\")","v":0},"(xiv)","V;w'ku Qhl ",null,null,"#-",{"$f":"IF(T14=T2,'Extra Ded '!E16,\"0\")","v":0},null,null,null,null,null,null,null,null,null,null,null,null,{"$f":"SUM(G21:G31)+SUM(M22:M30)+O33","v":{"$error":"#VALUE!"}},{"$f":"IF('Extra Ded '!I14>50000,50000,'Extra Ded '!I14)","v":0},{"$f":"IF(Z24>150000,Z24-150000,0)","v":{"$error":"#VALUE!"}}]
[null,"(v)","jk\"Vªh; cpr Ldhe ¼NSS)",null,null,"#-",{"$f":"IF(T14=T2,'Extra Ded '!E21,\"0\")","v":0},"(xv)","bfDoVh fyad lsfoax Ldhe",null,null,"#-",{"$f":"IF(T14=T2,'Extra Ded '!I6,\"0\")","v":0}]
[null,"(vi)","lkekU; izko/kk;h fuf/k ¼GPF)",null,null,"#-",{"$f":"IF(AND(T14=T2,'Master Data'!I30='GA55 Check & Edit'!AN5),'GA 55 '!O28,\"0\")","v":"0"},"(xvi)","LFkfxr okf\"kZdh ¼Defferred Annuty)",null,null,"#-",{"$f":"IF(T14=T2,'Extra Ded '!I8,\"0\")","v":0},null,null,null,"यदि आप NPS कार्मिक है और Section US 80CCD (1B) के अंतर्गत अधिकतम 50,000 की छूट लेना चाहते है तो यहाँ नीचे बॉक्स में क्लिक करे। "]
[null,"(vii)","lkewfgd chek izhfe;e ¼G.Ins.)",null,null,"#-",{"$f":"IF(T14=T2,'GA 55 '!Y28,\"0\")","v":220},"(xvii)","ih-,y-vkbZ- ¼PLI)",null,null,"#-",{"$f":"IF(T14=T2,'Extra Ded '!E15,\"0\")","v":0},null,null,null,null,null,null,null,null,null,null,null,null,null,{"$f":"IFERROR(SUM(Z23)-MIN(AA24,AB24),0)","v":0},null,{"$f":"MIN(AA24,AB24)","v":{"$error":"#VALUE!"}}]
[null,"(viii)",";w- ,y- vkbZ- ih-@okf\"kZd Iyku",null,null,"#-",{"$f":"IF(T14=T2,'Extra Ded '!E17,\"0\")","v":0},"(xviii)","vU; tekjkf'k ¼/kkjk 80 lh ds vUrxZr½ E;qpy QaM",null,null,"#-",{"$f":"IF(T14=T2,'Extra Ded '!I13,\"0\")","v":0}]
[null,"(ix)","x`g _.k fdLr ¼HBA Premium)",null,null,"#-",{"$f":"IF(T14=T2,'Extra Ded '!E12,\"0\")","v":0},"(xix)","lqdU;k le`f) ;kstuk esa tek jkf'k",null,null,"#-",{"$f":"IF(T14=T2,'Extra Ded '!E22,\"0\")","v":0},null,null,null,null,null,null,null,null,null,null,null,null,null,{"$f":"IF(Z24>=200000,50000,AC27)","v":{"$error":"#VALUE!"}}]
[null,"(x)","osru ls vfrfjDr thou chek (Extra LIC)",null,null,"#-",{"$f":"IF(T14=T2,'Extra Ded '!E14,\"0\")","v":0},"(xx)","vU; o fQDl fMiksftV ¼5 o\"kZ gsrq½",null,null,"#-",{"$f":"IF(T14=T2,'Extra Ded '!I10,\"0\")","v":0}]
[null,"(xxi)",{"$f":"IF('Master Data'!N43=\"Yes\",\"thih,Q&2004 esa dVksrh\",\"\")","v":""},null,null,"#-",{"$f":"IF(AND('Master Data'!N43=\"Yes\",T14=T2),'GA 55 '!T28,0)","v":0},";ksx ( i ls xviii )",null,null,null,"#-",{"$f":"SUM(G21:G31)+SUM(M21:M30)","v":185364},null,null,null,null,null,null,null,null,null,null,null,null,null,{"$f":"('Extra Ded '!I23+'Extra Ded '!I21)","v":1500}]
[null,"                        vf/kdre dVkSrh dh jkf'k 1-50 yk[k #i, rd",null,null,null,null,null,null,null,null,null,null,null,"#-",{"$f":"IF(M31<150001,ROUND(M31,0),150000)","v":150000},null,null,"H","Move curser",null,null,null,null,null,null,null,{"$f":"IF(AA31>10000,10000,AA31)","v":1500},{"$f":"IF(AA31>50000,50000,AA31)","v":1500}]
[null,"(B) ?kVkb;s& /kkjk 80CCD(2) fu;ksDrk }kjk isa'ku va'knku dh jkf'k ¼vf/kdre osru dk 10%) i`Fkd ls NwV",null,null,null,null,null,null,null,null,null,null,null,null,{"$f":"IF('Master Data'!I30='GA55 Check & Edit'!AN6,'GA 55 '!O27,0)","v":""},null,null,null,null,null,null,null,null,null,null,null,{"$f":"IF('Master Data'!E24=\"Under 60\",AA32,IF('Master Data'!E24=\"Above 60\",AB32,IF('Master Data'!E24=\"Above 80\",AB32,0)))","v":1500}]
[null,"(C) ?kVkb;s & /kkjk 80CCD (1B) uohu isa'ku ;kstuk esa vfrfjDr va'knku ¼vf/kdre :- 50]000)",null,null,null,null,null,null,null,null,null,null,null,"#-",{"$f":"IF(T14=T1,0,IF(T34=T36,AB35,0))","v":0},null,null,null,null,false]
[null,";ksx 11(A+B+C)      ",null,null,null,null,null,null,null,null,null,null,null,"#-",{"$f":"SUM(O32:O34)","v":150000},null,null,null,null,null,null,null,null,null,null,null,null,{"$f":"IF('Master Data'!I30='GA55 Check & Edit'!AN6,AA29,0)","v":{"$error":"#VALUE!"}}]
[12," vU; dVkSfr;k¡",null,null,null,null,null,null,null,null,null,null,null,null,null,null,null,null,null,true]
[null,"1-/kkjk 80 D fpfdRlk chek izhfe;e ¼Lo;a]ifr@iRuh o cPpksa ds fy, : 25000] ekrk&firk ds fy, : 25000]lhfu;j flVhtu : 50000½",null,null,null,null,null,null,null,null,null,null,null,"#-",{"$f":"IF(T14=T2,'Extra Ded '!I15,\"0\")","v":0}]
[null,"2- /kkjk 80DD fodykax vkfJrksa ds fpfdRlk mipkj ¼vf/kdre 75]000 rFkk 80% ;k vf/kd fodykaxrk 125]000½",null,null,null,null,null,null,null,null,null,null,null,"#-",{"$f":"IF(T14=T2,'Extra Ded '!I16,\"0\")","v":0},null,null,null,null,null,null,null,null,null,null,null,null,{"$f":"'GA 55 '!N28+'GA 55 '!P28+'Extra Ded '!E18+'Extra Ded '!E20+'Extra Ded '!E21+'GA 55 '!O28+'GA 55 '!Y28+'Extra Ded '!E17+'Extra Ded '!E12+'Extra Ded '!E14+'Extra Ded '!I12+'Extra Ded '!E19+'Extra Ded '!E16+'Extra Ded '!I6+'Extra Ded '!I8+'Extra Ded '!E15+'Extra Ded '!I10+'Extra Ded '!E22+'Extra Ded '!E24","v":185364}]
[null,"3- /kkjk 80DDB fof'k\"V jksaxksa ds mipkj gsrq dVkSrh ¼vf/kdre : 40]000] lhfu;j flVhtu gsrq : 100]000½",null,null,null,null,null,null,null,null,null,null,null,"#-",{"$f":"IF(T14=T2,'Extra Ded '!I17,\"0\")","v":0}]
[null,"4- /kkjk 80E mPp f'k{kk gsrq fy, _.k dk C;kt",null,null,null,null,null,null,null,null,null,null,null,"#-",{"$f":"IF(T14=T2,'Extra Ded '!I18,\"0\")","v":0},null,null,null,null,null,null,null,null,null,null,null,null,{"$f":"'Extra Ded '!I15+'Extra Ded '!I16+'Extra Ded '!I17+'Extra Ded '!I18+('Extra Ded '!I19+'GA 55 '!U28)+'Extra Ded '!I20+AA33+'Extra Ded '!I22","v":1500}]
[null,"5- /kkjk 80G /kekZFkZ laLFkkvksa vkfn dks fn;s nku ¼ d Js.kh esa 100 izfr'kr ,oa [k Js.kh esa 50 izfr'kr½ ¼dsUnz o jkT; ljdkj ds QaM esa ½",null,null,null,null,null,null,null,null,null,null,null,"#-",{"$f":"IF(T14=T2,('Extra Ded '!I19),\"0\")","v":0},null,null,"यदि आपको धारा 80 TTA  के बारे में डिटेल से जानकारी चाहिए तो नीचे सेल पर माउस को ले जाइये। "]
[null,"6- /kkjk 80U LFkkbZ :i ls 'kkjhfjd vleFkZrrk dh n'kk esa ¼vf/kdre 75]000 rFkk  vf/kfu;e 1995ds vuqlkj 125]000½",null,null,null,null,null,null,null,null,null,null,null,"#-",{"$f":"IF(T14=T2,'Extra Ded '!I20,\"0\")","v":0}]
[null,"7- /kkjk 80 TTA cpr [kkrs ij vf/kdre C;kt :- 10]000 194(IA)  , ( ofj\"B ukxfjdks C;kt ij NwV 50000rd ½",null,null,null,null,null,null,null,null,null,null,null,"#-",{"$f":"IF(T14=T2,AA33,\"0\")","v":1500}]
[null,"8- /kkjk 80 GGA vuqeksfnr oSKkfud] lkekftd] xzkeh.k fodkl vkfn gsrq fn;k x;k nku",null,null,null,null,null,null,null,null,null,null,null,"#-",{"$f":"IF(T14=T2,'Extra Ded '!I22,\"0\")","v":0},null,null,"Move Curser Here"]
[null,"dqy ;ksx 12 ¼ 1 ls 8 rd ½",null,null,null,null,null,null,null,null,null,null,null,"#-",{"$f":"SUM(O37:O44)","v":1500}]
[13,"dqy dVkSrh ( 11 + 12)",null,null,null,null,null,null,null,null,null,null,null,"#-",{"$f":"O35+O45","v":151500}]
[14,"dj ;ksX; vk; ( 10 - 13 )",null,null,null,null,null,null,null,null,null,null,null,"#-",{"$f":"(O18-O46)","v":725118}]
[15,"dqy vk; dh jkf'k dks lEiw.kZ djuk ¼ nl ds xq.kd esa ½ /kkjk 288A",null,null,null,null,null,null,null,null,null,null,null,"#-",{"$f":"ROUND(O47,-1)","v":725120}]
[16," vk;dj dh x.kuk  mijksDr dkWye 15 ds vk/kkj ij",null,null,null,null,null,null,null,null,null,null,null,null,null,null,null,"Unlock only This Sheet , Password is",null,null,null,null,null,"old",null,null,null,"New"]
[null,",d O;fDr dj nkrk",null,null,null,"ofj\"B ukxfjd ¼60 ls 80 o\"kZ rd½",null,null,null,"80 o\"kZ ;k vf/kd vk;q",null,null,null,null,null,null,null,"Incometax2021",null,null,null,null,null,0,0,0,0,0,0,0,0]
[null,"Up to Rs. 2,50,000",null,null,0,{"$f":"IF(T14=T2,\"Up to Rs. 3,00,000\",\"Up to Rs. 2,50,000\")","v":"Up to Rs. 3,00,000"},null,null,0,{"$f":"IF(T14=T2,\"\",\"Up to Rs. 2,50,000\")","v":""},null,null,0,"#-",0,null,null,null,null,null,null,null,null,{"$f":"ROUND(IF(O48<=250000,0,IF(O48>=500000,12500,IF(O48<=500000,0+(O48-250000)*0.05))),0)","v":12500},{"$f":"ROUND(IF(O48<=300000,0,IF(O48>=500000,10000,IF(O48<=500000,(O48-300000)*0.05))),0)","v":10000},0,{"$f":"IF('Master Data'!$E$24=\"Under 60\",X51,IF('Master Data'!$E$24=\"Above 60\",Y51,Z51))","v":12500},{"$f":"ROUND(IF(O48<250001,0,IF(O48>500000,12500,((O48-250000)*0.05))),0)","v":12500},{"$f":"ROUND(IF(O48<250001,0,IF(O48>500000,12500,((O48-250000)*0.05))),0)","v":12500},{"$f":"ROUND(IF(O48<250001,0,IF(O48>500000,12500,((O48-250000)*0.05))),0)","v":12500},{"$f":"IF('Master Data'!$E$24=\"Under 60\",AB51,IF('Master Data'!$E$24=\"Above 60\",AC51,AD51))","v":12500}]
[null,"2,50,001  to  5,00,000",null,null,0.050000000000000003,{"$f":"IF(T14=T2,\"3,00,001 to 5,00,000\",\" 2,50,001 to  5,00,000\")","v":"3,00,001 to 5,00,000"},null,null,0.050000000000000003,{"$f":"IF(T14=T2,\"Up to Rs. 5,00,000\",\"2,50,001 to  5,00,000\")","v":"Up to Rs. 5,00,000"},null,null,{"$f":"IF(T14=T2,\"0%\",\"5%\")","v":"0%"},"#-",{"$f":"IF($T$14=$T$2,AA51,AE51)","v":12500},null,null,null,null,null,null,null,null,{"$f":"ROUND(IF(O48<=500000,0,IF(O48>=1000000,100000,IF(O48<=1000000,(O48-500000)*0.2,\"0\"))),0)","v":45024},{"$f":"ROUND(IF(O48<=500000,0,IF(O48>=1000000,100000,IF(O48<=1000000,(O48-500000)*0.2,\"0\"))),0)","v":45024},{"$f":"ROUND(IF(O48<=500000,0,IF(O48>=1000000,100000,IF(O48<=1000000,(O48-500000)*0.2,\"0\"))),0)","v":45024},{"$f":"IF('Master Data'!$E$24=\"Under 60\",X52,IF('Master Data'!$E$24=\"Above 60\",Y52,Z52))","v":45024},{"$f":"ROUND(IF(O48<500001,0,IF(O48>750000,25000,((O48-500000)*0.1))),0)","v":22512},{"$f":"ROUND(IF(O48<500001,0,IF(O48>750000,25000,((O48-500000)*0.1))),0)","v":22512},{"$f":"ROUND(IF(O48<500001,0,IF(O48>750000,25000,((O48-500000)*0.1))),0)","v":22512},{"$f":"IF('Master Data'!$E$24=\"Under 60\",AB52,IF('Master Data'!$E$24=\"Above 60\",AC52,AD52))","v":22512}]
[null,{"$f":"IF(T14=T2,\"5,00,001 to 10,00,000\",\"5,00,001  to  7,50,000\")","v":"5,00,001 to 10,00,000"},null,null,{"$f":"IF(T14=T2,\"20%\",\"10%\")","v":"20%"},{"$f":"IF(T14=T2,\"5,00,001 to 10,00,000\",\"5,00,001  to  7,50,000\")","v":"5,00,001 to 10,00,000"},null,null,{"$f":"IF(T14=T2,\"20%\",\"10%\")","v":"20%"},{"$f":"IF(T14=T2,\"5,00,001 to 10,00,000\",\"5,00,001  to  7,50,000\")","v":"5,00,001 to 10,00,000"},null,null,{"$f":"IF(T14=T2,\"20%\",\"10%\")","v":"20%"},"#-",{"$f":"IF($T$14=$T$2,AA52,AE52)","v":45024},null,null,null,null,null,null,null,null,{"$f":"ROUND(IF(O48>1000000,(O48-1000000)*0.3,\"0\"),0)","v":0},{"$f":"ROUND(IF(O48>1000000,(O48-1000000)*0.3,\"0\"),0)","v":0},{"$f":"ROUND(IF(O48>1000000,(O48-1000000)*0.3,\"0\"),0)","v":0},{"$f":"IF('Master Data'!$E$24=\"Under 60\",X53,IF('Master Data'!$E$24=\"Above 60\",Y53,Z53))","v":0},{"$f":"ROUND(IF(O48<750001,0,IF(O48>1000000,37500,((O48-750000)*0.15))),0)","v":0},{"$f":"ROUND(IF(O48<750001,0,IF(O48>1000000,37500,((O48-750000)*0.15))),0)","v":0},{"$f":"ROUND(IF(O48<750001,0,IF(O48>1000000,37500,((O48-750000)*0.15))),0)","v":0},{"$f":"IF('Master Data'!$E$24=\"Under 60\",AB53,IF('Master Data'!$E$24=\"Above 60\",AC53,AD53))","v":0}]
[null,{"$f":"IF(T14=T2,\"Above  10,00,000\",\" 7,50,001 to  10,00,000\")","v":"Above  10,00,000"},null,null,{"$f":"IF(T14=T2,\"30%\",\"15%\")","v":"30%"},{"$f":"IF(T14=T2,\"Above  10,00,000\",\" 7,50,001 to  10,00,000\")","v":"Above  10,00,000"},null,null,{"$f":"IF(T14=T2,\"30%\",\"15%\")","v":"30%"},{"$f":"IF(T14=T2,\"Above  10,00,000\",\" 7,50,001 to  10,00,000\")","v":"Above  10,00,000"},null,null,{"$f":"IF(T14=T2,\"30%\",\"15%\")","v":"30%"},"#-",0,null,null,null,null,null,null,null,null,null,null,null,{"$f":"IF('Master Data'!$E$24=\"Under 60\",X54,IF('Master Data'!$E$24=\"Above 60\",Y54,Z54))","v":0},{"$f":"ROUND(IF(O48<1000001,0,IF(O48>1250000,50000,((O48-1000000)*0.2))),0)","v":0},{"$f":"ROUND(IF(O48<1000001,0,IF(O48>1250000,50000,((O48-1000000)*0.2))),0)","v":0},{"$f":"ROUND(IF(O48<1000001,0,IF(O48>1250000,50000,((O48-1000000)*0.2))),0)","v":0},{"$f":"IF('Master Data'!$E$24=\"Under 60\",AB54,IF('Master Data'!$E$24=\"Above 60\",AC54,AD54))","v":0}]
[null,{"$f":"IF(T14=T2,\" \",\"10,00,001 to  12,50,000\")","v":" "},null,null,{"$f":"IF(T14=T2,\" \",\"20%\")","v":" "},{"$f":"IF(T14=T2,\" \",\"10,00,001 to  12,50,000\")","v":" "},null,null,{"$f":"IF(T14=T2,\" \",\"20%\")","v":" "},{"$f":"IF(T14=T2,\" \",\"10,00,001 to  12,50,000\")","v":" "},null,null,{"$f":"IF(T14=T2,\" \",\"20%\")","v":" "},{"$f":"IF(T14=T2,\" \",\"#-\")","v":" "},{"$f":"IF($T$14=$T$2,AA54,AE54)","v":0},null,null,"यदि आपको धारा 87A  के बारे में जानकारी चाहिए तो नीचे सेल पर माउस को ले जाइये। ",null,null,null,null,null,null,null,null,{"$f":"IF('Master Data'!$E$24=\"Under 60\",X55,IF('Master Data'!$E$24=\"Above 60\",Y55,Z55))","v":0},{"$f":"ROUND(IF(O48<1250001,0,IF(O48>1500000,62500,((O48-1250000)*0.25))),0)","v":0},{"$f":"ROUND(IF(O48<1250001,0,IF(O48>1500000,62500,((O48-1250000)*0.25))),0)","v":0},{"$f":"ROUND(IF(O48<1250001,0,IF(O48>1500000,62500,((O48-1250000)*0.25))),0)","v":0},{"$f":"IF('Master Data'!$E$24=\"Under 60\",AB55,IF('Master Data'!$E$24=\"Above 60\",AC55,AD55))","v":0}]
[null,{"$f":"IF(T14=T2,\" \",\"12,50,001 to  15,00,000\")","v":" "},null,null,{"$f":"IF(T14=T2,\" \",\"25%\")","v":" "},{"$f":"IF(T14=T2,\" \",\"12,50,001 to  15,00,000\")","v":" "},null,null,{"$f":"IF(T14=T2,\" \",\"25%\")","v":" "},{"$f":"IF(T14=T2,\" \",\"12,50,001 to  15,00,000\")","v":" "},null,null,{"$f":"IF(T14=T2,\" \",\"25%\")","v":" "},{"$f":"IF(T14=T2,\" \",\"#-\")","v":" "},0,null,null,null,null,null,null,null,null,null,null,null,{"$f":"IF('Master Data'!$E$24=\"Under 60\",X56,IF('Master Data'!$E$24=\"Above 60\",Y56,Z56))","v":0},{"$f":"ROUND(IF(O48<1500001,0,(O48-1500000)*0.3),0)","v":0},{"$f":"ROUND(IF(O48<1500001,0,(O48-1500000)*0.3),0)","v":0},{"$f":"ROUND(IF(O48<1500001,0,(O48-1500000)*0.3),0)","v":0},{"$f":"IF('Master Data'!$E$24=\"Under 60\",AB56,IF('Master Data'!$E$24=\"Above 60\",AC56,AD56))","v":0}]
[null,{"$f":"IF(T14=T2,\" \",\"Above Rs. 15,00,000\")","v":" "},null,null,{"$f":"IF(T14=T2,\" \",\"30%\")","v":" "},{"$f":"IF(T14=T2,\" \",\"Above Rs. 15,00,000\")","v":" "},null,null,{"$f":"IF(T14=T2,\" \",\"30%\")","v":" "},{"$f":"IF(T14=T2,\" \",\"Above Rs. 15,00,000\")","v":" "},null,null,{"$f":"IF(T14=T2,\" \",\"30%\")","v":" "},{"$f":"IF(T14=T2,\" \",\"#-\")","v":" "},{"$f":"IF($T$14=$T$2,AA56,AE56)","v":0},null,null,null,null,null,null,null,null,{"$f":"SUM(X50:X53)","v":57524},{"$f":"SUM(Y50:Y53)","v":55024},45024,{"$f":"IF('Master Data'!$E$24=\"Under 60\",X57,IF('Master Data'!$E$24=\"Above 60\",Y57,Z57))","v":57524},{"$f":"SUM(AB50:AB56)","v":35012},{"$f":"SUM(AC50:AC56)","v":35012},35012,{"$f":"IF('Master Data'!$E$24=\"Under 60\",AB57,IF('Master Data'!$E$24=\"Above 60\",AC57,AD57))","v":35012}]
[null,"¼1½ ;ksx vk;dj",null,null,null,null,null,null,null,null,null,null,null,"#-",{"$f":"SUM(O51:O57)","v":57524}]
[null,"¼2½ NwV ?kkjk 87¼A½ ¼ 5yk[k rd dh dj ;ksX; vk; ij vk;dj dh NwV vf/kdre :- 12500@& rd½",null,null,null,null,null,null,null,null,null,null,null,"#-",{"$f":"IF(O48>500000,0,IF(O58<12500,O58,12500))","v":0},null,null,null,null,null,null,null,null,{"$f":"ROUND(IF(O48<=250000,0,IF(O48<=500000,(O48-250000)*0.05,IF(O48<=1000000,12500+(O48-500000)*0.2,IF(O48>1000000,112500+(O48-1000000)*0.3,\"0\")))),0)","v":57524},{"$f":"ROUND(IF(O48<=300000,0,IF(O48<=500000,(O48-300000)*0.05,IF(O48<=1000000,10000+(O48-500000)*0.2,IF(O48>1000000,110000+(O48-1000000)*0.3,\"0\")))),0)","v":55024},{"$f":"ROUND(IF(O48<=250000,0,IF(O48<=500000,(O48-250000)*0.05,IF(O48<=1000000,0+(O48-500000)*0.2,IF(O48>1000000,100000+(O48-1000000)*0.3,\"0\")))),0)","v":45024}]
[null,"¼3½ 'ks\"k vk;dj ¼1&2½",null,null,null,null,null,null,null,null,null,null,null,"#-",{"$f":"O58-O59","v":57524},null,null,null,null,null,null,null,null,null,{"$f":"IF(T63>350000,0,IF(T63<2501,T63,2500))","v":0}]
[null,"¼4½ ","f'k{kk ,oa fpfdRlk midj  4%  ¼vk;dj ij ½",null,null,null,null,null,null,null,null,null,null,"#-",{"$f":"ROUND((O60*0.04),0)","v":2301}]
[null,"                                                             dqy vk;dj ¼3$4½",null,null,null,null,null,null,null,null,null,null,null,"#-",{"$f":"SUM(O60:O61)","v":59825}]
[17,"?kVkb;s  %& jkgr /kkjk 89 ds rgr ",null,null,null,null,null,null,null,null,null,null,null,"#-",{"$f":"'Extra Ded '!I24","v":0}]
[18,"dqy 'ks\"k vk;dj",null,null,null,null,null,null,null,null,null,null,null,"#-",{"$f":"O62-O63","v":59825}]
[19," vk;dj dVkSrh\n dk fooj.k",null,null,"flrEcj 2021\nrd dqy dVkSrh",null,null,"vDVwcj ls fnlEcj\n2021 rd dVkSrh",null,"tuojh 2022\nekg esa dVkSrh","Qjojh 2022\nekg esa dVkSrh",null,"Vh-Mh-,l- ls dVkSrh\no vU;",null,"dqy;ksx dkWye 19 "]
[null,null,null,null,{"$f":"SUM('GA55 Check & Edit'!BX12:BX18)","v":9000},null,null,{"$f":"SUM('GA55 Check & Edit'!BX19:BX21)","v":4500},null,{"$f":"'GA55 Check & Edit'!BX22","v":1500},{"$f":"'GA55 Check & Edit'!BX23","v":0},null,{"$f":"SUM('GA 55 '!X28-(E66+H66+J66+K66))+'Extra Ded '!I9","v":0},null,{"$f":"SUM(E66,H66,J66,K66,M66)","v":15000}]
[{"$f":"IF(O64>O66,\"Income Tax Payable\",IF(O64<O66,\"Income Tax Refundable\",\"Income Tax Payble/Refundable\"))","v":"Income Tax Payable"},null,null,null,null,null,null,null,null,null,null,null,null,"#-",{"$f":"IF(O64>O66,O64-O66,O66-O64)","v":44825}]
[]
[null,null,null,null,null,null,null,null,null,null,null,"gLrk{kj dkfeZd"]

{"sheet":"Form No. 16","index":6,"n_rows":143,"n_cols":11,"rows_kept":143,"cut":false,"hidden":true,"merged":[[0,1,0,11],[1,1,1,11],[2,1,2,11],[3,1,3,11],[4,1,4,5],[4,6,4,11],[79,8,82,9],[75,1,75,5],[8,1,8,3],[8,4,8,5],[8,6,8,8],[8,9,8,11],[9,1,9,5],[9,6,9,7],[9,8,9,11],[5,1,5,5],[5,6,5,11],[6,1,6,5],[6,6,6,11],[7,1,7,3],[7,4,7,5],[7,6,7,8],[7,9,7,11],[12,1,12,11],[13,2,13,4],[13,6,13,8],[13,9,13,11],[14,2,14,4],[14,6,14,8],[14,9,14,11],[10,2,10,5],[10,6,11,7],[10,8,10,9],[10,10,10,11],[11,2,11,3],[11,8,11,9],[11,10,11,11],[17,2,17,4],[17,6,17,8],[17,9,17,11],[18,1,18,4],[18,6,18,8],[18,9,18,11],[15,2,15,4],[15,6,15,8],[15,9,15,11],[16,2,16,4],[16,6,16,8],[16,9,16,11],[23,2,23,3],[23,6,23,8],[23,9,23,11],[24,2,24,3],[24,6,24,8],[24,9,24,11],[19,1,19,11],[20,1,20,11],[21,1,22,1],[21,2,22,3],[21,4,21,11],[22,6,22,8],[22,9,22,11],[27,2,27,3],[27,6,27,8],[27,9,27,11],[28,2,28,3],[28,6,28,8],[28,9,28,11],[25,2,25,3],[25,6,25,8],[25,9,25,11],[26,2,26,3],[26,6,26,8],[26,9,26,11],[31,2,31,3],[31,6,31,8],[31,9,31,11],[32,2,32,3],[32,6,32,8],[32,9,32,11],[29,2,29,3],[29,6,29,8],[29,9,29,11],[30,2,30,3],[30,6,30,8],[30,9,30,11],[35,2,35,3],[35,6,35,8],[35,9,35,11],[36,2,36,3],[36,6,36,8],[36,9,36,11],[33,2,33,3],[33,6,33,8],[33,9,33,11],[34,2,34,3],[34,6,34,8],[34,9,34,11],[41,10,41,11],[42,2,42,3],[42,4,42,5],[42,6,42,7],[42,8,42,9],[42,10,42,11],[37,2,37,3],[37,4,37,11],[38,1,38,11],[39,1,39,11],[40,1,41,1],[40,2,41,3],[40,4,40,11],[41,4,41,5],[41,6,41,7],[41,8,41,9],[43,2,43,3],[43,4,43,5],[43,6,43,7],[43,8,43,9],[43,10,43,11],[44,2,44,3],[44,4,44,5],[44,6,44,7],[44,8,44,9],[44,10,44,11],[45,2,45,3],[45,4,45,5],[45,6,45,7],[45,8,45,9],[45,10,45,11],[46,2,46,3],[46,4,46,5],[46,6,46,7],[46,8,46,9],[46,10,46,11],[47,2,47,3],[47,4,47,5],[47,6,47,7],[47,8,47,9],[47,10,47,11],[48,2,48,3],[48,4,48,5],[48,6,48,7],[48,8,48,9],[48,10,48,11],[49,2,49,3],[49,4,49,5],[49,6,49,7],[49,8,49,9],[49,10,49,11],[50,2,50,3],[50,4,50,5],[50,6,50,7],[50,8,50,9],[50,10,50,11],[51,2,51,3],[51,4,51,5],[51,6,51,7],[51,8,51,9],[51,10,51,11],[52,2,52,3],[52,4,52,5],[52,6,52,7],[52,8,52,9],[52,10,52,11],[53,2,53,3],[53,4,53,5],[53,6,53,7],[53,8,53,9],[53,10,53,11],[54,2,54,3],[54,4,54,5],[54,6,54,7],[54,8,54,9],[54,10,54,11],[57,1,57,11],[58,1,58,11],[59,2,59,4],[59,6,59,9],[59,10,59,11],[60,1,60,2],[60,3,60,5],[60,6,60,11],[55,2,55,3],[55,4,55,5],[55,6,55,7],[55,8,55,9],[55,10,55,11],[56,2,56,3],[56,4,56,11],[65,1,65,2],[65,3,65,4],[65,5,65,11],[66,1,66,2],[66,3,66,4],[66,6,66,11],[61,3,61,7],[61,8,61,11],[62,1,62,11],[63,1,63,11],[64,1,64,2],[64,3,64,4],[64,5,64,11],[67,1,67,11],[68,1,68,11],[69,1,69,5],[69,6,69,7],[69,8,72,9],[70,1,70,5],[70,6,70,7],[71,1,71,5],[71,6,71,7],[72,1,72,5],[72,6,72,7],[78,8,78,9],[79,1,79,5],[74,8,77,9],[76,1,76,3],[80,1,80,2],[80,3,80,5],[80,6,80,7],[81,1,81,2],[93,8,95,9],[90,1,90,4],[81,3,81,5],[81,6,81,7],[77,1,77,3],[77,6,77,7],[78,1,78,5],[78,6,79,7],[82,1,82,2],[82,3,82,5],[82,6,82,7],[94,1,94,5],[92,1,92,4],[92,6,92,7],[92,8,92,9],[85,1,85,5],[93,1,93,5],[96,6,96,7],[97,4,97,5],[97,6,97,7],[103,4,103,5],[103,6,103,7],[96,1,96,5],[117,6,117,7],[117,8,117,9],[98,4,98,5],[98,6,98,7],[99,4,99,5],[99,6,99,7],[105,4,105,5],[105,6,105,7],[101,4,101,5],[101,6,101,7],[102,4,102,5],[102,6,102,7],[100,4,100,5],[100,6,100,7],[104,4,104,5],[104,6,104,7],[109,10,109,11],[106,4,106,5],[106,6,106,7],[107,4,107,5],[107,6,107,7],[119,8,119,9],[114,6,114,7],[114,8,114,9],[115,2,115,5],[115,6,115,7],[115,8,115,9],[116,2,116,5],[108,6,108,7],[110,2,110,5],[110,6,110,7],[110,8,110,9],[110,10,110,11],[111,2,111,5],[111,6,111,7],[111,8,111,9],[111,10,111,11],[109,6,109,7],[109,8,109,9],[135,1,135,11],[127,1,127,5],[127,8,127,9],[127,10,127,11],[128,10,128,11],[124,10,124,11],[125,10,125,11],[126,10,126,11],[125,1,125,3],[126,1,126,9],[124,1,124,9],[125,4,125,9],[128,1,128,9],[129,1,129,9],[130,1,130,9],[131,1,131,9],[132,1,132,9],[131,10,131,11],[132,10,132,11],[134,10,134,11],[129,10,129,11],[130,10,130,11],[133,1,133,9],[133,10,133,11],[134,1,134,9],[69,10,83,11],[83,1,83,5],[84,1,84,5],[84,8,91,9],[84,10,84,11],[85,10,87,11],[86,1,86,2],[86,3,86,4],[87,1,87,2],[87,3,87,4],[88,1,88,2],[88,3,88,4],[88,6,88,7],[88,10,88,11],[89,1,89,5],[89,6,91,7],[91,1,91,4],[83,8,83,9],[73,1,73,5],[73,6,76,7],[73,8,73,9],[74,1,74,5],[96,8,96,9],[93,10,93,11],[94,10,95,11],[95,1,95,5],[112,8,112,10],[113,1,113,11],[114,1,114,5],[114,10,114,11],[115,10,122,11],[122,2,122,5],[118,2,118,5],[118,6,118,7],[118,8,118,9],[119,2,119,5],[119,6,119,7],[116,6,116,7],[116,8,116,9],[117,2,117,5],[96,10,96,11],[97,1,111,1],[97,3,109,3],[97,8,108,9],[97,10,108,11],[108,4,108,5],[109,4,109,5],[123,2,123,5],[122,6,122,7],[122,8,122,9],[123,6,123,7],[123,8,123,9],[123,10,123,11],[120,8,120,9],[121,2,121,5],[121,6,121,7],[121,8,121,9],[120,2,120,5],[120,6,120,7],[140,5,140,11],[141,1,141,2],[141,3,141,4],[141,5,141,11],[142,1,142,2],[142,3,142,4],[142,6,142,11],[136,2,136,4],[136,6,136,9],[136,10,136,11],[137,1,137,2],[137,3,137,5],[137,6,137,11],[138,3,138,7],[138,8,138,11],[139,1,139,11],[140,1,140,2],[140,3,140,4]]}
[null,"FORM NO. 16"]
[null,"[(See Rule 31(1)(a)]"]
[null,"PART-A"]
[null,"Certificate under section 203 of the income-tax act, 1961 for Tax deducted at source on Salary."]
[null,"Name and address of the Employer",null,null,null,null,"Name and adress of the Employee"]
[null,{"$f":"IF('Master Data'!H8=\"\",\"\",UPPER('Master Data'!H8))","v":"USHA PALIYA"},null,null,null,null,{"$f":"IF('Master Data'!D6=\"\",\"\",UPPER('Master Data'!D6))","v":"HEERALAL JAT"}]
[null,null,null,null,null,null,{"$f":"IF('Master Data'!D8=\"\",\"\",UPPER('Master Data'!D8))","v":"M.G.G.S. BAR"}]
[null,"PAN of the Deductor",null,null,"TAN of  the Deductor",null,"PAN of the Employee",null,null,"Employee Ref No."]
[null,null,null,null,{"$f":"'Master Data'!H12","v":0},null,{"$f":"UPPER('Master Data'!D12)","v":"ABCDE1234H"},null,null,{"$f":"UPPER('Master Data'!D10)","v":"RJPAXXXXXXXX4272"}]
[null,"CIT (TDS)",null,null,null,null,"Assess. Year",null,"Peroid with the Employer"]
[null,"Adress","The Commissioner of Income Tax, Pali",null,null,null,"2022-23",null,"From",null,"To"]
[null,"City","PALI",null,"PIN Code",306401,null,null,"01-4-2021",null,"31-03-2022"]
[null,"Summary of amount paid/credited and tax deducted at source thereon in respect of the employee"]
[null,"Quarters","Receipt Numbers of original quarterly statements of TDS under sub-secion (3) of section 200",null,null,"Amount paid/ credited","Amount of tax deducted (Rs.)",null,null,"Amount of tax deposited/ remitted (Rs.)"]
[null,"1st ",null,null,null,null,{"$f":"SUM('GA55 Check & Edit'!BX12:BX14)","v":3000},null,null,{"$f":"G15","v":3000}]
[null,"2nd ",null,null,null,null,{"$f":"SUM('GA55 Check & Edit'!BX15:BX17)","v":4500},null,null,{"$f":"G16","v":4500}]
[null,"3rd  ",null,null,null,null,{"$f":"SUM('GA55 Check & Edit'!BX18:BX20)","v":4500},null,null,{"$f":"G17","v":4500}]
[null,"4th ",null,null,null,null,{"$f":"SUM('GA55 Check & Edit'!BX21:BX23)+SUM('GA 55 '!X19:'GA 55 '!X27)","v":3000},null,null,{"$f":"G18","v":3000}]
[null,"TOTAL (Rs.)",null,null,null,{"$f":"SUM(F15:F18)","v":0},{"$f":"SUM(G15:G18)","v":15000},null,null,{"$f":"SUM(J15:J18)","v":15000}]
[null,"I. Details of tax deducted and deposited in the Central Government account through book adjustment"]
[null,"(The Deductor to provide payment-wise details of tax deducted and deposited with respect to the deductee)"]
[null,"S.N.","Tax Deposited in respect of the deductee (Rs)",null,"Book identification number (BIN)"]
[null,null,null,null,"Receipt numbers of form No. 24G","DDO serial number in Form No. 24G","Date of transfer voucher (dd/mm/yyyy)",null,null,"Status of matching with Form No. 24G"]
[null,1,{"$f":"'GA 55 '!X7","v":0},null,null,null,null,null,null,{"$f":"IF(E24>\"0\",\"Yes\",\"-\")","v":"-"}]
[null,2,{"$f":"'GA 55 '!X8","v":1500},null,null,null,null,null,null,{"$f":"IF(E25>\"0\",\"Yes\",\"-\")","v":"-"}]
[null,3,{"$f":"'GA 55 '!X9","v":1500},null,null,null,null,null,null,"-"]
[null,4,{"$f":"'GA 55 '!X10","v":1500},null,null,null,null,null,null,"-"]
[null,5,{"$f":"'GA 55 '!X11","v":1500},null,null,null,null,null,null,"-"]
[null,6,{"$f":"'GA 55 '!X12","v":1500},null,null,null,null,null,null,"-"]
[null,7,{"$f":"'GA 55 '!X13","v":1500},null,null,null,null,null,null,"-"]
[null,8,{"$f":"'GA 55 '!X14","v":1500},null,null,null,null,null,null,"-"]
[null,9,{"$f":"'GA 55 '!X15","v":1500},null,null,null,null,null,null,"-"]
[null,10,{"$f":"'GA 55 '!X16","v":1500},null,null,null,null,null,null,"-"]
[null,11,{"$f":"'GA 55 '!X17","v":1500},null,null,null,null,null,null,"-"]
[null,12,{"$f":"'GA 55 '!X18","v":0},null,null,null,null,null,null,"-"]
[null,13,{"$f":"'GA 55 '!X28-SUM(C24:D35)","v":0},null,null,null,null,null,null,"-"]
[null,14,{"$f":"'[3]G.A. 55'!T24+'[3]G.A. 55'!T26","v":0},null,null,null,null,null,null,"-"]
[null,"Total",{"$f":"SUM(C24:D37)","v":15000}]
[null,"II. Details of Tax deducted and deposited in Central Government Account through Challan. "]
[null,"(The deducter to provide payment-wise details of tax deducted and deposited with respect to the deductee)"]
[null,"S.N.","Tax Deposited in respect on of the deductee (Rs)",null,"Challan identification number (CIN)"]
[null,null,null,null,"BSR code of the Bank Branch",null,"Date on which tax deposited (dd/mm/yyyy)",null,"Challan Serial Number",null,"Status of matching with OLTAS"]
[null,1,null,null,null,null,null,null,null,null,{"$f":"IF(C43>\"0\",\"Yes\",\"-\")","v":"-"}]
[null,2,null,null,null,null,null,null,null,null,{"$f":"IF(C44>\"0\",\"Yes\",\"-\")","v":"-"}]
[null,3,null,null,null,null,null,null,null,null,"-"]
[null,4,null,null,null,null,null,null,null,null,"-"]
[null,5,null,null,null,null,null,null,null,null,"-"]
[null,6,null,null,null,null,null,null,null,null,"-"]
[null,7,null,null,null,null,null,null,null,null,"-"]
[null,8,null,null,null,null,null,null,null,null,"-"]
[null,9,null,null,null,null,null,null,null,null,"-"]
[null,10,null,null,null,null,null,null,null,null,"-"]
[null,11,null,null,null,null,null,null,null,null,"-"]
[null,12,null,null,null,null,null,null,null,null,"-"]
[null,13]
[null,14]
[null,"Total",{"$f":"SUM(C43:C56)","v":0}]
[null,":: 2 ::"]
[null,"Verification"]
[null,"I",{"$f":"B6&\",\"","v":"USHA PALIYA,"},null,null,"Son/Daughter of ",null,null,null,null,"working in the "]
[null,"capacity of ",null,"PRINCIPAL",null,null,"(designation) do hereby certify that a sum of "]
[null,"Rs.",{"$f":"J19","v":15000},{"$f":"IF(OR(LEN(FLOOR(C62,1))=13,FLOOR(C62,1)<=0),\"Out of range\",PROPER(SUBSTITUTE(CONCATENATE(CHOOSE(MID(TEXT(INT(C62),REPT(0,12)),1,1)+1,\"\",\"one hundred \",\"two hundred \",\"three hundred \",\"four hundred \",\"five hundred \",\"six hundred \",\"seven hundred \",\"eight hundred \",\"nine hundred \"),CHOOSE(MID(TEXT(INT(C62),REPT(0,12)),2,1)+1,\"\",CHOOSE(MID(TEXT(INT(C62),REPT(0,12)),3,1)+1,\"ten\",\"eleven\",\"twelve\",\"thirteen\",\"fourteen\",\"fifteen\",\"sixteen\",\"seventeen\",\"eighteen\",\"nineteen\"),\"twenty\",\"thirty\",\"forty\",\"fifty\",\"sixty\",\"seventy\",\"eighty\",\"ninety\"),IF(VALUE(MID(TEXT(INT(C62),REPT(0,12)),2,1))>1,CHOOSE(MID(TEXT(INT(C62),REPT(0,12)),3,1)+1,\"\",\"-one\",\"-two\",\"-three\",\"-four\",\"-five\",\"-six\",\"-seven\",\"-eight\",\"-nine\"),IF(VALUE(MID(TEXT(INT(C62),REPT(0,12)),2,1))=0,CHOOSE(MID(TEXT(INT(C62),REPT(0,12)),3,1)+1,\"\",\"one\",\"two\",\"three\",\"four\",\"five\",\"six\",\"seven\",\"eight\",\"nine\"),\"\")),IF(C62>=10^9,\" billion \",\"\"),CHOOSE(MID(TEXT(INT(C62),REPT(0,12)),4,1)+1,\"\",\"one hundred \",\"two hundred \",\"three hundred \",\"four hundred \",\"five hundred \",\"six hundred \",\"seven hundred \",\"eight hundred \",\"nine hundred \"),CHOOSE(MID(TEXT(INT(C62),REPT(0,12)),5,1)+1,\"\",CHOOSE(MID(TEXT(INT(C62),REPT(0,12)),6,1)+1,\"ten\",\"eleven\",\"twelve\",\"thirteen\",\"fourteen\",\"fifteen\",\"sixteen\",\"seventeen\",\"eighteen\",\"nineteen\"),\"twenty\",\"thirty\",\"forty\",\"fifty\",\"sixty\",\"seventy\",\"eighty\",\"ninety\"),IF(VALUE(MID(TEXT(INT(C62),REPT(0,12)),5,1))>1,CHOOSE(MID(TEXT(INT(C62),REPT(0,12)),6,1)+1,\"\",\"-one\",\"-two\",\"-three\",\"-four\",\"-five\",\"-six\",\"-seven\",\"-eight\",\"-nine\"),IF(VALUE(MID(TEXT(INT(C62),REPT(0,12)),5,1))=0,CHOOSE(MID(TEXT(INT(C62),REPT(0,12)),6,1)+1,\"\",\"one\",\"two\",\"three\",\"four\",\"five\",\"six\",\"seven\",\"eight\",\"nine\"),\"\")),IF(VALUE(MID(TEXT(INT(C62),REPT(0,12)),4,3))>0,\" million \",\"\"),CHOOSE(MID(TEXT(INT(C62),REPT(0,12)),7,1)+1,\"\",\"one hundred \",\"two hundred \",\"three hundred \",\"four hundred \",\"five hundred \",\"six hundred \",\"seven hundred \",\"eight hundred \",\"nine hundred \"),CHOOSE(MID(TEXT(INT(C62),REPT(0,12)),8,1)+1,\"\",CHOOSE(MID(TEXT(INT(C62),REPT(0,12)),9,1)+1,\"ten\",\"eleven\",\"twelve\",\"thirteen\",\"fourteen\",\"fifteen\",\"sixteen\",\"seventeen\",\"eighteen\",\"nineteen\"),\"twenty\",\"thirty\",\"forty\",\"fifty\",\"sixty\",\"seventy\",\"eighty\",\"ninety\"),IF(VALUE(MID(TEXT(INT(C62),REPT(0,12)),8,1))>1,CHOOSE(MID(TEXT(INT(C62),REPT(0,12)),9,1)+1,\"\",\"-one\",\"-two\",\"-three\",\"-four\",\"-five\",\"-six\",\"-seven\",\"-eight\",\"-nine\"),IF(VALUE(MID(TEXT(INT(C62),REPT(0,12)),8,1))=0,CHOOSE(MID(TEXT(INT(C62),REPT(0,12)),9,1)+1,\"\",\"one\",\"two\",\"three\",\"four\",\"five\",\"six\",\"seven\",\"eight\",\"nine\"),\"\")),IF(VALUE(MID(TEXT(INT(C62),REPT(0,12)),7,3)),\" thousand \",\"\"),CHOOSE(MID(TEXT(INT(C62),REPT(0,12)),10,1)+1,\"\",\"one hundred \",\"two hundred \",\"three hundred \",\"four hundred \",\"five hundred \",\"six hundred \",\"seven hundred \",\"eight hundred \",\"nine hundred \"),CHOOSE(MID(TEXT(INT(C62),REPT(0,12)),11,1)+1,\"\",CHOOSE(MID(TEXT(INT(C62),REPT(0,12)),12,1)+1,\"ten\",\"eleven\",\"twelve\",\"thirteen\",\"fourteen\",\"fifteen\",\"sixteen\",\"seventeen\",\"eighteen\",\"nineteen\"),\"twenty\",\"thirty\",\"forty\",\"fifty\",\"sixty\",\"seventy\",\"eighty\",\"ninety\"),IF(VALUE(MID(TEXT(INT(C62),REPT(0,12)),11,1))>1,CHOOSE(MID(TEXT(INT(C62),REPT(0,12)),12,1)+1,\"\",\"-one\",\"-two\",\"-three\",\"-four\",\"-five\",\"-six\",\"-seven\",\"-eight\",\"-nine\"),IF(VALUE(MID(TEXT(INT(C62),REPT(0,12)),11,1))=0,CHOOSE(MID(TEXT(INT(C62),REPT(0,12)),12,1)+1,\"\",\"one\",\"two\",\"three\",\"four\",\"five\",\"six\",\"seven\",\"eight\",\"nine\"),\"\"))),\"  \",\" \")&IF(FLOOR(C62,1)>1,\" Rupees\",\" Rupees\"))&IF(ISERROR(FIND(\".\",C62,1)),\"\",\" and \"&PROPER(IF(LEN(LEFT(TRIM(MID(SUBSTITUTE('[3]16 NO.'!$B$62,\".\",REPT(\" \",255)),255,200)),2))=1,CHOOSE(1*LEFT(TRIM(MID(SUBSTITUTE('[3]16 NO.'!$B$62,\".\",REPT(\" \",255)),255,200)),2),\"ten\",\"twenty\",\"thirty\",\"forty\",\"fifty\",\"sixty\",\"seventy\",\"eighty\",\"ninety\")&\" Paise\",\"\")&CONCATENATE(CHOOSE(MID(TEXT(INT(LEFT(TRIM(MID(SUBSTITUTE('[3]16 NO.'!$B$62,\".\",REPT(\" \",255)),255,200)),2)),REPT(0,12)),11,1)+1,\"\",CHOOSE(MID(TEXT(INT(LEFT(TRIM(MID(SUBSTITUTE('[3]16 NO.'!$B$62,\".\",REPT(\" \",255)),255,200)),2)),REPT(0,12)),12,1)+1,\"ten\",\"eleven\",\"twelve\",\"thirteen\",\"fourteen\",\"fifteen\",\"sixteen\",\"seventeen\",\"eighteen\",\"nineteen\"),\"twenty\",\"thirty\",\"forty\",\"fifty\",\"sixty\",\"seventy\",\"eighty\",\"ninety\"),IF(VALUE(MID(TEXT(INT(LEFT(TRIM(MID(SUBSTITUTE('[3]16 NO.'!$B$62,\".\",REPT(\" \",255)),255,200)),2)),REPT(0,12)),11,1))>1,CHOOSE(MID(TEXT(INT(LEFT(TRIM(MID(SUBSTITUTE('[3]16 NO.'!$B$62,\".\",REPT(\" \",255)),255,200)),2)),REPT(0,12)),12,1)+1,\"\",\"-one\",\"-two\",\"-three\",\"-four\",\"-five\",\"-six\",\"-seven\",\"-eight\",\"-nine\")&\" Paise\",IF(LEFT(TRIM(MID(SUBSTITUTE('[3]16 NO.'!$B$62,\".\",REPT(\" \",255)),255,200)),2)=\"01\",\"one Paise\",IF(LEFT(TRIM(MID(SUBSTITUTE('[3]16 NO.'!$B$62,\".\",REPT(\" \",255)),255,200)),1)=\"0\",CHOOSE(MID(TEXT(INT(LEFT(TRIM(MID(SUBSTITUTE('[3]16 NO.'!$B$62,\".\",REPT(\" \",255)),255,200)),2)),REPT(0,12)),12,1)+1,\"\",\"one\",\"two\",\"three\",\"four\",\"five\",\"six\",\"seven\",\"eight\",\"nine\")&\" Paise\",\"\")))))))","v":"Fifteen Thousand  Rupees"},null,null,null,null,"(in words) has been deducted "]
[null,"and deposited to the credit of the Central Govt.. I further certify that the information given above is true, complete and correct "]
[null,"and is based on the books of account, documents, TDS statement, TDS deposited and other available records."]
[null,"Place",null,{"$f":"G7","v":"M.G.G.S. BAR"}]
[null,"Date",null,{"$f":"TODAY()","v":"2021-12-25"},null,"Signature of person responsible for deduction of tax"]
[null,"Designation",null,{"$f":"D61","v":"PRINCIPAL"},null,"Full name :",{"$f":"B6","v":"USHA PALIYA"}]
[null,"PART- B (Annexure)"]
[null,"DETAILS OF SALARY PAID AND ANY OTHER INCOME AND TAX DEDUCTED"]
[null,"1. Gross salary"]
[null,"(a) Salary as per provisions contained in section 17(1)",null,null,null,null,{"$f":"COMPUTATION!O4+COMPUTATION!O5","v":925118}]
[null,"(b) Value of perquisites u/s 17(2) (as per Form No. 12BA, wherever applicable)"]
[null,"(c) Profits in lieu of salary under section 17(3) (as per Form No. 12BA, wherever applicable)",null,null,null,null,0]
[null,"(d) Total  (a+b+c)",null,null,null,null,null,null,{"$f":"G71+G72+G73","v":925118}]
[null,"2. Less: Allowance to the extent exempt u/s 10 House Rent Allowance"]
[null,"Allowance"]
[null,"House Rent Allow. US10 (13 A)",null,null,{"$f":"COMPUTATION!O6","v":0},{"$f":"E77","v":0}]
[null,"US10 (14)",null,null,null,0,{"$f":"F77+F78","v":0}]
[null,"3. Balance (1 - 2)",null,null,null,null,null,null,{"$f":"I74-G78","v":925118}]
[null,"4. Deductions: U/s 16"]
[null,"(a)",null,"Standard Deduction (u/s 16 (ia)",null,null,{"$f":"COMPUTATION!K10","v":50000}]
[null,"(b)",null,"Entertainment allowance",null,null,{"$f":"COMPUTATION!K8","v":0}]
[null,"(c)",null,"Tax on employment",null,null,{"$f":"COMPUTATION!K9","v":0}]
[null,"5. Aggregate of 4 (a) and (b)",null,null,null,null,null,null,{"$f":"G82+G83+G81","v":50000}]
[null," Income chargeable under the head \"salaries\" (3-5)",null,null,null,null,null,null,null,null,{"$f":"I79-I84","v":875118}]
[null,"6. Income From House Property (a + b)"]
[null,"30% of Rent",null,"Interest on Home Loan",null,"house Tax"]
[null,{"$f":"COMPUTATION!D14","v":0},null,{"$f":"COMPUTATION!F14","v":0},null,{"$f":"COMPUTATION!I14","v":0}]
[null,"(a) Received House Rent",null,{"$f":"COMPUTATION!K12","v":0},null,"Total (a-b)   +-",{"$f":"SUM(D89-(B88+D88+F88))","v":0},null,null,null,{"$f":"K85+G89","v":875118}]
[null,"7. Add: Any other income reported by employee "]
[null,"FD व  अन्य स्रोत से प्राप्त ब्याज तथा Bond से प्राप्त ब्याज ",null,null,null,{"$f":"COMPUTATION!E17+COMPUTATION!I17","v":0}]
[null,"अन्य आय ",null,null,null,{"$f":"COMPUTATION!I16","v":0}]
[null,"Saving Bank A/C interest",null,null,null,{"$f":"COMPUTATION!E16","v":1500},{"$f":"F93","v":1500},null,{"$f":"F91+F92+F93","v":1500}]
[null,"8. Gross total income (6+7)",null,null,null,null,null,null,null,null,{"$f":"K89+I93","v":876618}]
[null,"9. Deductions under Chapter VI A"]
[null,"(A) Section 80C, 80CCC and 80CCD"]
[null,"(a) Section 80C",null,null,null,null,null,null,"Gross Amount",null,"Deductible Amount"]
[null,"A",1,"(A)","GPF",null,{"$f":"COMPUTATION!G26","v":"0"}]
[null,null,2,null,"State Insurance",null,{"$f":"COMPUTATION!G21","v":84000}]
[null,null,3,null,"Gr. Acc. Insurance",null,{"$f":"COMPUTATION!G27","v":220}]
[null,null,4,null,"LIC + ULIP + PLI",null,{"$f":"COMPUTATION!G22+COMPUTATION!G30+COMPUTATION!M27+COMPUTATION!G28","v":22560}]
[null,null,5,null,"PPF",null,{"$f":"COMPUTATION!G24","v":0}]
[null,null,6,null,"Home Loan Installment (Capital)",null,{"$f":"COMPUTATION!G29","v":0}]
[null,null,7,null,"GPF-2004",null,{"$f":"COMPUTATION!G31","v":0}]
[null,null,8,null,"Pension Plan (US80ccc+US 80CCD)(1)",null,{"$f":"COMPUTATION!M21+COMPUTATION!M22","v":78584}]
[null,null,9,null,"Tution Fee",null,{"$f":"COMPUTATION!M24","v":0}]
[null,null,10,null,"NSC + Interest on NSC",null,{"$f":"COMPUTATION!G25+COMPUTATION!M23","v":0}]
[null,null,11,null,"Sukanya Samridhi A/C",null,{"$f":"COMPUTATION!M29","v":0}]
[null,null,12,null,"Fixed Deposit above 5 years",null,{"$f":"COMPUTATION!M30","v":0}]
[null,null,13,null,"Mutual Fund",null,{"$f":"COMPUTATION!M28","v":0},null,{"$f":"SUM(G98:H110)","v":185364},null,{"$f":"IF(I110<=150000,I110,150000)","v":150000}]
[null,null,"(B) Section 80CCD(2)",null,null,null,{"$f":"COMPUTATION!O33","v":""},null,{"$f":"G111","v":""},null,{"$f":"I111","v":""}]
[null,null,"(C) Section 80CCD(1B)  (RS.-50000/-)",null,null,null,{"$f":"COMPUTATION!O34","v":0},null,{"$f":"SUM(K110,G111,G112)","v":150000},null,{"$f":"I112","v":150000}]
[null,null,null,null,null,null,null,null,"………………… 3"]
[null,":: 3 ::"]
[null,"(B) Other Sections (e.g. 80E, 80G etc.) under Chapter VIA",null,null,null,null,"Gross Amount",null,"Qualifying amount",null,"Deductible Amount"]
[null,1,"U/S 80D",null,null,null,{"$f":"COMPUTATION!O37","v":0},null,{"$f":"G116","v":0}]
[null,2,"U/S 80DD",null,null,null,{"$f":"COMPUTATION!O38","v":0},null,0]
[null,3,"U/S 80DDB",null,null,null,{"$f":"COMPUTATION!O39","v":0},null,0]
[null,4,"U/S 80E",null,null,null,{"$f":"COMPUTATION!O40","v":0},null,0]
[null,5,"U/S 80G",null,null,null,{"$f":"COMPUTATION!O41","v":0},null,0]
[null,6,"U/S 80GG",null,null,null,null,null,0]
[null,7,"U/S 80GGA",null,null,null,{"$f":"COMPUTATION!O44","v":0},null,0]
[null,8,"U/S 80U",null,null,null,{"$f":"COMPUTATION!O42","v":0},null,0]
[null,9,"US 80TTA [Exempt Saving Bank Int. Max. RS. 10,000/-]",null,null,null,{"$f":"COMPUTATION!O43","v":1500},null,1500,null,{"$f":"ROUND(SUM(I116:J124),0)","v":1500}]
[null,"10. Aggregate of deductible amount under chapter VIA ",null,null,null,null,null,null,null,null,{"$f":"ROUND((K112+K124),0)","v":151500}]
[null,"11. Total income (8-10)",null,null,"(Roundup Figures of Rs 10)",null,null,null,null,null,{"$f":"ROUND((K94-K125),-1)","v":725120}]
[null,"12. Tax on total income",null,null,null,null,null,null,null,null,{"$f":"ROUND(IF(K126<=250000,0,IF(K126<=500000,(K126-250000)*0.05,IF(K126<=1000000,12500+(K126-500000)*0.2,IF(K126>1000000,112500+(K126-1000000)*0.3,\"0\")))),0)","v":57524}]
[null,"13. Rebate U/s 87 A (Taxable Income below Rs. 5,00,000/-)",null,null,null,null,null,null,{"$f":"COMPUTATION!O59","v":0}]
[null,"14. Tax payable (12-13)",null,null,null,null,null,null,null,null,{"$f":"K127-I128","v":57524}]
[null,"15. Education & Health cess @ 4% (on tax computed at S.No. 12)",null,null,null,null,null,null,null,null,{"$f":"ROUND((K129*0.04),0)","v":2301}]
[null,"16. Tax payable (14+15) [Round off U/s 288 B]",null,null,null,null,null,null,null,null,{"$f":"K129+K130","v":59825}]
[null,"17. Less:- Relief under section 89 (Attach Form 10E)",null,null,null,null,null,null,null,null,{"$f":"COMPUTATION!O63","v":0}]
[null,"18. Tax payable (14-15)",null,null,null,null,null,null,null,null,{"$f":"K131-K132","v":59825}]
[null,"19. Tax deducted at source u/s 192 (1)",null,null,null,null,null,null,null,null,{"$f":"COMPUTATION!O66","v":15000}]
[null,{"$f":"IF(K133>K134,\"Income Tax Payable\",IF(K133<K134,\"Income Tax Refundable\",\"Income Tax Payble/Refundable\"))","v":"Income Tax Payable"},null,null,null,null,null,null,null,null,{"$f":"IF(K133>K134,K133-K134,K134-K133)","v":44825}]
[null,"Verification"]
[null,"I",{"$f":"B6&\",\"","v":"USHA PALIYA,"},null,null,"Son/Daughter of ",{"$f":"IF(G60=\"\",\"\",G60)","v":""},null,null,null,"working in the "]
[null,"capacity of ",null,{"$f":"D61","v":"PRINCIPAL"},null,null,"(designation) do hereby certify that a sum of "]
[null,"Rs.",{"$f":"K134","v":15000},{"$f":"IF(OR(LEN(FLOOR(C62,1))=13,FLOOR(C62,1)<=0),\"Out of range\",PROPER(SUBSTITUTE(CONCATENATE(CHOOSE(MID(TEXT(INT(C62),REPT(0,12)),1,1)+1,\"\",\"one hundred \",\"two hundred \",\"three hundred \",\"four hundred \",\"five hundred \",\"six hundred \",\"seven hundred \",\"eight hundred \",\"nine hundred \"),CHOOSE(MID(TEXT(INT(C62),REPT(0,12)),2,1)+1,\"\",CHOOSE(MID(TEXT(INT(C62),REPT(0,12)),3,1)+1,\"ten\",\"eleven\",\"twelve\",\"thirteen\",\"fourteen\",\"fifteen\",\"sixteen\",\"seventeen\",\"eighteen\",\"nineteen\"),\"twenty\",\"thirty\",\"forty\",\"fifty\",\"sixty\",\"seventy\",\"eighty\",\"ninety\"),IF(VALUE(MID(TEXT(INT(C62),REPT(0,12)),2,1))>1,CHOOSE(MID(TEXT(INT(C62),REPT(0,12)),3,1)+1,\"\",\"-one\",\"-two\",\"-three\",\"-four\",\"-five\",\"-six\",\"-seven\",\"-eight\",\"-nine\"),IF(VALUE(MID(TEXT(INT(C62),REPT(0,12)),2,1))=0,CHOOSE(MID(TEXT(INT(C62),REPT(0,12)),3,1)+1,\"\",\"one\",\"two\",\"three\",\"four\",\"five\",\"six\",\"seven\",\"eight\",\"nine\"),\"\")),IF(C62>=10^9,\" billion \",\"\"),CHOOSE(MID(TEXT(INT(C62),REPT(0,12)),4,1)+1,\"\",\"one hundred \",\"two hundred \",\"three hundred \",\"four hundred \",\"five hundred \",\"six hundred \",\"seven hundred \",\"eight hundred \",\"nine hundred \"),CHOOSE(MID(TEXT(INT(C62),REPT(0,12)),5,1)+1,\"\",CHOOSE(MID(TEXT(INT(C62),REPT(0,12)),6,1)+1,\"ten\",\"eleven\",\"twelve\",\"thirteen\",\"fourteen\",\"fifteen\",\"sixteen\",\"seventeen\",\"eighteen\",\"nineteen\"),\"twenty\",\"thirty\",\"forty\",\"fifty\",\"sixty\",\"seventy\",\"eighty\",\"ninety\"),IF(VALUE(MID(TEXT(INT(C62),REPT(0,12)),5,1))>1,CHOOSE(MID(TEXT(INT(C62),REPT(0,12)),6,1)+1,\"\",\"-one\",\"-two\",\"-three\",\"-four\",\"-five\",\"-six\",\"-seven\",\"-eight\",\"-nine\"),IF(VALUE(MID(TEXT(INT(C62),REPT(0,12)),5,1))=0,CHOOSE(MID(TEXT(INT(C62),REPT(0,12)),6,1)+1,\"\",\"one\",\"two\",\"three\",\"four\",\"five\",\"six\",\"seven\",\"eight\",\"nine\"),\"\")),IF(VALUE(MID(TEXT(INT(C62),REPT(0,12)),4,3))>0,\" million \",\"\"),CHOOSE(MID(TEXT(INT(C62),REPT(0,12)),7,1)+1,\"\",\"one hundred \",\"two hundred \",\"three hundred \",\"four hundred \",\"five hundred \",\"six hundred \",\"seven hundred \",\"eight hundred \",\"nine hundred \"),CHOOSE(MID(TEXT(INT(C62),REPT(0,12)),8,1)+1,\"\",CHOOSE(MID(TEXT(INT(C62),REPT(0,12)),9,1)+1,\"ten\",\"eleven\",\"twelve\",\"thirteen\",\"fourteen\",\"fifteen\",\"sixteen\",\"seventeen\",\"eighteen\",\"nineteen\"),\"twenty\",\"thirty\",\"forty\",\"fifty\",\"sixty\",\"seventy\",\"eighty\",\"ninety\"),IF(VALUE(MID(TEXT(INT(C62),REPT(0,12)),8,1))>1,CHOOSE(MID(TEXT(INT(C62),REPT(0,12)),9,1)+1,\"\",\"-one\",\"-two\",\"-three\",\"-four\",\"-five\",\"-six\",\"-seven\",\"-eight\",\"-nine\"),IF(VALUE(MID(TEXT(INT(C62),REPT(0,12)),8,1))=0,CHOOSE(MID(TEXT(INT(C62),REPT(0,12)),9,1)+1,\"\",\"one\",\"two\",\"three\",\"four\",\"five\",\"six\",\"seven\",\"eight\",\"nine\"),\"\")),IF(VALUE(MID(TEXT(INT(C62),REPT(0,12)),7,3)),\" thousand \",\"\"),CHOOSE(MID(TEXT(INT(C62),REPT(0,12)),10,1)+1,\"\",\"one hundred \",\"two hundred \",\"three hundred \",\"four hundred \",\"five hundred \",\"six hundred \",\"seven hundred \",\"eight hundred \",\"nine hundred \"),CHOOSE(MID(TEXT(INT(C62),REPT(0,12)),11,1)+1,\"\",CHOOSE(MID(TEXT(INT(C62),REPT(0,12)),12,1)+1,\"ten\",\"eleven\",\"twelve\",\"thirteen\",\"fourteen\",\"fifteen\",\"sixteen\",\"seventeen\",\"eighteen\",\"nineteen\"),\"twenty\",\"thirty\",\"forty\",\"fifty\",\"sixty\",\"seventy\",\"eighty\",\"ninety\"),IF(VALUE(MID(TEXT(INT(C62),REPT(0,12)),11,1))>1,CHOOSE(MID(TEXT(INT(C62),REPT(0,12)),12,1)+1,\"\",\"-one\",\"-two\",\"-three\",\"-four\",\"-five\",\"-six\",\"-seven\",\"-eight\",\"-nine\"),IF(VALUE(MID(TEXT(INT(C62),REPT(0,12)),11,1))=0,CHOOSE(MID(TEXT(INT(C62),REPT(0,12)),12,1)+1,\"\",\"one\",\"two\",\"three\",\"four\",\"five\",\"six\",\"seven\",\"eight\",\"nine\"),\"\"))),\"  \",\" \")&IF(FLOOR(C62,1)>1,\" Rupees\",\" Rupees\"))&IF(ISERROR(FIND(\".\",C62,1)),\"\",\" and \"&PROPER(IF(LEN(LEFT(TRIM(MID(SUBSTITUTE('[3]16 NO.'!$B$62,\".\",REPT(\" \",255)),255,200)),2))=1,CHOOSE(1*LEFT(TRIM(MID(SUBSTITUTE('[3]16 NO.'!$B$62,\".\",REPT(\" \",255)),255,200)),2),\"ten\",\"twenty\",\"thirty\",\"forty\",\"fifty\",\"sixty\",\"seventy\",\"eighty\",\"ninety\")&\" Paise\",\"\")&CONCATENATE(CHOOSE(MID(TEXT(INT(LEFT(TRIM(MID(SUBSTITUTE('[3]16 NO.'!$B$62,\".\",REPT(\" \",255)),255,200)),2)),REPT(0,12)),11,1)+1,\"\",CHOOSE(MID(TEXT(INT(LEFT(TRIM(MID(SUBSTITUTE('[3]16 NO.'!$B$62,\".\",REPT(\" \",255)),255,200)),2)),REPT(0,12)),12,1)+1,\"ten\",\"eleven\",\"twelve\",\"thirteen\",\"fourteen\",\"fifteen\",\"sixteen\",\"seventeen\",\"eighteen\",\"nineteen\"),\"twenty\",\"thirty\",\"forty\",\"fifty\",\"sixty\",\"seventy\",\"eighty\",\"ninety\"),IF(VALUE(MID(TEXT(INT(LEFT(TRIM(MID(SUBSTITUTE('[3]16 NO.'!$B$62,\".\",REPT(\" \",255)),255,200)),2)),REPT(0,12)),11,1))>1,CHOOSE(MID(TEXT(INT(LEFT(TRIM(MID(SUBSTITUTE('[3]16 NO.'!$B$62,\".\",REPT(\" \",255)),255,200)),2)),REPT(0,12)),12,1)+1,\"\",\"-one\",\"-two\",\"-three\",\"-four\",\"-five\",\"-six\",\"-seven\",\"-eight\",\"-nine\")&\" Paise\",IF(LEFT(TRIM(MID(SUBSTITUTE('[3]16 NO.'!$B$62,\".\",REPT(\" \",255)),255,200)),2)=\"01\",\"one Paise\",IF(LEFT(TRIM(MID(SUBSTITUTE('[3]16 NO.'!$B$62,\".\",REPT(\" \",255)),255,200)),1)=\"0\",CHOOSE(MID(TEXT(INT(LEFT(TRIM(MID(SUBSTITUTE('[3]16 NO.'!$B$62,\".\",REPT(\" \",255)),255,200)),2)),REPT(0,12)),12,1)+1,\"\",\"one\",\"two\",\"three\",\"four\",\"five\",\"six\",\"seven\",\"eight\",\"nine\")&\" Paise\",\"\")))))))","v":"Fifteen Thousand  Rupees"},null,null,null,null,"(in words) has beeen deducted and "]
[null,"deposited to the  credit of the Central Government. I further certify that the information given above is true, complete and correct and is based on the books of account, documents, TDS statement, TDS deposited and other available records."]
[null,"Place",null,{"$f":"D65","v":"M.G.G.S. BAR"}]
[null,"Date",null,{"$f":"TODAY()","v":"2021-12-25"},null,"Signature of person responsible for deduction of tax"]
[null,"Designation",null,{"$f":"D138","v":"PRINCIPAL"},null,"Full name :",{"$f":"B6","v":"USHA PALIYA"}]