{"text_format":"1","workbook":"xlsx","n_sheets":7,"sheets":["Instructions","Master Data","GA55 Check & Edit","Extra Ded ","GA 55 ","COMPUTATION","Form No. 16"],"not_rendered":{"charts":0,"images":24,"macros":1,"external_links":3,"defined_names":13,"comments":3,"pivot_tables":0},"unopened":[],"bounds":{"document_bytes":16777216,"sheet_cells":100000,"rows_first":2000,"rows_last":500,"rows_between":2000,"halvings":0,"cell_chars":16384,"cell_head_chars":4096},"cells_cut":0,"cells_raw":0,"read":"whole","date_system":"1900"}

{"sheet":"Instructions","index":0,"n_rows":28,"n_cols":4,"rows_kept":28,"cut":false,"hidden":false,"merged":[[17,3,18,3],[19,2,19,3],[2,1,2,2],[3,1,5,1],[8,1,8,2],[7,1,7,2],[9,1,9,2],[20,2,21,2],[17,1,17,2],[18,1,18,2],[11,1,11,2],[12,1,12,2],[14,1,14,2],[15,1,15,2],[16,1,16,2]]}
[null,null,"Instructions"]
[]
[null,";g ,Dly izksxzke esjs ije~ iwT; xq:nso Jh Jh 1008 oklqnso th egkjkt o esjs bZ\"V izHkq t;  ctjaxcyh o ikcwth egkjkt dks lefiZr gSaA esjs ekrk & firk o xq:tuksa ds vk'khokZn ls ;g izksxzke f'k{kd cU/kqvksa ds lkFk lHkh foHkkx ds dkfeZdksa dh lsok esa lknj izLrqr gSaA"]
[null,null,"How to use this Programme"]
[null,null,"If you have Hindi font problem, then first you should install Hindi font KRUTI DEV 010  in your computer."]
[null,null,"lcls igys vki jktLFkku lHkh 'kSf{kd osclkbZV ij ,Dly xq: ghjkyky tkV }kjk fufeZr vk;dj x.kuk ,Dly ,Iyhds'ku 2021&22 ds viMsV otZu+ dks MkmuyksM djsasaA blds vykok vki Google ij Heeralal Jat fy[kdj lpZ djsaxs rks Hkh vkidks ist fey tk;sxkA tgka ls vki ;g izksxzke MkmuyksM dj ldrs gSaA mlds ckn ftrusa dkfeZdksa dh vk;dj x.kuk djuh gS] mruh gh ,Dly izksxzke 'khV dks muds uke ls vyx vyx Qkby esa  Save  dj ysosaA izR;sad dkfeZd ds fy, ds fy, ,d QkbZy dks mi;ksx esa ysosaA "]
{"$rows_left_out":23}
{"sheet":"Master Data","index":1,"n_rows":50,"n_cols":30,"rows_kept":50,"cut":false,"hidden":false,"merged":[[49,5,49,7],[7,1,7,2],[21,1,21,3],[21,5,21,7],[23,1,23,3],[23,5,23,7],[13,1,13,2],[13,3,13,4],[13,5,13,6],[13,7,13,8],[15,1,15,2],[15,3,15,4],[33,1,33,3],[44,4,44,7],[17,1,17,2],[17,3,17,4],[48,2,48,10],[11,10,11,13],[17,10,17,13],[21,10,23,13],[35,10,36,12],[11,3,11,4],[11,5,11,6],[11,7,11,8],[43,11,44,14],[17,5,17,6],[17,7,17,8],[27,10,29,13],[31,10,31,12],[37,10,37,12],[39,10,39,12],[35,13,36,13],[1,4,1,7],[1,1,1,3],[7,3,7,4],[7,5,7,6],[7,7,7,8],[9,1,9,2],[9,3,9,4],[9,5,9,6],[9,7,9,8],[25,10,25,12],[11,1,11,2],[25,2,25,7],[41,0,42,0],[15,5,15,6],[15,7,15,8],[33,10,33,12],[29,5,29,7],[31,1,31,3],[31,5,31,7],[39,2,39,4],[27,5,27,7],[29,1,29,3],[37,1,37,7],[35,5,35,7],[35,1,35,3],[27,1,27,3],[33,5,33,7],[19,4,19,7],[3,10,3,13],[5,1,5,2],[5,3,5,4],[5,5,5,6],[5,7,5,8],[3,1,3,2],[3,3,3,8]]}
[null,null,null,null,null,null,null,null,null,null,null,null,null,null,null,null,null,null,null,null,null,null,null,null,null,null,null,null,1,"2020-04-01"]
[null,"https://youtu.be/MGhyFQKgC3Q",null,null,"EMPLOYEE  PERSONAL  DETAIL",null,null,null,null,null,null,null,null,null,null,null,null,null,null,"JUN",20,null,null,null,null,null,"2019-08-01",null,2,"2020-05-01"]
[null,null,null,null,null,null,null,null,null,null,null,null,null,null,null,null,null,null,null,null,null,null,null,null,null,null,null,null,3,"2020-06-01"]
[null,"Office Name :-",null,"Mahatma Gandhi Govt. School (English Medium) Bar, PALI",null,null,null,null,null,null,null,null,null,null,null,null,null,null,null,"JUL",null,null,null,1000,null,null,"2019-09-01",null,4,"2020-07-01"]
[null,null,null,null,null,null,null,null,null,null,null,null,null,null,null,null,null,null,null,null,null,null,null,null,null,null,null,null,5,"2020-08-01"]
[null,"Employee Name :-",null,"Heeralal jat",null,"Designation :-",null,"Sr Teacher",null,null,null,null,null,null,null,null,null,null,null,"AUG",null,null,null,620,null,null,"2019-10-01",null,6,"2020-09-01"]
{"$rows_left_out":45}
{"sheet":"GA55 Check & Edit","index":2,"n_rows":41,"n_cols":76,"rows_kept":41,"cut":false,"hidden":true,"merged":[[5,15,6,15],[2,3,2,4],[2,5,2,8],[5,28,6,28],[5,30,6,30],[5,20,6,20],[5,21,6,21],[5,22,6,22],[5,25,6,25],[5,16,6,16],[5,17,6,17],[5,18,6,18],[5,26,6,26],[5,27,6,27],[5,23,6,23],[2,18,2,25],[0,19,1,24],[5,2,6,2],[5,29,6,29],[5,3,6,3],[5,4,6,4],[5,5,6,5],[5,6,6,6],[5,7,6,7],[5,19,6,19],[5,8,6,8],[5,9,6,9],[5,10,6,10],[5,11,6,11],[5,12,6,12],[5,13,6,13],[5,14,6,14]]}
[null,null,null,null,null,null,null,null,null,null,null,null,null,null,null,null,null,null,null,"GA 55 Check & Edit sheet पर कार्य करने में मदद हेतु नीचे Youtube Video का लिंक दिया गया है।  H",null,null,null,null,null,null,null,null,null,null,null,null,null,null,null,null,null,null,null,null,null,null,null,null,null,null,null,null,"Gazetted",null,null,{"$f":"IF('Master Data'!I34>9,ROUND(AZ3/31*15,0),IF('Master Data'!D18='GA55 Check & Edit'!AW1,ROUND(AZ3/31*15,0),IF('Master Data'!I34>=5,ROUND(AZ3/31*22,0),AZ3)))","v":23855}]
[]
[null,null,null,"Employee Name :-",null,{"$f":"IF('Master Data'!D6=\"\",\"\",CONCATENATE('Master Data'!D6,\" ,  \",'Master Data'!H6))","v":"Heeralal jat ,  Sr Teacher"},null,null,null,null,null,null,null,null,null,null,null,null,"https://www.youtube.com/watch?v=y7-DiFIbdG0",null,null,null,null,null,null,null,null,null,null,null,null,null,null,null,null,null,null,null,null,null,null,null,null,null,null,null,null,null,null,null,null,{"$f":"AZ15-ROUNDUP(ROUND((AZ15*3%)-(AZ15*3%)*2.9%,-2),0)","v":49300}]
[]
[null,null,1,2,3,4,5,6,7,8,9,10,11,12,13,14,15,16,17,18,19,20,21,22,23,24,25,26,27,28,29,null,null,null,null,null,null,null,{"$f":"'Master Data'!N26","v":"Yes"},"GPF","Yes","Regular Pay","Under 60",null,1000]
[null,null,"S.N.","Month","Basic with Grade Pay","DA","HRA",{"$f":"IF('Master Data'!B42=\"\",\"\",'Master Data'!B42)","v":"Wash All."},{"$f":"IF('Master Data'!C42=\"\",\"\",'Master Data'!C42)","v":"Handi. All."},{"$f":"IF('Master Data'!D42=\"\",\"\",'Master Data'!D42)","v":"CCA"},{"$f":"IF('Master Data'!E42=\"\",\"\",'Master Data'!E42)","v":"other-1"},{"$f":"IF('Master Data'!F42=\"\",\"\",'Master Data'!F42)","v":"other-2"},"Bonus","N.P.S. By Govt.","TOTAL",{"$f":"IF('Master Data'!G42=\"\",\"\",'Master Data'!G42)","v":"SI"},{"$f":"IF('Master Data'!H42=\"\",\"\",'Master Data'!H42)","v":"GPF / NPS"},{"$f":"IF('Master Data'!I42=\"\",\"\",'Master Data'!I42)","v":"L.I.C."},{"$f":"IF('Master Data'!J42=\"\",\"\",'Master Data'!J42)","v":"RPMF / RGHS"},{"$f":"IF('Master Data'!K42=\"\",\"\",'Master Data'!K42)","v":"SI Loan"},{"$f":"IF('Master Data'!L42=\"\",\"\",'Master Data'!L42)","v":"GPF Loan"},{"$f":"IF('Master Data'!M42=\"\",\"\",'Master Data'!M42)","v":"GPF 2004 (NPS)"},{"$f":"IF('Master Data'!N42=\"\",\"\",'Master Data'!O42)","v":"SI Int."},"HITKARI NIDHI","Other ","Income Tax","G.I. + S. Tax","Total Ded.","NET PAY","TV.NO.","Enc.  DATE",null,null,null,null,null,null,null,null,"NPS","No","Fix Pay","Above 60",null,620]
{"$rows_left_out":36}
{"sheet":"Extra Ded ","index":3,"n_rows":25,"n_cols":9,"rows_kept":25,"cut":false,"hidden":true,"merged":[[23,2,23,3],[17,2,17,3],[18,2,18,3],[19,2,19,3],[20,2,20,3],[21,2,21,3],[16,2,16,3],[22,6,22,7],[16,6,16,7],[17,6,17,7],[18,6,18,7],[22,2,22,3],[15,6,15,7],[6,6,6,7],[25,2,25,8],[5,9,23,9],[20,6,20,7],[21,6,21,7],[6,2,6,3],[7,2,7,3],[8,2,8,3],[9,2,9,3],[10,2,10,3],[11,2,11,3],[12,2,12,3],[13,2,13,3],[14,2,14,3],[15,2,15,3],[5,2,5,3],[23,6,23,7],[0,0,0,2],[1,1,1,2],[2,2,2,8],[5,5,23,5],[19,6,19,7],[5,6,5,7],[7,6,7,7],[8,6,8,7],[9,6,9,7],[10,6,10,7],[11,6,11,7],[12,6,12,7],[13,6,13,7],[14,6,14,7]]}
["https://www.youtube.com/watch?v=NWwIhkhEUoc"]
[null,"अधिक जानकारी के लिए ऊपर Youtube video का लिंक दिया गया है। "]
[null,null,"osru dVkSrh ds vfrfjDr dVkSfr;k ftlds rgr vki vk;dj esa NwV pkgrs gSa] rFkk vfrfjDr ¼vU;½ vk; dks ;gkW ij bUnzkt djsA"]
[]
[]
[null,null,"1- edku fdjk;k HkRrk ¼;fn jlhn ds ek/;e ls NwV ysuh gS rks jkf'k fy[ksas½",null,null,null,"20- bfDoVh fyad lsfoax Ldhe"]
{"$rows_left_out":20}
{"sheet":"GA 55 ","index":4,"n_rows":31,"n_cols":29,"rows_kept":31,"cut":false,"hidden":true,"merged":[[1,1,1,25],[3,22,3,25],[3,26,3,28],[4,0,4,12],[4,13,4,25],[4,26,5,26],[4,27,5,27],[4,28,5,28],[3,0,3,1],[3,2,3,4],[3,6,3,8],[3,10,3,13],[2,12,2,15],[2,16,2,19],[2,20,2,26],[2,27,2,28],[2,8,2,11],[2,0,2,2],[2,3,2,7],[30,2,30,7],[30,18,30,26],[3,14,3,16],[3,17,3,21],[29,2,29,7],[29,18,29,26]]}
[]
[null,{"$f":"IF(AND('Master Data'!D4=\"\"),\"\",CONCATENATE(\"Office Name :- \",PROPER('Master Data'!D4)))","v":"Office Name :- Mahatma Gandhi Govt. School (English Medium) Bar, Pali"}]
["Employee Name :-",null,null,{"$f":"UPPER(IF('Master Data'!D6=\"\",\"\",'Master Data'!D6))","v":"HEERALAL JAT"},null,null,null,null,"Designation :-",null,null,null,{"$f":"UPPER(IF('Master Data'!H6=\"\",\"\",'Master Data'!H6))","v":"SR TEACHER"},null,null,null,"Posting Place :-",null,null,null,{"$f":"UPPER(IF('Master Data'!D8=\"\",\"\",'Master Data'!D8))","v":"M.G.G.S. BAR"},null,null,null,null,null,null,"osru Mªk ekufp="]
["PAN No. :-",null,{"$f":"UPPER(IF('Master Data'!D12=\"\",\"\",'Master Data'!D12))","v":"ABCDE1234H"},null,null,"SI No.",{"$f":"IF(AND('Master Data'!H14=\"\"),\"\",'Master Data'!H14)","v":123456},null,null,"GPF",{"$f":"IF(AND('Master Data'!D14=\"\"),\"\",'Master Data'!D14)","v":11},null,null,null,"PRAN No. :-",null,null,{"$f":"IF(AND('Master Data'!D16=\"\"),\"\",'Master Data'!D16)","v":12134545454541},null,null,null,null,"Bank A/C.",null,null,null,{"$f":"IF(AND('Master Data'!H16=\"\"),\"\",'Master Data'!H16)","v":121212121212121}]
["osru tks fn;k x;k",null,null,null,null,null,null,null,null,null,null,null,null,"dVkSfr;kWa tks dh xbZ",null,null,null,null,null,null,null,null,null,null,null,null,{"$f":"'GA55 Check & Edit'!AC6","v":"NET PAY"},{"$f":"'GA55 Check & Edit'!AD6","v":"TV.NO."},{"$f":"'GA55 Check & Edit'!AE6","v":"Enc.  DATE"}]
[{"$f":"IF(AND('GA55 Check & Edit'!C6=\"\"),\"\",'GA55 Check & Edit'!C6)","v":"S.N."},{"$f":"IF(AND('GA55 Check & Edit'!D6=\"\"),\"\",'GA55 Check & Edit'!D6)","v":"Month"},{"$f":"IF(AND('GA55 Check & Edit'!E6=\"\"),\"\",'GA55 Check & Edit'!E6)","v":"Basic with Grade Pay"},{"$f":"IF(AND('GA55 Check & Edit'!F6=\"\"),\"\",'GA55 Check & Edit'!F6)","v":"DA"},{"$f":"IF(AND('GA55 Check & Edit'!G6=\"\"),\"\",'GA55 Check & Edit'!G6)","v":"HRA"},{"$f":"IF(AND('GA55 Check & Edit'!H6=\"\"),\"\",'GA55 Check & Edit'!H6)","v":"Wash All."},{"$f":"IF(AND('GA55 Check & Edit'!I6=\"\"),\"\",'GA55 Check & Edit'!I6)","v":"Handi. All."},{"$f":"IF(AND('GA55 Check & Edit'!J6=\"\"),\"\",'GA55 Check & Edit'!J6)","v":"CCA"},{"$f":"IF(AND('GA55 Check & Edit'!K6=\"\"),\"\",'GA55 Check & Edit'!K6)","v":"other-1"},{"$f":"IF(AND('GA55 Check & Edit'!L6=\"\"),\"\",'GA55 Check & Edit'!L6)","v":"other-2"},{"$f":"IF(AND('GA55 Check & Edit'!M6=\"\"),\"\",'GA55 Check & Edit'!M6)","v":"Bonus"},{"$f":"IF(AND('GA55 Check & Edit'!N6=\"\"),\"\",'GA55 Check & Edit'!N6)","v":"N.P.S. By Govt."},{"$f":"IF(AND('GA55 Check & Edit'!O6=\"\"),\"\",'GA55 Check & Edit'!O6)","v":"TOTAL"},{"$f":"IF(AND('GA55 Check & Edit'!P6=\"\"),\"\",'GA55 Check & Edit'!P6)","v":"SI"},{"$f":"IF(AND('GA55 Check & Edit'!Q6=\"\"),\"\",'GA55 Check & Edit'!Q6)","v":"GPF / NPS"},{"$f":"IF(AND('GA55 Check & Edit'!R6=\"\"),\"\",'GA55 Check & Edit'!R6)","v":"L.I.C."},{"$f":"IF(AND('GA55 Check & Edit'!S6=\"\"),\"\",'GA55 Check & Edit'!S6)","v":"RPMF / RGHS"},{"$f":"IF(AND('GA55 Check & Edit'!T6=\"\"),\"\",'GA55 Check & Edit'!T6)","v":"SI Loan"},{"$f":"IF(AND('GA55 Check & Edit'!U6=\"\"),\"\",'GA55 Check & Edit'!U6)","v":"GPF Loan"},{"$f":"IF(AND('GA55 Check & Edit'!V6=\"\"),\"\",'GA55 Check & Edit'!V6)","v":"GPF 2004 (NPS)"},{"$f":"IF(AND('GA55 Check & Edit'!W6=\"\"),\"\",'GA55 Check & Edit'!W6)","v":"SI Int."},{"$f":"IF(AND('GA55 Check & Edit'!X6=\"\"),\"\",'GA55 Check & Edit'!X6)","v":"HITKARI NIDHI"},{"$f":"IF(AND('GA55 Check & Edit'!Y6=\"\"),\"\",'GA55 Check & Edit'!Y6)","v":"Other "},{"$f":"IF(AND('GA55 Check & Edit'!Z6=\"\"),\"\",'GA55 Check & Edit'!Z6)","v":"Income Tax"},{"$f":"IF(AND('GA55 Check & Edit'!AA6=\"\"),\"\",'GA55 Check & Edit'!AA6)","v":"G.I. + S. Tax"},{"$f":"IF(AND('GA55 Check & Edit'!AB6=\"\"),\"\",'GA55 Check & Edit'!AB6)","v":"Total Ded."}]
{"$rows_left_out":26}
{"sheet":"COMPUTATION","index":5,"n_rows":69,"n_cols":34,"rows_kept":69,"cut":false,"hidden":true,"merged":[[48,17,48,20],[49,17,49,20],[21,16,23,20],[22,33,23,36],[25,16,30,18],[0,0,0,14],[2,1,2,2],[2,3,2,7],[2,9,2,11],[2,13,2,14],[1,2,1,4],[1,5,1,6],[1,7,1,8],[1,11,1,14],[1,9,1,10],[9,1,9,9],[9,10,9,12],[10,1,10,12],[11,0,13,0],[11,1,11,7],[11,8,11,9],[11,10,11,12],[3,17,7,21],[5,1,5,12],[6,1,6,12],[7,0,9,0],[7,1,7,9],[7,10,7,12],[7,13,8,14],[8,1,8,9],[8,10,8,12],[4,1,4,12],[3,0,4,0],[3,1,3,8],[3,9,3,12],[33,1,33,12],[34,1,34,12],[28,8,28,10],[23,8,23,10],[14,1,14,12],[15,1,15,3],[15,9,15,12],[16,1,16,3],[11,13,13,14],[12,1,13,2],[12,3,12,4],[12,5,12,7],[12,8,12,9],[12,10,12,12],[13,3,13,4],[13,5,13,7],[13,8,13,9],[13,10,13,12],[15,4,15,5],[16,4,16,5],[15,6,15,7],[16,6,16,7],[16,9,16,12],[17,1,17,12],[22,2,22,4],[29,2,29,4],[29,8,29,10],[30,2,30,4],[31,1,31,12],[26,2,26,4],[26,8,26,10],[27,2,27,4],[27,8,27,10],[28,2,28,4],[22,8,22,10],[68,11,68,13],[60,2,60,12],[61,1,61,12],[62,1,62,12],[63,1,63,12],[66,0,66,12],[48,0,61,0],[48,1,48,14],[49,1,49,4],[49,5,49,8],[49,9,49,12],[50,1,50,3],[54,1,54,3],[54,5,54,7],[54,9,54,11],[55,1,55,3],[55,5,55,7],[55,9,55,11],[56,1,56,3],[51,1,51,3],[51,5,51,7],[51,9,51,11],[50,9,50,11],[50,5,50,7],[58,16,59,18],[54,17,56,21],[56,5,56,7],[56,9,56,11],[58,1,58,12],[59,1,59,12],[53,1,53,3],[18,17,18,18],[31,18,33,18],[40,17,42,21],[43,17,44,18],[45,1,45,12],[46,1,46,12],[52,1,52,3],[52,5,52,7],[52,9,52,11],[39,1,39,12],[40,1,40,12],[23,2,23,4],[24,2,24,4],[24,8,24,10],[25,2,25,4],[25,8,25,10],[44,1,44,12],[64,0,65,0],[64,1,65,3],[64,4,64,6],[64,7,64,8],[64,10,64,11],[64,12,64,13],[65,4,65,6],[65,7,65,8],[65,10,65,11],[65,12,65,13],[35,0,44,0],[53,5,53,7],[53,9,53,11],[57,1,57,12],[30,7,30,10],[48,23,48,25],[48,27,48,29],[41,1,41,12],[42,1,42,12],[43,1,43,12],[47,1,47,12],[35,1,35,14],[32,1,32,12],[36,1,36,12],[37,1,37,12],[38,1,38,12],[18,0,34,0],[18,1,18,14],[19,1,19,14],[20,2,20,4],[20,8,20,10],[20,13,30,14],[21,2,21,4],[21,8,21,10]]}
[{"$f":"IF(AND('Master Data'!D4=\"\"),\"\",CONCATENATE(\"Office Name :- \",PROPER('Master Data'!D4)))","v":"Office Name :- Mahatma Gandhi Govt. School (English Medium) Bar, Pali"},null,null,null,null,null,null,null,null,null,null,null,null,null,null,null,null,null,null,2]
[null,null,"vk;dj x.kuk izi= o\"kZ &",null,null,"2021-2022",null,"¼dj fu/kkZj.k o\"kZ &",null,"2022-2023)",null,{"$f":"IF(T14=T2,\"Old Tax Regime\",\"New Tax Regime\")","v":"Old Tax Regime"},null,null,null,null,null,null,null,1]
[1,"uke deZpkjh %",null,{"$f":"UPPER('Master Data'!D6)","v":"HEERALAL JAT"},null,null,null,null," in %",{"$f":"UPPER('Master Data'!H6)","v":"SR TEACHER"},null,null,"PAN :",{"$f":"UPPER('Master Data'!D12)","v":"ABCDE1234H"}]
[2,"vk; % o\"kZ&2021&22 esa izkIr dqy osru ¼ dj ;ksX; lqfo/kkvksa ds eqY; lfgr ½",null,null,null,null,null,null,null,{"$f":"IF('Master Data'!H18=\"Yes\",\"सरकार द्वारा देय NPS की राशि सहित कुल वेतन -\",\"\")","v":""},null,null,null,"#-",{"$f":"'GA 55 '!M28","v":846534},null,null,"आप विद्यमान आयकर दर या नवीन आयकर दर दोनों में से किसी एक विकल्प को चुनकर आयकर गणना प्रपत्र तैयार कर सकते है।  "]
[null,{"$f":"IF('Master Data'!H18=\"Yes\",\"\",\"सरकार द्वारा देय NPS की राशि -\")","v":"सरकार द्वारा देय NPS की राशि -"},null,null,null,null,null,null,null,null,null,null,null,"#-",{"$f":"IF('Master Data'!H18=\"Yes\",0,IF('Master Data'!I30='GA55 Check & Edit'!AN6,'GA 55 '!O28,0))","v":78584}]
[3,"x`g fdjk;k] /kkjk 10¼13-A½ ds vUrxrZ ,oa /kkjk 10¼14½ds vUrxrZ vU; Hkrs tks dj eqDÙk gSA ",null,null,null,null,null,null,null,null,null,null,null,"#-",{"$f":"IF(T14=T2,SUM('Extra Ded '!I7+'Extra Ded '!E6+'GA 55 '!G28),\"0\")","v":0},null,"E"]
{"$rows_left_out":64}
{"sheet":"Form No. 16","index":6,"n_rows":143,"n_cols":11,"rows_kept":143,"cut":false,"hidden":true,"merged":[[0,1,0,11],[1,1,1,11],[2,1,2,11],[3,1,3,11],[4,1,4,5],[4,6,4,11],[79,8,82,9],[75,1,75,5],[8,1,8,3],[8,4,8,5],[8,6,8,8],[8,9,8,11],[9,1,9,5],[9,6,9,7],[9,8,9,11],[5,1,5,5],[5,6,5,11],[6,1,6,5],[6,6,6,11],[7,1,7,3],[7,4,7,5],[7,6,7,8],[7,9,7,11],[12,1,12,11],[13,2,13,4],[13,6,13,8],[13,9,13,11],[14,2,14,4],[14,6,14,8],[14,9,14,11],[10,2,10,5],[10,6,11,7],[10,8,10,9],[10,10,10,11],[11,2,11,3],[11,8,11,9],[11,10,11,11],[17,2,17,4],[17,6,17,8],[17,9,17,11],[18,1,18,4],[18,6,18,8],[18,9,18,11],[15,2,15,4],[15,6,15,8],[15,9,15,11],[16,2,16,4],[16,6,16,8],[16,9,16,11],[23,2,23,3],[23,6,23,8],[23,9,23,11],[24,2,24,3],[24,6,24,8],[24,9,24,11],[19,1,19,11],[20,1,20,11],[21,1,22,1],[21,2,22,3],[21,4,21,11],[22,6,22,8],[22,9,22,11],[27,2,27,3],[27,6,27,8],[27,9,27,11],[28,2,28,3],[28,6,28,8],[28,9,28,11],[25,2,25,3],[25,6,25,8],[25,9,25,11],[26,2,26,3],[26,6,26,8],[26,9,26,11],[31,2,31,3],[31,6,31,8],[31,9,31,11],[32,2,32,3],[32,6,32,8],[32,9,32,11],[29,2,29,3],[29,6,29,8],[29,9,29,11],[30,2,30,3],[30,6,30,8],[30,9,30,11],[35,2,35,3],[35,6,35,8],[35,9,35,11],[36,2,36,3],[36,6,36,8],[36,9,36,11],[33,2,33,3],[33,6,33,8],[33,9,33,11],[34,2,34,3],[34,6,34,8],[34,9,34,11],[41,10,41,11],[42,2,42,3],[42,4,42,5],[42,6,42,7],[42,8,42,9],[42,10,42,11],[37,2,37,3],[37,4,37,11],[38,1,38,11],[39,1,39,11],[40,1,41,1],[40,2,41,3],[40,4,40,11],[41,4,41,5],[41,6,41,7],[41,8,41,9],[43,2,43,3],[43,4,43,5],[43,6,43,7],[43,8,43,9],[43,10,43,11],[44,2,44,3],[44,4,44,5],[44,6,44,7],[44,8,44,9],[44,10,44,11],[45,2,45,3],[45,4,45,5],[45,6,45,7],[45,8,45,9],[45,10,45,11],[46,2,46,3],[46,4,46,5],[46,6,46,7],[46,8,46,9],[46,10,46,11],[47,2,47,3],[47,4,47,5],[47,6,47,7],[47,8,47,9],[47,10,47,11],[48,2,48,3],[48,4,48,5],[48,6,48,7],[48,8,48,9],[48,10,48,11],[49,2,49,3],[49,4,49,5],[49,6,49,7],[49,8,49,9],[49,10,49,11],[50,2,50,3],[50,4,50,5],[50,6,50,7],[50,8,50,9],[50,10,50,11],[51,2,51,3],[51,4,51,5],[51,6,51,7],[51,8,51,9],[51,10,51,11],[52,2,52,3],[52,4,52,5],[52,6,52,7],[52,8,52,9],[52,10,52,11],[53,2,53,3],[53,4,53,5],[53,6,53,7],[53,8,53,9],[53,10,53,11],[54,2,54,3],[54,4,54,5],[54,6,54,7],[54,8,54,9],[54,10,54,11],[57,1,57,11],[58,1,58,11],[59,2,59,4],[59,6,59,9],[59,10,59,11],[60,1,60,2],[60,3,60,5],[60,6,60,11],[55,2,55,3],[55,4,55,5],[55,6,55,7],[55,8,55,9],[55,10,55,11],[56,2,56,3],[56,4,56,11],[65,1,65,2],[65,3,65,4],[65,5,65,11],[66,1,66,2],[66,3,66,4],[66,6,66,11],[61,3,61,7],[61,8,61,11],[62,1,62,11],[63,1,63,11],[64,1,64,2],[64,3,64,4],[64,5,64,11],[67,1,67,11],[68,1,68,11],[69,1,69,5],[69,6,69,7],[69,8,72,9],[70,1,70,5],[70,6,70,7],[71,1,71,5],[71,6,71,7],[72,1,72,5],[72,6,72,7],[78,8,78,9],[79,1,79,5],[74,8,77,9],[76,1,76,3],[80,1,80,2],[80,3,80,5],[80,6,80,7],[81,1,81,2],[93,8,95,9],[90,1,90,4],[81,3,81,5],[81,6,81,7],[77,1,77,3],[77,6,77,7],[78,1,78,5],[78,6,79,7],[82,1,82,2],[82,3,82,5],[82,6,82,7],[94,1,94,5],[92,1,92,4],[92,6,92,7],[92,8,92,9],[85,1,85,5],[93,1,93,5],[96,6,96,7],[97,4,97,5],[97,6,97,7],[103,4,103,5],[103,6,103,7],[96,1,96,5],[117,6,117,7],[117,8,117,9],[98,4,98,5],[98,6,98,7],[99,4,99,5],[99,6,99,7],[105,4,105,5],[105,6,105,7],[101,4,101,5],[101,6,101,7],[102,4,102,5],[102,6,102,7],[100,4,100,5],[100,6,100,7],[104,4,104,5],[104,6,104,7],[109,10,109,11],[106,4,106,5],[106,6,106,7],[107,4,107,5],[107,6,107,7],[119,8,119,9],[114,6,114,7],[114,8,114,9],[115,2,115,5],[115,6,115,7],[115,8,115,9],[116,2,116,5],[108,6,108,7],[110,2,110,5],[110,6,110,7],[110,8,110,9],[110,10,110,11],[111,2,111,5],[111,6,111,7],[111,8,111,9],[111,10,111,11],[109,6,109,7],[109,8,109,9],[135,1,135,11],[127,1,127,5],[127,8,127,9],[127,10,127,11],[128,10,128,11],[124,10,124,11],[125,10,125,11],[126,10,126,11],[125,1,125,3],[126,1,126,9],[124,1,124,9],[125,4,125,9],[128,1,128,9],[129,1,129,9],[130,1,130,9],[131,1,131,9],[132,1,132,9],[131,10,131,11],[132,10,132,11],[134,10,134,11],[129,10,129,11],[130,10,130,11],[133,1,133,9],[133,10,133,11],[134,1,134,9],[69,10,83,11],[83,1,83,5],[84,1,84,5],[84,8,91,9],[84,10,84,11],[85,10,87,11],[86,1,86,2],[86,3,86,4],[87,1,87,2],[87,3,87,4],[88,1,88,2],[88,3,88,4],[88,6,88,7],[88,10,88,11],[89,1,89,5],[89,6,91,7],[91,1,91,4],[83,8,83,9],[73,1,73,5],[73,6,76,7],[73,8,73,9],[74,1,74,5],[96,8,96,9],[93,10,93,11],[94,10,95,11],[95,1,95,5],[112,8,112,10],[113,1,113,11],[114,1,114,5],[114,10,114,11],[115,10,122,11],[122,2,122,5],[118,2,118,5],[118,6,118,7],[118,8,118,9],[119,2,119,5],[119,6,119,7],[116,6,116,7],[116,8,116,9],[117,2,117,5],[96,10,96,11],[97,1,111,1],[97,3,109,3],[97,8,108,9],[97,10,108,11],[108,4,108,5],[109,4,109,5],[123,2,123,5],[122,6,122,7],[122,8,122,9],[123,6,123,7],[123,8,123,9],[123,10,123,11],[120,8,120,9],[121,2,121,5],[121,6,121,7],[121,8,121,9],[120,2,120,5],[120,6,120,7],[140,5,140,11],[141,1,141,2],[141,3,141,4],[141,5,141,11],[142,1,142,2],[142,3,142,4],[142,6,142,11],[136,2,136,4],[136,6,136,9],[136,10,136,11],[137,1,137,2],[137,3,137,5],[137,6,137,11],[138,3,138,7],[138,8,138,11],[139,1,139,11],[140,1,140,2],[140,3,140,4]]}
[null,"FORM NO. 16"]
[null,"[(See Rule 31(1)(a)]"]
[null,"PART-A"]
[null,"Certificate under section 203 of the income-tax act, 1961 for Tax deducted at source on Salary."]
[null,"Name and address of the Employer",null,null,null,null,"Name and adress of the Employee"]
[null,{"$f":"IF('Master Data'!H8=\"\",\"\",UPPER('Master Data'!H8))","v":"USHA PALIYA"},null,null,null,null,{"$f":"IF('Master Data'!D6=\"\",\"\",UPPER('Master Data'!D6))","v":"HEERALAL JAT"}]
{"$rows_left_out":137}