{"text_format":"1","workbook":"xlsx","n_sheets":3,"sheets":["pks_1","pks_2","pks_3"],"not_rendered":{"charts":0,"images":1,"macros":1,"external_links":0,"defined_names":5,"comments":0,"pivot_tables":0},"unopened":[],"bounds":{"document_bytes":16777216,"sheet_cells":100000,"rows_first":2000,"rows_last":500,"rows_between":2000,"halvings":0,"cell_chars":16384,"cell_head_chars":4096},"cells_cut":0,"cells_raw":0,"read":"whole","date_system":"1900"}

{"sheet":"pks_1","index":0,"n_rows":28,"n_cols":39,"rows_kept":28,"cut":false,"hidden":false,"merged":[[0,1,0,38],[2,4,2,31],[6,1,7,1],[6,2,7,2],[6,3,7,3],[6,35,7,35],[6,36,6,38]]}
[null,"Govt Sr Sc School Malutana (Thanagazi) Alwar"]
[]
[null,null,"2023-01-01",null,"कर्मचारी मासिक उपस्थिति पत्रक"]
[]
[null,null,{"$f":"\"माह/वर्ष :- \"&TEXT(E8,\"MMM/YYYY\")","v":"माह/वर्ष :- Jan/2023"},null,{"$f":"\" कुल दिवस :- \"&COUNT(E8:AI8)","v":" कुल दिवस :- 31"},null,null,null,null,null,null,null,null,null,{"$f":"\"अवकाश : भारत सरकार, राजस्थान सरकार, विभागीय, साप्ताहिक, स्थानीय एवं अन्य :- \"&COUNTIFS(E9:AI9,\"H\")","v":"अवकाश : भारत सरकार, राजस्थान सरकार, विभागीय, साप्ताहिक, स्थानीय एवं अन्य :- 5"},null,null,null,null,null,null,null,null,null,null,null,null,null,null,null,null,null,null,null,{"$f":"\"कुल कार्यदिवस :-\"&COUNT(E8:AI8)-COUNTIFS(E9:AI9,\"H\")","v":"कुल कार्यदिवस :-26"}]
[]
[null,"क्र.सं.","नाम कर्मचारी /अधिकारी ","एम्प्लोयी आईडी",{"$f":"TEXT(E8,\"DDD\")","v":"Sun"},{"$f":"TEXT(F8,\"DDD\")","v":"Mon"},"Tue","Wed","Thu","Fri","Sat","Sun","Mon","Tue","Wed","Thu","Fri","Sat","Sun","Mon","Tue","Wed","Thu","Fri","Sat","Sun","Mon","Tue","Wed","Thu","Fri","Sat","Sun","Mon","Tue","उपस्थित","अवकाश"]
[null,null,null,null,{"$f":"C3","v":"2023-01-01"},{"$f":"E8+1","v":"2023-01-02"},{"$f":"F8+1","v":"2023-01-03"},{"$f":"G8+1","v":"2023-01-04"},"2023-01-05","2023-01-06","2023-01-07","2023-01-08","2023-01-09","2023-01-10","2023-01-11","2023-01-12","2023-01-13","2023-01-14","2023-01-15","2023-01-16","2023-01-17","2023-01-18","2023-01-19","2023-01-20","2023-01-21","2023-01-22","2023-01-23","2023-01-24","2023-01-25","2023-01-26","2023-01-27","2023-01-28",{"$f":"IFERROR(IF(AF8+1>EOMONTH(E8,0),\"\",AF8+1),\"\")","v":"2023-01-29"},{"$f":"IFERROR(IF(AG8+1>EOMONTH(F8,0),\"\",AG8+1),\"\")","v":"2023-01-30"},{"$f":"IFERROR(IF(AH8+1>EOMONTH(G8,0),\"\",AH8+1),\"\")","v":"2023-01-31"},null,"C/L","M/L","P/L"]
[null,{"$f":"IF(C9=\"\",\"\",COUNTA($C$9:C9))","v":1},"Pramod Kumar Saini",1234,{"$f":"IF(E$8>TODAY(),\"\",IF($C9=\"\",\"\",IF(COUNTIF(Date,E$8)>0,\"H\",IF(E$7=\"Sun\",\"H\",IFERROR(VLOOKUP($D9&\"-\"&E$8&\"\",pks_3!$A$1:$E$21,5,0),\"P\")))))","v":"H"},{"$f":"IF(F$8>TODAY(),\"\",IF($C9=\"\",\"\",IF(COUNTIF(Date,F$8)>0,\"H\",IF(F$7=\"Sun\",\"H\",IFERROR(VLOOKUP($D9&\"-\"&F$8&\"\",pks_3!$A$1:$E$21,5,0),\"P\")))))","v":"P"},{"$f":"IF(G$8>TODAY(),\"\",IF($C9=\"\",\"\",IF(COUNTIF(Date,G$8)>0,\"H\",IF(G$7=\"Sun\",\"H\",IFERROR(VLOOKUP($D9&\"-\"&G$8&\"\",pks_3!$A$1:$E$21,5,0),\"P\")))))","v":"P"},{"$f":"IF(H$8>TODAY(),\"\",IF($C9=\"\",\"\",IF(COUNTIF(Date,H$8)>0,\"H\",IF(H$7=\"Sun\",\"H\",IFERROR(VLOOKUP($D9&\"-\"&H$8&\"\",pks_3!$A$1:$E$21,5,0),\"P\")))))","v":"P"},{"$f":"IF(I$8>TODAY(),\"\",IF($C9=\"\",\"\",IF(COUNTIF(Date,I$8)>0,\"H\",IF(I$7=\"Sun\",\"H\",IFERROR(VLOOKUP($D9&\"-\"&I$8&\"\",pks_3!$A$1:$E$21,5,0),\"P\")))))","v":"P"},{"$f":"IF(J$8>TODAY(),\"\",IF($C9=\"\",\"\",IF(COUNTIF(Date,J$8)>0,\"H\",IF(J$7=\"Sun\",\"H\",IFERROR(VLOOKUP($D9&\"-\"&J$8&\"\",pks_3!$A$1:$E$21,5,0),\"P\")))))","v":"P"},{"$f":"IF(K$8>TODAY(),\"\",IF($C9=\"\",\"\",IF(COUNTIF(Date,K$8)>0,\"H\",IF(K$7=\"Sun\",\"H\",IFERROR(VLOOKUP($D9&\"-\"&K$8&\"\",pks_3!$A$1:$E$21,5,0),\"P\")))))","v":"P"},{"$f":"IF(L$8>TODAY(),\"\",IF($C9=\"\",\"\",IF(COUNTIF(Date,L$8)>0,\"H\",IF(L$7=\"Sun\",\"H\",IFERROR(VLOOKUP($D9&\"-\"&L$8&\"\",pks_3!$A$1:$E$21,5,0),\"P\")))))","v":"H"},{"$f":"IF(M$8>TODAY(),\"\",IF($C9=\"\",\"\",IF(COUNTIF(Date,M$8)>0,\"H\",IF(M$7=\"Sun\",\"H\",IFERROR(VLOOKUP($D9&\"-\"&M$8&\"\",pks_3!$A$1:$E$21,5,0),\"P\")))))","v":"P"},{"$f":"IF(N$8>TODAY(),\"\",IF($C9=\"\",\"\",IF(COUNTIF(Date,N$8)>0,\"H\",IF(N$7=\"Sun\",\"H\",IFERROR(VLOOKUP($D9&\"-\"&N$8&\"\",pks_3!$A$1:$E$21,5,0),\"P\")))))","v":"P"},{"$f":"IF(O$8>TODAY(),\"\",IF($C9=\"\",\"\",IF(COUNTIF(Date,O$8)>0,\"H\",IF(O$7=\"Sun\",\"H\",IFERROR(VLOOKUP($D9&\"-\"&O$8&\"\",pks_3!$A$1:$E$21,5,0),\"P\")))))","v":"P"},{"$f":"IF(P$8>TODAY(),\"\",IF($C9=\"\",\"\",IF(COUNTIF(Date,P$8)>0,\"H\",IF(P$7=\"Sun\",\"H\",IFERROR(VLOOKUP($D9&\"-\"&P$8&\"\",pks_3!$A$1:$E$21,5,0),\"P\")))))","v":"P"},{"$f":"IF(Q$8>TODAY(),\"\",IF($C9=\"\",\"\",IF(COUNTIF(Date,Q$8)>0,\"H\",IF(Q$7=\"Sun\",\"H\",IFERROR(VLOOKUP($D9&\"-\"&Q$8&\"\",pks_3!$A$1:$E$21,5,0),\"P\")))))","v":"P"},{"$f":"IF(R$8>TODAY(),\"\",IF($C9=\"\",\"\",IF(COUNTIF(Date,R$8)>0,\"H\",IF(R$7=\"Sun\",\"H\",IFERROR(VLOOKUP($D9&\"-\"&R$8&\"\",pks_3!$A$1:$E$21,5,0),\"P\")))))","v":"P"},{"$f":"IF(S$8>TODAY(),\"\",IF($C9=\"\",\"\",IF(COUNTIF(Date,S$8)>0,\"H\",IF(S$7=\"Sun\",\"H\",IFERROR(VLOOKUP($D9&\"-\"&S$8&\"\",pks_3!$A$1:$E$21,5,0),\"P\")))))","v":"H"},{"$f":"IF(T$8>TODAY(),\"\",IF($C9=\"\",\"\",IF(COUNTIF(Date,T$8)>0,\"H\",IF(T$7=\"Sun\",\"H\",IFERROR(VLOOKUP($D9&\"-\"&T$8&\"\",pks_3!$A$1:$E$21,5,0),\"P\")))))","v":"P"},{"$f":"IF(U$8>TODAY(),\"\",IF($C9=\"\",\"\",IF(COUNTIF(Date,U$8)>0,\"H\",IF(U$7=\"Sun\",\"H\",IFERROR(VLOOKUP($D9&\"-\"&U$8&\"\",pks_3!$A$1:$E$21,5,0),\"P\")))))","v":"P"},{"$f":"IF(V$8>TODAY(),\"\",IF($C9=\"\",\"\",IF(COUNTIF(Date,V$8)>0,\"H\",IF(V$7=\"Sun\",\"H\",IFERROR(VLOOKUP($D9&\"-\"&V$8&\"\",pks_3!$A$1:$E$21,5,0),\"P\")))))","v":"P"},{"$f":"IF(W$8>TODAY(),\"\",IF($C9=\"\",\"\",IF(COUNTIF(Date,W$8)>0,\"H\",IF(W$7=\"Sun\",\"H\",IFERROR(VLOOKUP($D9&\"-\"&W$8&\"\",pks_3!$A$1:$E$21,5,0),\"P\")))))","v":"P"},{"$f":"IF(X$8>TODAY(),\"\",IF($C9=\"\",\"\",IF(COUNTIF(Date,X$8)>0,\"H\",IF(X$7=\"Sun\",\"H\",IFERROR(VLOOKUP($D9&\"-\"&X$8&\"\",pks_3!$A$1:$E$21,5,0),\"P\")))))","v":"P"},{"$f":"IF(Y$8>TODAY(),\"\",IF($C9=\"\",\"\",IF(COUNTIF(Date,Y$8)>0,\"H\",IF(Y$7=\"Sun\",\"H\",IFERROR(VLOOKUP($D9&\"-\"&Y$8&\"\",pks_3!$A$1:$E$21,5,0),\"P\")))))","v":"P"},{"$f":"IF(Z$8>TODAY(),\"\",IF($C9=\"\",\"\",IF(COUNTIF(Date,Z$8)>0,\"H\",IF(Z$7=\"Sun\",\"H\",IFERROR(VLOOKUP($D9&\"-\"&Z$8&\"\",pks_3!$A$1:$E$21,5,0),\"P\")))))","v":"H"},{"$f":"IF(AA$8>TODAY(),\"\",IF($C9=\"\",\"\",IF(COUNTIF(Date,AA$8)>0,\"H\",IF(AA$7=\"Sun\",\"H\",IFERROR(VLOOKUP($D9&\"-\"&AA$8&\"\",pks_3!$A$1:$E$21,5,0),\"P\")))))","v":"P"},{"$f":"IF(AB$8>TODAY(),\"\",IF($C9=\"\",\"\",IF(COUNTIF(Date,AB$8)>0,\"H\",IF(AB$7=\"Sun\",\"H\",IFERROR(VLOOKUP($D9&\"-\"&AB$8&\"\",pks_3!$A$1:$E$21,5,0),\"P\")))))","v":"P"},{"$f":"IF(AC$8>TODAY(),\"\",IF($C9=\"\",\"\",IF(COUNTIF(Date,AC$8)>0,\"H\",IF(AC$7=\"Sun\",\"H\",IFERROR(VLOOKUP($D9&\"-\"&AC$8&\"\",pks_3!$A$1:$E$21,5,0),\"P\")))))","v":"P"},{"$f":"IF(AD$8>TODAY(),\"\",IF($C9=\"\",\"\",IF(COUNTIF(Date,AD$8)>0,\"H\",IF(AD$7=\"Sun\",\"H\",IFERROR(VLOOKUP($D9&\"-\"&AD$8&\"\",pks_3!$A$1:$E$21,5,0),\"P\")))))","v":"P"},{"$f":"IF(AE$8>TODAY(),\"\",IF($C9=\"\",\"\",IF(COUNTIF(Date,AE$8)>0,\"H\",IF(AE$7=\"Sun\",\"H\",IFERROR(VLOOKUP($D9&\"-\"&AE$8&\"\",pks_3!$A$1:$E$21,5,0),\"P\")))))","v":"P"},{"$f":"IF(AF$8>TODAY(),\"\",IF($C9=\"\",\"\",IF(COUNTIF(Date,AF$8)>0,\"H\",IF(AF$7=\"Sun\",\"H\",IFERROR(VLOOKUP($D9&\"-\"&AF$8&\"\",pks_3!$A$1:$E$21,5,0),\"P\")))))","v":"P"},{"$f":"IF(AG$8>TODAY(),\"\",IF($C9=\"\",\"\",IF(COUNTIF(Date,AG$8)>0,\"H\",IF(AG$7=\"Sun\",\"H\",IFERROR(VLOOKUP($D9&\"-\"&AG$8&\"\",pks_3!$A$1:$E$21,5,0),\"P\")))))","v":"H"},{"$f":"IF(AH$8>TODAY(),\"\",IF($C9=\"\",\"\",IF(COUNTIF(Date,AH$8)>0,\"H\",IF(AH$7=\"Sun\",\"H\",IFERROR(VLOOKUP($D9&\"-\"&AH$8&\"\",pks_3!$A$1:$E$21,5,0),\"P\")))))","v":"P"},{"$f":"IF(AI$8>TODAY(),\"\",IF($C9=\"\",\"\",IF(COUNTIF(Date,AI$8)>0,\"H\",IF(AI$7=\"Sun\",\"H\",IFERROR(VLOOKUP($D9&\"-\"&AI$8&\"\",pks_3!$A$1:$E$21,5,0),\"P\")))))","v":"P"},{"$f":"COUNTIFS(E9:AI9,\"p\")","v":26},{"$f":"COUNTIFS(E9:AI9,\"c/l\")","v":0},{"$f":"COUNTIFS(E9:AI9,\"m/l\")","v":0},{"$f":"COUNTIFS(E9:AI9,\"p/l\")","v":0}]
[null,{"$f":"IF(C10=\"\",\"\",COUNTA($C$9:C10))","v":2},"ABC",234,{"$f":"IF(E$8>TODAY(),\"\",IF($C10=\"\",\"\",IF(COUNTIF(Date,E$8)>0,\"H\",IF(E$7=\"Sun\",\"H\",IFERROR(VLOOKUP($D10&\"-\"&E$8&\"\",pks_3!$A$1:$E$21,5,0),\"P\")))))","v":"H"},{"$f":"IF(F$8>TODAY(),\"\",IF($C10=\"\",\"\",IF(COUNTIF(Date,F$8)>0,\"H\",IF(F$7=\"Sun\",\"H\",IFERROR(VLOOKUP($D10&\"-\"&F$8&\"\",pks_3!$A$1:$E$21,5,0),\"P\")))))","v":"P"},{"$f":"IF(G$8>TODAY(),\"\",IF($C10=\"\",\"\",IF(COUNTIF(Date,G$8)>0,\"H\",IF(G$7=\"Sun\",\"H\",IFERROR(VLOOKUP($D10&\"-\"&G$8&\"\",pks_3!$A$1:$E$21,5,0),\"P\")))))","v":"P"},{"$f":"IF(H$8>TODAY(),\"\",IF($C10=\"\",\"\",IF(COUNTIF(Date,H$8)>0,\"H\",IF(H$7=\"Sun\",\"H\",IFERROR(VLOOKUP($D10&\"-\"&H$8&\"\",pks_3!$A$1:$E$21,5,0),\"P\")))))","v":"P"},{"$f":"IF(I$8>TODAY(),\"\",IF($C10=\"\",\"\",IF(COUNTIF(Date,I$8)>0,\"H\",IF(I$7=\"Sun\",\"H\",IFERROR(VLOOKUP($D10&\"-\"&I$8&\"\",pks_3!$A$1:$E$21,5,0),\"P\")))))","v":"P"},{"$f":"IF(J$8>TODAY(),\"\",IF($C10=\"\",\"\",IF(COUNTIF(Date,J$8)>0,\"H\",IF(J$7=\"Sun\",\"H\",IFERROR(VLOOKUP($D10&\"-\"&J$8&\"\",pks_3!$A$1:$E$21,5,0),\"P\")))))","v":"P"},{"$f":"IF(K$8>TODAY(),\"\",IF($C10=\"\",\"\",IF(COUNTIF(Date,K$8)>0,\"H\",IF(K$7=\"Sun\",\"H\",IFERROR(VLOOKUP($D10&\"-\"&K$8&\"\",pks_3!$A$1:$E$21,5,0),\"P\")))))","v":"P"},{"$f":"IF(L$8>TODAY(),\"\",IF($C10=\"\",\"\",IF(COUNTIF(Date,L$8)>0,\"H\",IF(L$7=\"Sun\",\"H\",IFERROR(VLOOKUP($D10&\"-\"&L$8&\"\",pks_3!$A$1:$E$21,5,0),\"P\")))))","v":"H"},{"$f":"IF(M$8>TODAY(),\"\",IF($C10=\"\",\"\",IF(COUNTIF(Date,M$8)>0,\"H\",IF(M$7=\"Sun\",\"H\",IFERROR(VLOOKUP($D10&\"-\"&M$8&\"\",pks_3!$A$1:$E$21,5,0),\"P\")))))","v":"P"},{"$f":"IF(N$8>TODAY(),\"\",IF($C10=\"\",\"\",IF(COUNTIF(Date,N$8)>0,\"H\",IF(N$7=\"Sun\",\"H\",IFERROR(VLOOKUP($D10&\"-\"&N$8&\"\",pks_3!$A$1:$E$21,5,0),\"P\")))))","v":"P"},{"$f":"IF(O$8>TODAY(),\"\",IF($C10=\"\",\"\",IF(COUNTIF(Date,O$8)>0,\"H\",IF(O$7=\"Sun\",\"H\",IFERROR(VLOOKUP($D10&\"-\"&O$8&\"\",pks_3!$A$1:$E$21,5,0),\"P\")))))","v":"P"},{"$f":"IF(P$8>TODAY(),\"\",IF($C10=\"\",\"\",IF(COUNTIF(Date,P$8)>0,\"H\",IF(P$7=\"Sun\",\"H\",IFERROR(VLOOKUP($D10&\"-\"&P$8&\"\",pks_3!$A$1:$E$21,5,0),\"P\")))))","v":"P"},{"$f":"IF(Q$8>TODAY(),\"\",IF($C10=\"\",\"\",IF(COUNTIF(Date,Q$8)>0,\"H\",IF(Q$7=\"Sun\",\"H\",IFERROR(VLOOKUP($D10&\"-\"&Q$8&\"\",pks_3!$A$1:$E$21,5,0),\"P\")))))","v":"P"},{"$f":"IF(R$8>TODAY(),\"\",IF($C10=\"\",\"\",IF(COUNTIF(Date,R$8)>0,\"H\",IF(R$7=\"Sun\",\"H\",IFERROR(VLOOKUP($D10&\"-\"&R$8&\"\",pks_3!$A$1:$E$21,5,0),\"P\")))))","v":"P"},{"$f":"IF(S$8>TODAY(),\"\",IF($C10=\"\",\"\",IF(COUNTIF(Date,S$8)>0,\"H\",IF(S$7=\"Sun\",\"H\",IFERROR(VLOOKUP($D10&\"-\"&S$8&\"\",pks_3!$A$1:$E$21,5,0),\"P\")))))","v":"H"},{"$f":"IF(T$8>TODAY(),\"\",IF($C10=\"\",\"\",IF(COUNTIF(Date,T$8)>0,\"H\",IF(T$7=\"Sun\",\"H\",IFERROR(VLOOKUP($D10&\"-\"&T$8&\"\",pks_3!$A$1:$E$21,5,0),\"P\")))))","v":"P"},{"$f":"IF(U$8>TODAY(),\"\",IF($C10=\"\",\"\",IF(COUNTIF(Date,U$8)>0,\"H\",IF(U$7=\"Sun\",\"H\",IFERROR(VLOOKUP($D10&\"-\"&U$8&\"\",pks_3!$A$1:$E$21,5,0),\"P\")))))","v":"P"},{"$f":"IF(V$8>TODAY(),\"\",IF($C10=\"\",\"\",IF(COUNTIF(Date,V$8)>0,\"H\",IF(V$7=\"Sun\",\"H\",IFERROR(VLOOKUP($D10&\"-\"&V$8&\"\",pks_3!$A$1:$E$21,5,0),\"P\")))))","v":"P"},{"$f":"IF(W$8>TODAY(),\"\",IF($C10=\"\",\"\",IF(COUNTIF(Date,W$8)>0,\"H\",IF(W$7=\"Sun\",\"H\",IFERROR(VLOOKUP($D10&\"-\"&W$8&\"\",pks_3!$A$1:$E$21,5,0),\"P\")))))","v":"P"},{"$f":"IF(X$8>TODAY(),\"\",IF($C10=\"\",\"\",IF(COUNTIF(Date,X$8)>0,\"H\",IF(X$7=\"Sun\",\"H\",IFERROR(VLOOKUP($D10&\"-\"&X$8&\"\",pks_3!$A$1:$E$21,5,0),\"P\")))))","v":"P"},{"$f":"IF(Y$8>TODAY(),\"\",IF($C10=\"\",\"\",IF(COUNTIF(Date,Y$8)>0,\"H\",IF(Y$7=\"Sun\",\"H\",IFERROR(VLOOKUP($D10&\"-\"&Y$8&\"\",pks_3!$A$1:$E$21,5,0),\"P\")))))","v":"P"},{"$f":"IF(Z$8>TODAY(),\"\",IF($C10=\"\",\"\",IF(COUNTIF(Date,Z$8)>0,\"H\",IF(Z$7=\"Sun\",\"H\",IFERROR(VLOOKUP($D10&\"-\"&Z$8&\"\",pks_3!$A$1:$E$21,5,0),\"P\")))))","v":"H"},{"$f":"IF(AA$8>TODAY(),\"\",IF($C10=\"\",\"\",IF(COUNTIF(Date,AA$8)>0,\"H\",IF(AA$7=\"Sun\",\"H\",IFERROR(VLOOKUP($D10&\"-\"&AA$8&\"\",pks_3!$A$1:$E$21,5,0),\"P\")))))","v":"P"},{"$f":"IF(AB$8>TODAY(),\"\",IF($C10=\"\",\"\",IF(COUNTIF(Date,AB$8)>0,\"H\",IF(AB$7=\"Sun\",\"H\",IFERROR(VLOOKUP($D10&\"-\"&AB$8&\"\",pks_3!$A$1:$E$21,5,0),\"P\")))))","v":"P"},{"$f":"IF(AC$8>TODAY(),\"\",IF($C10=\"\",\"\",IF(COUNTIF(Date,AC$8)>0,\"H\",IF(AC$7=\"Sun\",\"H\",IFERROR(VLOOKUP($D10&\"-\"&AC$8&\"\",pks_3!$A$1:$E$21,5,0),\"P\")))))","v":"P"},{"$f":"IF(AD$8>TODAY(),\"\",IF($C10=\"\",\"\",IF(COUNTIF(Date,AD$8)>0,\"H\",IF(AD$7=\"Sun\",\"H\",IFERROR(VLOOKUP($D10&\"-\"&AD$8&\"\",pks_3!$A$1:$E$21,5,0),\"P\")))))","v":"P"},{"$f":"IF(AE$8>TODAY(),\"\",IF($C10=\"\",\"\",IF(COUNTIF(Date,AE$8)>0,\"H\",IF(AE$7=\"Sun\",\"H\",IFERROR(VLOOKUP($D10&\"-\"&AE$8&\"\",pks_3!$A$1:$E$21,5,0),\"P\")))))","v":"P"},{"$f":"IF(AF$8>TODAY(),\"\",IF($C10=\"\",\"\",IF(COUNTIF(Date,AF$8)>0,\"H\",IF(AF$7=\"Sun\",\"H\",IFERROR(VLOOKUP($D10&\"-\"&AF$8&\"\",pks_3!$A$1:$E$21,5,0),\"P\")))))","v":"P"},{"$f":"IF(AG$8>TODAY(),\"\",IF($C10=\"\",\"\",IF(COUNTIF(Date,AG$8)>0,\"H\",IF(AG$7=\"Sun\",\"H\",IFERROR(VLOOKUP($D10&\"-\"&AG$8&\"\",pks_3!$A$1:$E$21,5,0),\"P\")))))","v":"H"},{"$f":"IF(AH$8>TODAY(),\"\",IF($C10=\"\",\"\",IF(COUNTIF(Date,AH$8)>0,\"H\",IF(AH$7=\"Sun\",\"H\",IFERROR(VLOOKUP($D10&\"-\"&AH$8&\"\",pks_3!$A$1:$E$21,5,0),\"P\")))))","v":"P"},{"$f":"IF(AI$8>TODAY(),\"\",IF($C10=\"\",\"\",IF(COUNTIF(Date,AI$8)>0,\"H\",IF(AI$7=\"Sun\",\"H\",IFERROR(VLOOKUP($D10&\"-\"&AI$8&\"\",pks_3!$A$1:$E$21,5,0),\"P\")))))","v":"P"},{"$f":"COUNTIFS(E10:AI10,\"p\")","v":26},{"$f":"COUNTIFS(E10:AI10,\"c/l\")","v":0},{"$f":"COUNTIFS(E10:AI10,\"m/l\")","v":0},{"$f":"COUNTIFS(E10:AI10,\"p/l\")","v":0}]
[null,{"$f":"IF(C11=\"\",\"\",COUNTA($C$9:C11))","v":3},"DEF",345,{"$f":"IF(E$8>TODAY(),\"\",IF($C11=\"\",\"\",IF(COUNTIF(Date,E$8)>0,\"H\",IF(E$7=\"Sun\",\"H\",IFERROR(VLOOKUP($D11&\"-\"&E$8&\"\",pks_3!$A$1:$E$21,5,0),\"P\")))))","v":"H"},{"$f":"IF(F$8>TODAY(),\"\",IF($C11=\"\",\"\",IF(COUNTIF(Date,F$8)>0,\"H\",IF(F$7=\"Sun\",\"H\",IFERROR(VLOOKUP($D11&\"-\"&F$8&\"\",pks_3!$A$1:$E$21,5,0),\"P\")))))","v":"P"},{"$f":"IF(G$8>TODAY(),\"\",IF($C11=\"\",\"\",IF(COUNTIF(Date,G$8)>0,\"H\",IF(G$7=\"Sun\",\"H\",IFERROR(VLOOKUP($D11&\"-\"&G$8&\"\",pks_3!$A$1:$E$21,5,0),\"P\")))))","v":"P"},{"$f":"IF(H$8>TODAY(),\"\",IF($C11=\"\",\"\",IF(COUNTIF(Date,H$8)>0,\"H\",IF(H$7=\"Sun\",\"H\",IFERROR(VLOOKUP($D11&\"-\"&H$8&\"\",pks_3!$A$1:$E$21,5,0),\"P\")))))","v":"P"},{"$f":"IF(I$8>TODAY(),\"\",IF($C11=\"\",\"\",IF(COUNTIF(Date,I$8)>0,\"H\",IF(I$7=\"Sun\",\"H\",IFERROR(VLOOKUP($D11&\"-\"&I$8&\"\",pks_3!$A$1:$E$21,5,0),\"P\")))))","v":"P"},{"$f":"IF(J$8>TODAY(),\"\",IF($C11=\"\",\"\",IF(COUNTIF(Date,J$8)>0,\"H\",IF(J$7=\"Sun\",\"H\",IFERROR(VLOOKUP($D11&\"-\"&J$8&\"\",pks_3!$A$1:$E$21,5,0),\"P\")))))","v":"P"},{"$f":"IF(K$8>TODAY(),\"\",IF($C11=\"\",\"\",IF(COUNTIF(Date,K$8)>0,\"H\",IF(K$7=\"Sun\",\"H\",IFERROR(VLOOKUP($D11&\"-\"&K$8&\"\",pks_3!$A$1:$E$21,5,0),\"P\")))))","v":"P"},{"$f":"IF(L$8>TODAY(),\"\",IF($C11=\"\",\"\",IF(COUNTIF(Date,L$8)>0,\"H\",IF(L$7=\"Sun\",\"H\",IFERROR(VLOOKUP($D11&\"-\"&L$8&\"\",pks_3!$A$1:$E$21,5,0),\"P\")))))","v":"H"},{"$f":"IF(M$8>TODAY(),\"\",IF($C11=\"\",\"\",IF(COUNTIF(Date,M$8)>0,\"H\",IF(M$7=\"Sun\",\"H\",IFERROR(VLOOKUP($D11&\"-\"&M$8&\"\",pks_3!$A$1:$E$21,5,0),\"P\")))))","v":"P"},{"$f":"IF(N$8>TODAY(),\"\",IF($C11=\"\",\"\",IF(COUNTIF(Date,N$8)>0,\"H\",IF(N$7=\"Sun\",\"H\",IFERROR(VLOOKUP($D11&\"-\"&N$8&\"\",pks_3!$A$1:$E$21,5,0),\"P\")))))","v":"P"},{"$f":"IF(O$8>TODAY(),\"\",IF($C11=\"\",\"\",IF(COUNTIF(Date,O$8)>0,\"H\",IF(O$7=\"Sun\",\"H\",IFERROR(VLOOKUP($D11&\"-\"&O$8&\"\",pks_3!$A$1:$E$21,5,0),\"P\")))))","v":"P"},{"$f":"IF(P$8>TODAY(),\"\",IF($C11=\"\",\"\",IF(COUNTIF(Date,P$8)>0,\"H\",IF(P$7=\"Sun\",\"H\",IFERROR(VLOOKUP($D11&\"-\"&P$8&\"\",pks_3!$A$1:$E$21,5,0),\"P\")))))","v":"P"},{"$f":"IF(Q$8>TODAY(),\"\",IF($C11=\"\",\"\",IF(COUNTIF(Date,Q$8)>0,\"H\",IF(Q$7=\"Sun\",\"H\",IFERROR(VLOOKUP($D11&\"-\"&Q$8&\"\",pks_3!$A$1:$E$21,5,0),\"P\")))))","v":"P"},{"$f":"IF(R$8>TODAY(),\"\",IF($C11=\"\",\"\",IF(COUNTIF(Date,R$8)>0,\"H\",IF(R$7=\"Sun\",\"H\",IFERROR(VLOOKUP($D11&\"-\"&R$8&\"\",pks_3!$A$1:$E$21,5,0),\"P\")))))","v":"P"},{"$f":"IF(S$8>TODAY(),\"\",IF($C11=\"\",\"\",IF(COUNTIF(Date,S$8)>0,\"H\",IF(S$7=\"Sun\",\"H\",IFERROR(VLOOKUP($D11&\"-\"&S$8&\"\",pks_3!$A$1:$E$21,5,0),\"P\")))))","v":"H"},{"$f":"IF(T$8>TODAY(),\"\",IF($C11=\"\",\"\",IF(COUNTIF(Date,T$8)>0,\"H\",IF(T$7=\"Sun\",\"H\",IFERROR(VLOOKUP($D11&\"-\"&T$8&\"\",pks_3!$A$1:$E$21,5,0),\"P\")))))","v":"P"},{"$f":"IF(U$8>TODAY(),\"\",IF($C11=\"\",\"\",IF(COUNTIF(Date,U$8)>0,\"H\",IF(U$7=\"Sun\",\"H\",IFERROR(VLOOKUP($D11&\"-\"&U$8&\"\",pks_3!$A$1:$E$21,5,0),\"P\")))))","v":"P"},{"$f":"IF(V$8>TODAY(),\"\",IF($C11=\"\",\"\",IF(COUNTIF(Date,V$8)>0,\"H\",IF(V$7=\"Sun\",\"H\",IFERROR(VLOOKUP($D11&\"-\"&V$8&\"\",pks_3!$A$1:$E$21,5,0),\"P\")))))","v":"P"},{"$f":"IF(W$8>TODAY(),\"\",IF($C11=\"\",\"\",IF(COUNTIF(Date,W$8)>0,\"H\",IF(W$7=\"Sun\",\"H\",IFERROR(VLOOKUP($D11&\"-\"&W$8&\"\",pks_3!$A$1:$E$21,5,0),\"P\")))))","v":"P"},{"$f":"IF(X$8>TODAY(),\"\",IF($C11=\"\",\"\",IF(COUNTIF(Date,X$8)>0,\"H\",IF(X$7=\"Sun\",\"H\",IFERROR(VLOOKUP($D11&\"-\"&X$8&\"\",pks_3!$A$1:$E$21,5,0),\"P\")))))","v":"P"},{"$f":"IF(Y$8>TODAY(),\"\",IF($C11=\"\",\"\",IF(COUNTIF(Date,Y$8)>0,\"H\",IF(Y$7=\"Sun\",\"H\",IFERROR(VLOOKUP($D11&\"-\"&Y$8&\"\",pks_3!$A$1:$E$21,5,0),\"P\")))))","v":"P"},{"$f":"IF(Z$8>TODAY(),\"\",IF($C11=\"\",\"\",IF(COUNTIF(Date,Z$8)>0,\"H\",IF(Z$7=\"Sun\",\"H\",IFERROR(VLOOKUP($D11&\"-\"&Z$8&\"\",pks_3!$A$1:$E$21,5,0),\"P\")))))","v":"H"},{"$f":"IF(AA$8>TODAY(),\"\",IF($C11=\"\",\"\",IF(COUNTIF(Date,AA$8)>0,\"H\",IF(AA$7=\"Sun\",\"H\",IFERROR(VLOOKUP($D11&\"-\"&AA$8&\"\",pks_3!$A$1:$E$21,5,0),\"P\")))))","v":"P"},{"$f":"IF(AB$8>TODAY(),\"\",IF($C11=\"\",\"\",IF(COUNTIF(Date,AB$8)>0,\"H\",IF(AB$7=\"Sun\",\"H\",IFERROR(VLOOKUP($D11&\"-\"&AB$8&\"\",pks_3!$A$1:$E$21,5,0),\"P\")))))","v":"P"},{"$f":"IF(AC$8>TODAY(),\"\",IF($C11=\"\",\"\",IF(COUNTIF(Date,AC$8)>0,\"H\",IF(AC$7=\"Sun\",\"H\",IFERROR(VLOOKUP($D11&\"-\"&AC$8&\"\",pks_3!$A$1:$E$21,5,0),\"P\")))))","v":"P"},{"$f":"IF(AD$8>TODAY(),\"\",IF($C11=\"\",\"\",IF(COUNTIF(Date,AD$8)>0,\"H\",IF(AD$7=\"Sun\",\"H\",IFERROR(VLOOKUP($D11&\"-\"&AD$8&\"\",pks_3!$A$1:$E$21,5,0),\"P\")))))","v":"P"},{"$f":"IF(AE$8>TODAY(),\"\",IF($C11=\"\",\"\",IF(COUNTIF(Date,AE$8)>0,\"H\",IF(AE$7=\"Sun\",\"H\",IFERROR(VLOOKUP($D11&\"-\"&AE$8&\"\",pks_3!$A$1:$E$21,5,0),\"P\")))))","v":"P"},{"$f":"IF(AF$8>TODAY(),\"\",IF($C11=\"\",\"\",IF(COUNTIF(Date,AF$8)>0,\"H\",IF(AF$7=\"Sun\",\"H\",IFERROR(VLOOKUP($D11&\"-\"&AF$8&\"\",pks_3!$A$1:$E$21,5,0),\"P\")))))","v":"P"},{"$f":"IF(AG$8>TODAY(),\"\",IF($C11=\"\",\"\",IF(COUNTIF(Date,AG$8)>0,\"H\",IF(AG$7=\"Sun\",\"H\",IFERROR(VLOOKUP($D11&\"-\"&AG$8&\"\",pks_3!$A$1:$E$21,5,0),\"P\")))))","v":"H"},{"$f":"IF(AH$8>TODAY(),\"\",IF($C11=\"\",\"\",IF(COUNTIF(Date,AH$8)>0,\"H\",IF(AH$7=\"Sun\",\"H\",IFERROR(VLOOKUP($D11&\"-\"&AH$8&\"\",pks_3!$A$1:$E$21,5,0),\"P\")))))","v":"P"},{"$f":"IF(AI$8>TODAY(),\"\",IF($C11=\"\",\"\",IF(COUNTIF(Date,AI$8)>0,\"H\",IF(AI$7=\"Sun\",\"H\",IFERROR(VLOOKUP($D11&\"-\"&AI$8&\"\",pks_3!$A$1:$E$21,5,0),\"P\")))))","v":"P"},26,0,0,0]
[null,{"$f":"IF(C12=\"\",\"\",COUNTA($C$9:C12))","v":""},null,null,{"$f":"IF(E$8>TODAY(),\"\",IF($C12=\"\",\"\",IF(COUNTIF(Date,E$8)>0,\"H\",IF(E$7=\"Sun\",\"H\",IFERROR(VLOOKUP($D12&\"-\"&E$8&\"\",pks_3!$A$1:$E$21,5,0),\"P\")))))","v":""},{"$f":"IF(F$8>TODAY(),\"\",IF($C12=\"\",\"\",IF(COUNTIF(Date,F$8)>0,\"H\",IF(F$7=\"Sun\",\"H\",IFERROR(VLOOKUP($D12&\"-\"&F$8&\"\",pks_3!$A$1:$E$21,5,0),\"P\")))))","v":""},{"$f":"IF(G$8>TODAY(),\"\",IF($C12=\"\",\"\",IF(COUNTIF(Date,G$8)>0,\"H\",IF(G$7=\"Sun\",\"H\",IFERROR(VLOOKUP($D12&\"-\"&G$8&\"\",pks_3!$A$1:$E$21,5,0),\"P\")))))","v":""},{"$f":"IF(H$8>TODAY(),\"\",IF($C12=\"\",\"\",IF(COUNTIF(Date,H$8)>0,\"H\",IF(H$7=\"Sun\",\"H\",IFERROR(VLOOKUP($D12&\"-\"&H$8&\"\",pks_3!$A$1:$E$21,5,0),\"P\")))))","v":""},{"$f":"IF(I$8>TODAY(),\"\",IF($C12=\"\",\"\",IF(COUNTIF(Date,I$8)>0,\"H\",IF(I$7=\"Sun\",\"H\",IFERROR(VLOOKUP($D12&\"-\"&I$8&\"\",pks_3!$A$1:$E$21,5,0),\"P\")))))","v":""},{"$f":"IF(J$8>TODAY(),\"\",IF($C12=\"\",\"\",IF(COUNTIF(Date,J$8)>0,\"H\",IF(J$7=\"Sun\",\"H\",IFERROR(VLOOKUP($D12&\"-\"&J$8&\"\",pks_3!$A$1:$E$21,5,0),\"P\")))))","v":""},{"$f":"IF(K$8>TODAY(),\"\",IF($C12=\"\",\"\",IF(COUNTIF(Date,K$8)>0,\"H\",IF(K$7=\"Sun\",\"H\",IFERROR(VLOOKUP($D12&\"-\"&K$8&\"\",pks_3!$A$1:$E$21,5,0),\"P\")))))","v":""},{"$f":"IF(L$8>TODAY(),\"\",IF($C12=\"\",\"\",IF(COUNTIF(Date,L$8)>0,\"H\",IF(L$7=\"Sun\",\"H\",IFERROR(VLOOKUP($D12&\"-\"&L$8&\"\",pks_3!$A$1:$E$21,5,0),\"P\")))))","v":""},{"$f":"IF(M$8>TODAY(),\"\",IF($C12=\"\",\"\",IF(COUNTIF(Date,M$8)>0,\"H\",IF(M$7=\"Sun\",\"H\",IFERROR(VLOOKUP($D12&\"-\"&M$8&\"\",pks_3!$A$1:$E$21,5,0),\"P\")))))","v":""},{"$f":"IF(N$8>TODAY(),\"\",IF($C12=\"\",\"\",IF(COUNTIF(Date,N$8)>0,\"H\",IF(N$7=\"Sun\",\"H\",IFERROR(VLOOKUP($D12&\"-\"&N$8&\"\",pks_3!$A$1:$E$21,5,0),\"P\")))))","v":""},{"$f":"IF(O$8>TODAY(),\"\",IF($C12=\"\",\"\",IF(COUNTIF(Date,O$8)>0,\"H\",IF(O$7=\"Sun\",\"H\",IFERROR(VLOOKUP($D12&\"-\"&O$8&\"\",pks_3!$A$1:$E$21,5,0),\"P\")))))","v":""},{"$f":"IF(P$8>TODAY(),\"\",IF($C12=\"\",\"\",IF(COUNTIF(Date,P$8)>0,\"H\",IF(P$7=\"Sun\",\"H\",IFERROR(VLOOKUP($D12&\"-\"&P$8&\"\",pks_3!$A$1:$E$21,5,0),\"P\")))))","v":""},{"$f":"IF(Q$8>TODAY(),\"\",IF($C12=\"\",\"\",IF(COUNTIF(Date,Q$8)>0,\"H\",IF(Q$7=\"Sun\",\"H\",IFERROR(VLOOKUP($D12&\"-\"&Q$8&\"\",pks_3!$A$1:$E$21,5,0),\"P\")))))","v":""},{"$f":"IF(R$8>TODAY(),\"\",IF($C12=\"\",\"\",IF(COUNTIF(Date,R$8)>0,\"H\",IF(R$7=\"Sun\",\"H\",IFERROR(VLOOKUP($D12&\"-\"&R$8&\"\",pks_3!$A$1:$E$21,5,0),\"P\")))))","v":""},{"$f":"IF(S$8>TODAY(),\"\",IF($C12=\"\",\"\",IF(COUNTIF(Date,S$8)>0,\"H\",IF(S$7=\"Sun\",\"H\",IFERROR(VLOOKUP($D12&\"-\"&S$8&\"\",pks_3!$A$1:$E$21,5,0),\"P\")))))","v":""},{"$f":"IF(T$8>TODAY(),\"\",IF($C12=\"\",\"\",IF(COUNTIF(Date,T$8)>0,\"H\",IF(T$7=\"Sun\",\"H\",IFERROR(VLOOKUP($D12&\"-\"&T$8&\"\",pks_3!$A$1:$E$21,5,0),\"P\")))))","v":""},{"$f":"IF(U$8>TODAY(),\"\",IF($C12=\"\",\"\",IF(COUNTIF(Date,U$8)>0,\"H\",IF(U$7=\"Sun\",\"H\",IFERROR(VLOOKUP($D12&\"-\"&U$8&\"\",pks_3!$A$1:$E$21,5,0),\"P\")))))","v":""},{"$f":"IF(V$8>TODAY(),\"\",IF($C12=\"\",\"\",IF(COUNTIF(Date,V$8)>0,\"H\",IF(V$7=\"Sun\",\"H\",IFERROR(VLOOKUP($D12&\"-\"&V$8&\"\",pks_3!$A$1:$E$21,5,0),\"P\")))))","v":""},{"$f":"IF(W$8>TODAY(),\"\",IF($C12=\"\",\"\",IF(COUNTIF(Date,W$8)>0,\"H\",IF(W$7=\"Sun\",\"H\",IFERROR(VLOOKUP($D12&\"-\"&W$8&\"\",pks_3!$A$1:$E$21,5,0),\"P\")))))","v":""},{"$f":"IF(X$8>TODAY(),\"\",IF($C12=\"\",\"\",IF(COUNTIF(Date,X$8)>0,\"H\",IF(X$7=\"Sun\",\"H\",IFERROR(VLOOKUP($D12&\"-\"&X$8&\"\",pks_3!$A$1:$E$21,5,0),\"P\")))))","v":""},{"$f":"IF(Y$8>TODAY(),\"\",IF($C12=\"\",\"\",IF(COUNTIF(Date,Y$8)>0,\"H\",IF(Y$7=\"Sun\",\"H\",IFERROR(VLOOKUP($D12&\"-\"&Y$8&\"\",pks_3!$A$1:$E$21,5,0),\"P\")))))","v":""},{"$f":"IF(Z$8>TODAY(),\"\",IF($C12=\"\",\"\",IF(COUNTIF(Date,Z$8)>0,\"H\",IF(Z$7=\"Sun\",\"H\",IFERROR(VLOOKUP($D12&\"-\"&Z$8&\"\",pks_3!$A$1:$E$21,5,0),\"P\")))))","v":""},{"$f":"IF(AA$8>TODAY(),\"\",IF($C12=\"\",\"\",IF(COUNTIF(Date,AA$8)>0,\"H\",IF(AA$7=\"Sun\",\"H\",IFERROR(VLOOKUP($D12&\"-\"&AA$8&\"\",pks_3!$A$1:$E$21,5,0),\"P\")))))","v":""},{"$f":"IF(AB$8>TODAY(),\"\",IF($C12=\"\",\"\",IF(COUNTIF(Date,AB$8)>0,\"H\",IF(AB$7=\"Sun\",\"H\",IFERROR(VLOOKUP($D12&\"-\"&AB$8&\"\",pks_3!$A$1:$E$21,5,0),\"P\")))))","v":""},{"$f":"IF(AC$8>TODAY(),\"\",IF($C12=\"\",\"\",IF(COUNTIF(Date,AC$8)>0,\"H\",IF(AC$7=\"Sun\",\"H\",IFERROR(VLOOKUP($D12&\"-\"&AC$8&\"\",pks_3!$A$1:$E$21,5,0),\"P\")))))","v":""},{"$f":"IF(AD$8>TODAY(),\"\",IF($C12=\"\",\"\",IF(COUNTIF(Date,AD$8)>0,\"H\",IF(AD$7=\"Sun\",\"H\",IFERROR(VLOOKUP($D12&\"-\"&AD$8&\"\",pks_3!$A$1:$E$21,5,0),\"P\")))))","v":""},{"$f":"IF(AE$8>TODAY(),\"\",IF($C12=\"\",\"\",IF(COUNTIF(Date,AE$8)>0,\"H\",IF(AE$7=\"Sun\",\"H\",IFERROR(VLOOKUP($D12&\"-\"&AE$8&\"\",pks_3!$A$1:$E$21,5,0),\"P\")))))","v":""},{"$f":"IF(AF$8>TODAY(),\"\",IF($C12=\"\",\"\",IF(COUNTIF(Date,AF$8)>0,\"H\",IF(AF$7=\"Sun\",\"H\",IFERROR(VLOOKUP($D12&\"-\"&AF$8&\"\",pks_3!$A$1:$E$21,5,0),\"P\")))))","v":""},{"$f":"IF(AG$8>TODAY(),\"\",IF($C12=\"\",\"\",IF(COUNTIF(Date,AG$8)>0,\"H\",IF(AG$7=\"Sun\",\"H\",IFERROR(VLOOKUP($D12&\"-\"&AG$8&\"\",pks_3!$A$1:$E$21,5,0),\"P\")))))","v":""},{"$f":"IF(AH$8>TODAY(),\"\",IF($C12=\"\",\"\",IF(COUNTIF(Date,AH$8)>0,\"H\",IF(AH$7=\"Sun\",\"H\",IFERROR(VLOOKUP($D12&\"-\"&AH$8&\"\",pks_3!$A$1:$E$21,5,0),\"P\")))))","v":""},{"$f":"IF(AI$8>TODAY(),\"\",IF($C12=\"\",\"\",IF(COUNTIF(Date,AI$8)>0,\"H\",IF(AI$7=\"Sun\",\"H\",IFERROR(VLOOKUP($D12&\"-\"&AI$8&\"\",pks_3!$A$1:$E$21,5,0),\"P\")))))","v":""},0,0,0,0]
[null,{"$f":"IF(C13=\"\",\"\",COUNTA($C$9:C13))","v":4},"Pramod Kumar Saini",5678,{"$f":"IF(E$8>TODAY(),\"\",IF($C13=\"\",\"\",IF(COUNTIF(Date,E$8)>0,\"H\",IF(E$7=\"Sun\",\"H\",IFERROR(VLOOKUP($D13&\"-\"&E$8&\"\",pks_3!$A$1:$E$21,5,0),\"P\")))))","v":"H"},{"$f":"IF(F$8>TODAY(),\"\",IF($C13=\"\",\"\",IF(COUNTIF(Date,F$8)>0,\"H\",IF(F$7=\"Sun\",\"H\",IFERROR(VLOOKUP($D13&\"-\"&F$8&\"\",pks_3!$A$1:$E$21,5,0),\"P\")))))","v":"P"},{"$f":"IF(G$8>TODAY(),\"\",IF($C13=\"\",\"\",IF(COUNTIF(Date,G$8)>0,\"H\",IF(G$7=\"Sun\",\"H\",IFERROR(VLOOKUP($D13&\"-\"&G$8&\"\",pks_3!$A$1:$E$21,5,0),\"P\")))))","v":"P"},{"$f":"IF(H$8>TODAY(),\"\",IF($C13=\"\",\"\",IF(COUNTIF(Date,H$8)>0,\"H\",IF(H$7=\"Sun\",\"H\",IFERROR(VLOOKUP($D13&\"-\"&H$8&\"\",pks_3!$A$1:$E$21,5,0),\"P\")))))","v":"P"},{"$f":"IF(I$8>TODAY(),\"\",IF($C13=\"\",\"\",IF(COUNTIF(Date,I$8)>0,\"H\",IF(I$7=\"Sun\",\"H\",IFERROR(VLOOKUP($D13&\"-\"&I$8&\"\",pks_3!$A$1:$E$21,5,0),\"P\")))))","v":"P"},{"$f":"IF(J$8>TODAY(),\"\",IF($C13=\"\",\"\",IF(COUNTIF(Date,J$8)>0,\"H\",IF(J$7=\"Sun\",\"H\",IFERROR(VLOOKUP($D13&\"-\"&J$8&\"\",pks_3!$A$1:$E$21,5,0),\"P\")))))","v":"P"},{"$f":"IF(K$8>TODAY(),\"\",IF($C13=\"\",\"\",IF(COUNTIF(Date,K$8)>0,\"H\",IF(K$7=\"Sun\",\"H\",IFERROR(VLOOKUP($D13&\"-\"&K$8&\"\",pks_3!$A$1:$E$21,5,0),\"P\")))))","v":"P"},{"$f":"IF(L$8>TODAY(),\"\",IF($C13=\"\",\"\",IF(COUNTIF(Date,L$8)>0,\"H\",IF(L$7=\"Sun\",\"H\",IFERROR(VLOOKUP($D13&\"-\"&L$8&\"\",pks_3!$A$1:$E$21,5,0),\"P\")))))","v":"H"},{"$f":"IF(M$8>TODAY(),\"\",IF($C13=\"\",\"\",IF(COUNTIF(Date,M$8)>0,\"H\",IF(M$7=\"Sun\",\"H\",IFERROR(VLOOKUP($D13&\"-\"&M$8&\"\",pks_3!$A$1:$E$21,5,0),\"P\")))))","v":"P"},{"$f":"IF(N$8>TODAY(),\"\",IF($C13=\"\",\"\",IF(COUNTIF(Date,N$8)>0,\"H\",IF(N$7=\"Sun\",\"H\",IFERROR(VLOOKUP($D13&\"-\"&N$8&\"\",pks_3!$A$1:$E$21,5,0),\"P\")))))","v":"P"},{"$f":"IF(O$8>TODAY(),\"\",IF($C13=\"\",\"\",IF(COUNTIF(Date,O$8)>0,\"H\",IF(O$7=\"Sun\",\"H\",IFERROR(VLOOKUP($D13&\"-\"&O$8&\"\",pks_3!$A$1:$E$21,5,0),\"P\")))))","v":"P"},{"$f":"IF(P$8>TODAY(),\"\",IF($C13=\"\",\"\",IF(COUNTIF(Date,P$8)>0,\"H\",IF(P$7=\"Sun\",\"H\",IFERROR(VLOOKUP($D13&\"-\"&P$8&\"\",pks_3!$A$1:$E$21,5,0),\"P\")))))","v":"P"},{"$f":"IF(Q$8>TODAY(),\"\",IF($C13=\"\",\"\",IF(COUNTIF(Date,Q$8)>0,\"H\",IF(Q$7=\"Sun\",\"H\",IFERROR(VLOOKUP($D13&\"-\"&Q$8&\"\",pks_3!$A$1:$E$21,5,0),\"P\")))))","v":"P"},{"$f":"IF(R$8>TODAY(),\"\",IF($C13=\"\",\"\",IF(COUNTIF(Date,R$8)>0,\"H\",IF(R$7=\"Sun\",\"H\",IFERROR(VLOOKUP($D13&\"-\"&R$8&\"\",pks_3!$A$1:$E$21,5,0),\"P\")))))","v":"P"},{"$f":"IF(S$8>TODAY(),\"\",IF($C13=\"\",\"\",IF(COUNTIF(Date,S$8)>0,\"H\",IF(S$7=\"Sun\",\"H\",IFERROR(VLOOKUP($D13&\"-\"&S$8&\"\",pks_3!$A$1:$E$21,5,0),\"P\")))))","v":"H"},{"$f":"IF(T$8>TODAY(),\"\",IF($C13=\"\",\"\",IF(COUNTIF(Date,T$8)>0,\"H\",IF(T$7=\"Sun\",\"H\",IFERROR(VLOOKUP($D13&\"-\"&T$8&\"\",pks_3!$A$1:$E$21,5,0),\"P\")))))","v":"P"},{"$f":"IF(U$8>TODAY(),\"\",IF($C13=\"\",\"\",IF(COUNTIF(Date,U$8)>0,\"H\",IF(U$7=\"Sun\",\"H\",IFERROR(VLOOKUP($D13&\"-\"&U$8&\"\",pks_3!$A$1:$E$21,5,0),\"P\")))))","v":"P"},{"$f":"IF(V$8>TODAY(),\"\",IF($C13=\"\",\"\",IF(COUNTIF(Date,V$8)>0,\"H\",IF(V$7=\"Sun\",\"H\",IFERROR(VLOOKUP($D13&\"-\"&V$8&\"\",pks_3!$A$1:$E$21,5,0),\"P\")))))","v":"P"},{"$f":"IF(W$8>TODAY(),\"\",IF($C13=\"\",\"\",IF(COUNTIF(Date,W$8)>0,\"H\",IF(W$7=\"Sun\",\"H\",IFERROR(VLOOKUP($D13&\"-\"&W$8&\"\",pks_3!$A$1:$E$21,5,0),\"P\")))))","v":"P"},{"$f":"IF(X$8>TODAY(),\"\",IF($C13=\"\",\"\",IF(COUNTIF(Date,X$8)>0,\"H\",IF(X$7=\"Sun\",\"H\",IFERROR(VLOOKUP($D13&\"-\"&X$8&\"\",pks_3!$A$1:$E$21,5,0),\"P\")))))","v":"P"},{"$f":"IF(Y$8>TODAY(),\"\",IF($C13=\"\",\"\",IF(COUNTIF(Date,Y$8)>0,\"H\",IF(Y$7=\"Sun\",\"H\",IFERROR(VLOOKUP($D13&\"-\"&Y$8&\"\",pks_3!$A$1:$E$21,5,0),\"P\")))))","v":"P"},{"$f":"IF(Z$8>TODAY(),\"\",IF($C13=\"\",\"\",IF(COUNTIF(Date,Z$8)>0,\"H\",IF(Z$7=\"Sun\",\"H\",IFERROR(VLOOKUP($D13&\"-\"&Z$8&\"\",pks_3!$A$1:$E$21,5,0),\"P\")))))","v":"H"},{"$f":"IF(AA$8>TODAY(),\"\",IF($C13=\"\",\"\",IF(COUNTIF(Date,AA$8)>0,\"H\",IF(AA$7=\"Sun\",\"H\",IFERROR(VLOOKUP($D13&\"-\"&AA$8&\"\",pks_3!$A$1:$E$21,5,0),\"P\")))))","v":"P"},{"$f":"IF(AB$8>TODAY(),\"\",IF($C13=\"\",\"\",IF(COUNTIF(Date,AB$8)>0,\"H\",IF(AB$7=\"Sun\",\"H\",IFERROR(VLOOKUP($D13&\"-\"&AB$8&\"\",pks_3!$A$1:$E$21,5,0),\"P\")))))","v":"P"},{"$f":"IF(AC$8>TODAY(),\"\",IF($C13=\"\",\"\",IF(COUNTIF(Date,AC$8)>0,\"H\",IF(AC$7=\"Sun\",\"H\",IFERROR(VLOOKUP($D13&\"-\"&AC$8&\"\",pks_3!$A$1:$E$21,5,0),\"P\")))))","v":"P"},{"$f":"IF(AD$8>TODAY(),\"\",IF($C13=\"\",\"\",IF(COUNTIF(Date,AD$8)>0,\"H\",IF(AD$7=\"Sun\",\"H\",IFERROR(VLOOKUP($D13&\"-\"&AD$8&\"\",pks_3!$A$1:$E$21,5,0),\"P\")))))","v":"P"},{"$f":"IF(AE$8>TODAY(),\"\",IF($C13=\"\",\"\",IF(COUNTIF(Date,AE$8)>0,\"H\",IF(AE$7=\"Sun\",\"H\",IFERROR(VLOOKUP($D13&\"-\"&AE$8&\"\",pks_3!$A$1:$E$21,5,0),\"P\")))))","v":"P"},{"$f":"IF(AF$8>TODAY(),\"\",IF($C13=\"\",\"\",IF(COUNTIF(Date,AF$8)>0,\"H\",IF(AF$7=\"Sun\",\"H\",IFERROR(VLOOKUP($D13&\"-\"&AF$8&\"\",pks_3!$A$1:$E$21,5,0),\"P\")))))","v":"P"},{"$f":"IF(AG$8>TODAY(),\"\",IF($C13=\"\",\"\",IF(COUNTIF(Date,AG$8)>0,\"H\",IF(AG$7=\"Sun\",\"H\",IFERROR(VLOOKUP($D13&\"-\"&AG$8&\"\",pks_3!$A$1:$E$21,5,0),\"P\")))))","v":"H"},{"$f":"IF(AH$8>TODAY(),\"\",IF($C13=\"\",\"\",IF(COUNTIF(Date,AH$8)>0,\"H\",IF(AH$7=\"Sun\",\"H\",IFERROR(VLOOKUP($D13&\"-\"&AH$8&\"\",pks_3!$A$1:$E$21,5,0),\"P\")))))","v":"P"},{"$f":"IF(AI$8>TODAY(),\"\",IF($C13=\"\",\"\",IF(COUNTIF(Date,AI$8)>0,\"H\",IF(AI$7=\"Sun\",\"H\",IFERROR(VLOOKUP($D13&\"-\"&AI$8&\"\",pks_3!$A$1:$E$21,5,0),\"P\")))))","v":"P"},26,0,0,0]
[null,{"$f":"IF(C14=\"\",\"\",COUNTA($C$9:C14))","v":""},null,null,{"$f":"IF(E$8>TODAY(),\"\",IF($C14=\"\",\"\",IF(COUNTIF(Date,E$8)>0,\"H\",IF(E$7=\"Sun\",\"H\",IFERROR(VLOOKUP($D14&\"-\"&E$8&\"\",pks_3!$A$1:$E$21,5,0),\"P\")))))","v":""},{"$f":"IF(F$8>TODAY(),\"\",IF($C14=\"\",\"\",IF(COUNTIF(Date,F$8)>0,\"H\",IF(F$7=\"Sun\",\"H\",IFERROR(VLOOKUP($D14&\"-\"&F$8&\"\",pks_3!$A$1:$E$21,5,0),\"P\")))))","v":""},{"$f":"IF(G$8>TODAY(),\"\",IF($C14=\"\",\"\",IF(COUNTIF(Date,G$8)>0,\"H\",IF(G$7=\"Sun\",\"H\",IFERROR(VLOOKUP($D14&\"-\"&G$8&\"\",pks_3!$A$1:$E$21,5,0),\"P\")))))","v":""},{"$f":"IF(H$8>TODAY(),\"\",IF($C14=\"\",\"\",IF(COUNTIF(Date,H$8)>0,\"H\",IF(H$7=\"Sun\",\"H\",IFERROR(VLOOKUP($D14&\"-\"&H$8&\"\",pks_3!$A$1:$E$21,5,0),\"P\")))))","v":""},{"$f":"IF(I$8>TODAY(),\"\",IF($C14=\"\",\"\",IF(COUNTIF(Date,I$8)>0,\"H\",IF(I$7=\"Sun\",\"H\",IFERROR(VLOOKUP($D14&\"-\"&I$8&\"\",pks_3!$A$1:$E$21,5,0),\"P\")))))","v":""},{"$f":"IF(J$8>TODAY(),\"\",IF($C14=\"\",\"\",IF(COUNTIF(Date,J$8)>0,\"H\",IF(J$7=\"Sun\",\"H\",IFERROR(VLOOKUP($D14&\"-\"&J$8&\"\",pks_3!$A$1:$E$21,5,0),\"P\")))))","v":""},{"$f":"IF(K$8>TODAY(),\"\",IF($C14=\"\",\"\",IF(COUNTIF(Date,K$8)>0,\"H\",IF(K$7=\"Sun\",\"H\",IFERROR(VLOOKUP($D14&\"-\"&K$8&\"\",pks_3!$A$1:$E$21,5,0),\"P\")))))","v":""},{"$f":"IF(L$8>TODAY(),\"\",IF($C14=\"\",\"\",IF(COUNTIF(Date,L$8)>0,\"H\",IF(L$7=\"Sun\",\"H\",IFERROR(VLOOKUP($D14&\"-\"&L$8&\"\",pks_3!$A$1:$E$21,5,0),\"P\")))))","v":""},{"$f":"IF(M$8>TODAY(),\"\",IF($C14=\"\",\"\",IF(COUNTIF(Date,M$8)>0,\"H\",IF(M$7=\"Sun\",\"H\",IFERROR(VLOOKUP($D14&\"-\"&M$8&\"\",pks_3!$A$1:$E$21,5,0),\"P\")))))","v":""},{"$f":"IF(N$8>TODAY(),\"\",IF($C14=\"\",\"\",IF(COUNTIF(Date,N$8)>0,\"H\",IF(N$7=\"Sun\",\"H\",IFERROR(VLOOKUP($D14&\"-\"&N$8&\"\",pks_3!$A$1:$E$21,5,0),\"P\")))))","v":""},{"$f":"IF(O$8>TODAY(),\"\",IF($C14=\"\",\"\",IF(COUNTIF(Date,O$8)>0,\"H\",IF(O$7=\"Sun\",\"H\",IFERROR(VLOOKUP($D14&\"-\"&O$8&\"\",pks_3!$A$1:$E$21,5,0),\"P\")))))","v":""},{"$f":"IF(P$8>TODAY(),\"\",IF($C14=\"\",\"\",IF(COUNTIF(Date,P$8)>0,\"H\",IF(P$7=\"Sun\",\"H\",IFERROR(VLOOKUP($D14&\"-\"&P$8&\"\",pks_3!$A$1:$E$21,5,0),\"P\")))))","v":""},{"$f":"IF(Q$8>TODAY(),\"\",IF($C14=\"\",\"\",IF(COUNTIF(Date,Q$8)>0,\"H\",IF(Q$7=\"Sun\",\"H\",IFERROR(VLOOKUP($D14&\"-\"&Q$8&\"\",pks_3!$A$1:$E$21,5,0),\"P\")))))","v":""},{"$f":"IF(R$8>TODAY(),\"\",IF($C14=\"\",\"\",IF(COUNTIF(Date,R$8)>0,\"H\",IF(R$7=\"Sun\",\"H\",IFERROR(VLOOKUP($D14&\"-\"&R$8&\"\",pks_3!$A$1:$E$21,5,0),\"P\")))))","v":""},{"$f":"IF(S$8>TODAY(),\"\",IF($C14=\"\",\"\",IF(COUNTIF(Date,S$8)>0,\"H\",IF(S$7=\"Sun\",\"H\",IFERROR(VLOOKUP($D14&\"-\"&S$8&\"\",pks_3!$A$1:$E$21,5,0),\"P\")))))","v":""},{"$f":"IF(T$8>TODAY(),\"\",IF($C14=\"\",\"\",IF(COUNTIF(Date,T$8)>0,\"H\",IF(T$7=\"Sun\",\"H\",IFERROR(VLOOKUP($D14&\"-\"&T$8&\"\",pks_3!$A$1:$E$21,5,0),\"P\")))))","v":""},{"$f":"IF(U$8>TODAY(),\"\",IF($C14=\"\",\"\",IF(COUNTIF(Date,U$8)>0,\"H\",IF(U$7=\"Sun\",\"H\",IFERROR(VLOOKUP($D14&\"-\"&U$8&\"\",pks_3!$A$1:$E$21,5,0),\"P\")))))","v":""},{"$f":"IF(V$8>TODAY(),\"\",IF($C14=\"\",\"\",IF(COUNTIF(Date,V$8)>0,\"H\",IF(V$7=\"Sun\",\"H\",IFERROR(VLOOKUP($D14&\"-\"&V$8&\"\",pks_3!$A$1:$E$21,5,0),\"P\")))))","v":""},{"$f":"IF(W$8>TODAY(),\"\",IF($C14=\"\",\"\",IF(COUNTIF(Date,W$8)>0,\"H\",IF(W$7=\"Sun\",\"H\",IFERROR(VLOOKUP($D14&\"-\"&W$8&\"\",pks_3!$A$1:$E$21,5,0),\"P\")))))","v":""},{"$f":"IF(X$8>TODAY(),\"\",IF($C14=\"\",\"\",IF(COUNTIF(Date,X$8)>0,\"H\",IF(X$7=\"Sun\",\"H\",IFERROR(VLOOKUP($D14&\"-\"&X$8&\"\",pks_3!$A$1:$E$21,5,0),\"P\")))))","v":""},{"$f":"IF(Y$8>TODAY(),\"\",IF($C14=\"\",\"\",IF(COUNTIF(Date,Y$8)>0,\"H\",IF(Y$7=\"Sun\",\"H\",IFERROR(VLOOKUP($D14&\"-\"&Y$8&\"\",pks_3!$A$1:$E$21,5,0),\"P\")))))","v":""},{"$f":"IF(Z$8>TODAY(),\"\",IF($C14=\"\",\"\",IF(COUNTIF(Date,Z$8)>0,\"H\",IF(Z$7=\"Sun\",\"H\",IFERROR(VLOOKUP($D14&\"-\"&Z$8&\"\",pks_3!$A$1:$E$21,5,0),\"P\")))))","v":""},{"$f":"IF(AA$8>TODAY(),\"\",IF($C14=\"\",\"\",IF(COUNTIF(Date,AA$8)>0,\"H\",IF(AA$7=\"Sun\",\"H\",IFERROR(VLOOKUP($D14&\"-\"&AA$8&\"\",pks_3!$A$1:$E$21,5,0),\"P\")))))","v":""},{"$f":"IF(AB$8>TODAY(),\"\",IF($C14=\"\",\"\",IF(COUNTIF(Date,AB$8)>0,\"H\",IF(AB$7=\"Sun\",\"H\",IFERROR(VLOOKUP($D14&\"-\"&AB$8&\"\",pks_3!$A$1:$E$21,5,0),\"P\")))))","v":""},{"$f":"IF(AC$8>TODAY(),\"\",IF($C14=\"\",\"\",IF(COUNTIF(Date,AC$8)>0,\"H\",IF(AC$7=\"Sun\",\"H\",IFERROR(VLOOKUP($D14&\"-\"&AC$8&\"\",pks_3!$A$1:$E$21,5,0),\"P\")))))","v":""},{"$f":"IF(AD$8>TODAY(),\"\",IF($C14=\"\",\"\",IF(COUNTIF(Date,AD$8)>0,\"H\",IF(AD$7=\"Sun\",\"H\",IFERROR(VLOOKUP($D14&\"-\"&AD$8&\"\",pks_3!$A$1:$E$21,5,0),\"P\")))))","v":""},{"$f":"IF(AE$8>TODAY(),\"\",IF($C14=\"\",\"\",IF(COUNTIF(Date,AE$8)>0,\"H\",IF(AE$7=\"Sun\",\"H\",IFERROR(VLOOKUP($D14&\"-\"&AE$8&\"\",pks_3!$A$1:$E$21,5,0),\"P\")))))","v":""},{"$f":"IF(AF$8>TODAY(),\"\",IF($C14=\"\",\"\",IF(COUNTIF(Date,AF$8)>0,\"H\",IF(AF$7=\"Sun\",\"H\",IFERROR(VLOOKUP($D14&\"-\"&AF$8&\"\",pks_3!$A$1:$E$21,5,0),\"P\")))))","v":""},{"$f":"IF(AG$8>TODAY(),\"\",IF($C14=\"\",\"\",IF(COUNTIF(Date,AG$8)>0,\"H\",IF(AG$7=\"Sun\",\"H\",IFERROR(VLOOKUP($D14&\"-\"&AG$8&\"\",pks_3!$A$1:$E$21,5,0),\"P\")))))","v":""},{"$f":"IF(AH$8>TODAY(),\"\",IF($C14=\"\",\"\",IF(COUNTIF(Date,AH$8)>0,\"H\",IF(AH$7=\"Sun\",\"H\",IFERROR(VLOOKUP($D14&\"-\"&AH$8&\"\",pks_3!$A$1:$E$21,5,0),\"P\")))))","v":""},{"$f":"IF(AI$8>TODAY(),\"\",IF($C14=\"\",\"\",IF(COUNTIF(Date,AI$8)>0,\"H\",IF(AI$7=\"Sun\",\"H\",IFERROR(VLOOKUP($D14&\"-\"&AI$8&\"\",pks_3!$A$1:$E$21,5,0),\"P\")))))","v":""},0,0,0,0]
[null,{"$f":"IF(C15=\"\",\"\",COUNTA($C$9:C15))","v":""},null,null,{"$f":"IF(E$8>TODAY(),\"\",IF($C15=\"\",\"\",IF(COUNTIF(Date,E$8)>0,\"H\",IF(E$7=\"Sun\",\"H\",IFERROR(VLOOKUP($D15&\"-\"&E$8&\"\",pks_3!$A$1:$E$21,5,0),\"P\")))))","v":""},{"$f":"IF(F$8>TODAY(),\"\",IF($C15=\"\",\"\",IF(COUNTIF(Date,F$8)>0,\"H\",IF(F$7=\"Sun\",\"H\",IFERROR(VLOOKUP($D15&\"-\"&F$8&\"\",pks_3!$A$1:$E$21,5,0),\"P\")))))","v":""},{"$f":"IF(G$8>TODAY(),\"\",IF($C15=\"\",\"\",IF(COUNTIF(Date,G$8)>0,\"H\",IF(G$7=\"Sun\",\"H\",IFERROR(VLOOKUP($D15&\"-\"&G$8&\"\",pks_3!$A$1:$E$21,5,0),\"P\")))))","v":""},{"$f":"IF(H$8>TODAY(),\"\",IF($C15=\"\",\"\",IF(COUNTIF(Date,H$8)>0,\"H\",IF(H$7=\"Sun\",\"H\",IFERROR(VLOOKUP($D15&\"-\"&H$8&\"\",pks_3!$A$1:$E$21,5,0),\"P\")))))","v":""},{"$f":"IF(I$8>TODAY(),\"\",IF($C15=\"\",\"\",IF(COUNTIF(Date,I$8)>0,\"H\",IF(I$7=\"Sun\",\"H\",IFERROR(VLOOKUP($D15&\"-\"&I$8&\"\",pks_3!$A$1:$E$21,5,0),\"P\")))))","v":""},{"$f":"IF(J$8>TODAY(),\"\",IF($C15=\"\",\"\",IF(COUNTIF(Date,J$8)>0,\"H\",IF(J$7=\"Sun\",\"H\",IFERROR(VLOOKUP($D15&\"-\"&J$8&\"\",pks_3!$A$1:$E$21,5,0),\"P\")))))","v":""},{"$f":"IF(K$8>TODAY(),\"\",IF($C15=\"\",\"\",IF(COUNTIF(Date,K$8)>0,\"H\",IF(K$7=\"Sun\",\"H\",IFERROR(VLOOKUP($D15&\"-\"&K$8&\"\",pks_3!$A$1:$E$21,5,0),\"P\")))))","v":""},{"$f":"IF(L$8>TODAY(),\"\",IF($C15=\"\",\"\",IF(COUNTIF(Date,L$8)>0,\"H\",IF(L$7=\"Sun\",\"H\",IFERROR(VLOOKUP($D15&\"-\"&L$8&\"\",pks_3!$A$1:$E$21,5,0),\"P\")))))","v":""},{"$f":"IF(M$8>TODAY(),\"\",IF($C15=\"\",\"\",IF(COUNTIF(Date,M$8)>0,\"H\",IF(M$7=\"Sun\",\"H\",IFERROR(VLOOKUP($D15&\"-\"&M$8&\"\",pks_3!$A$1:$E$21,5,0),\"P\")))))","v":""},{"$f":"IF(N$8>TODAY(),\"\",IF($C15=\"\",\"\",IF(COUNTIF(Date,N$8)>0,\"H\",IF(N$7=\"Sun\",\"H\",IFERROR(VLOOKUP($D15&\"-\"&N$8&\"\",pks_3!$A$1:$E$21,5,0),\"P\")))))","v":""},{"$f":"IF(O$8>TODAY(),\"\",IF($C15=\"\",\"\",IF(COUNTIF(Date,O$8)>0,\"H\",IF(O$7=\"Sun\",\"H\",IFERROR(VLOOKUP($D15&\"-\"&O$8&\"\",pks_3!$A$1:$E$21,5,0),\"P\")))))","v":""},{"$f":"IF(P$8>TODAY(),\"\",IF($C15=\"\",\"\",IF(COUNTIF(Date,P$8)>0,\"H\",IF(P$7=\"Sun\",\"H\",IFERROR(VLOOKUP($D15&\"-\"&P$8&\"\",pks_3!$A$1:$E$21,5,0),\"P\")))))","v":""},{"$f":"IF(Q$8>TODAY(),\"\",IF($C15=\"\",\"\",IF(COUNTIF(Date,Q$8)>0,\"H\",IF(Q$7=\"Sun\",\"H\",IFERROR(VLOOKUP($D15&\"-\"&Q$8&\"\",pks_3!$A$1:$E$21,5,0),\"P\")))))","v":""},{"$f":"IF(R$8>TODAY(),\"\",IF($C15=\"\",\"\",IF(COUNTIF(Date,R$8)>0,\"H\",IF(R$7=\"Sun\",\"H\",IFERROR(VLOOKUP($D15&\"-\"&R$8&\"\",pks_3!$A$1:$E$21,5,0),\"P\")))))","v":""},{"$f":"IF(S$8>TODAY(),\"\",IF($C15=\"\",\"\",IF(COUNTIF(Date,S$8)>0,\"H\",IF(S$7=\"Sun\",\"H\",IFERROR(VLOOKUP($D15&\"-\"&S$8&\"\",pks_3!$A$1:$E$21,5,0),\"P\")))))","v":""},{"$f":"IF(T$8>TODAY(),\"\",IF($C15=\"\",\"\",IF(COUNTIF(Date,T$8)>0,\"H\",IF(T$7=\"Sun\",\"H\",IFERROR(VLOOKUP($D15&\"-\"&T$8&\"\",pks_3!$A$1:$E$21,5,0),\"P\")))))","v":""},{"$f":"IF(U$8>TODAY(),\"\",IF($C15=\"\",\"\",IF(COUNTIF(Date,U$8)>0,\"H\",IF(U$7=\"Sun\",\"H\",IFERROR(VLOOKUP($D15&\"-\"&U$8&\"\",pks_3!$A$1:$E$21,5,0),\"P\")))))","v":""},{"$f":"IF(V$8>TODAY(),\"\",IF($C15=\"\",\"\",IF(COUNTIF(Date,V$8)>0,\"H\",IF(V$7=\"Sun\",\"H\",IFERROR(VLOOKUP($D15&\"-\"&V$8&\"\",pks_3!$A$1:$E$21,5,0),\"P\")))))","v":""},{"$f":"IF(W$8>TODAY(),\"\",IF($C15=\"\",\"\",IF(COUNTIF(Date,W$8)>0,\"H\",IF(W$7=\"Sun\",\"H\",IFERROR(VLOOKUP($D15&\"-\"&W$8&\"\",pks_3!$A$1:$E$21,5,0),\"P\")))))","v":""},{"$f":"IF(X$8>TODAY(),\"\",IF($C15=\"\",\"\",IF(COUNTIF(Date,X$8)>0,\"H\",IF(X$7=\"Sun\",\"H\",IFERROR(VLOOKUP($D15&\"-\"&X$8&\"\",pks_3!$A$1:$E$21,5,0),\"P\")))))","v":""},{"$f":"IF(Y$8>TODAY(),\"\",IF($C15=\"\",\"\",IF(COUNTIF(Date,Y$8)>0,\"H\",IF(Y$7=\"Sun\",\"H\",IFERROR(VLOOKUP($D15&\"-\"&Y$8&\"\",pks_3!$A$1:$E$21,5,0),\"P\")))))","v":""},{"$f":"IF(Z$8>TODAY(),\"\",IF($C15=\"\",\"\",IF(COUNTIF(Date,Z$8)>0,\"H\",IF(Z$7=\"Sun\",\"H\",IFERROR(VLOOKUP($D15&\"-\"&Z$8&\"\",pks_3!$A$1:$E$21,5,0),\"P\")))))","v":""},{"$f":"IF(AA$8>TODAY(),\"\",IF($C15=\"\",\"\",IF(COUNTIF(Date,AA$8)>0,\"H\",IF(AA$7=\"Sun\",\"H\",IFERROR(VLOOKUP($D15&\"-\"&AA$8&\"\",pks_3!$A$1:$E$21,5,0),\"P\")))))","v":""},{"$f":"IF(AB$8>TODAY(),\"\",IF($C15=\"\",\"\",IF(COUNTIF(Date,AB$8)>0,\"H\",IF(AB$7=\"Sun\",\"H\",IFERROR(VLOOKUP($D15&\"-\"&AB$8&\"\",pks_3!$A$1:$E$21,5,0),\"P\")))))","v":""},{"$f":"IF(AC$8>TODAY(),\"\",IF($C15=\"\",\"\",IF(COUNTIF(Date,AC$8)>0,\"H\",IF(AC$7=\"Sun\",\"H\",IFERROR(VLOOKUP($D15&\"-\"&AC$8&\"\",pks_3!$A$1:$E$21,5,0),\"P\")))))","v":""},{"$f":"IF(AD$8>TODAY(),\"\",IF($C15=\"\",\"\",IF(COUNTIF(Date,AD$8)>0,\"H\",IF(AD$7=\"Sun\",\"H\",IFERROR(VLOOKUP($D15&\"-\"&AD$8&\"\",pks_3!$A$1:$E$21,5,0),\"P\")))))","v":""},{"$f":"IF(AE$8>TODAY(),\"\",IF($C15=\"\",\"\",IF(COUNTIF(Date,AE$8)>0,\"H\",IF(AE$7=\"Sun\",\"H\",IFERROR(VLOOKUP($D15&\"-\"&AE$8&\"\",pks_3!$A$1:$E$21,5,0),\"P\")))))","v":""},{"$f":"IF(AF$8>TODAY(),\"\",IF($C15=\"\",\"\",IF(COUNTIF(Date,AF$8)>0,\"H\",IF(AF$7=\"Sun\",\"H\",IFERROR(VLOOKUP($D15&\"-\"&AF$8&\"\",pks_3!$A$1:$E$21,5,0),\"P\")))))","v":""},{"$f":"IF(AG$8>TODAY(),\"\",IF($C15=\"\",\"\",IF(COUNTIF(Date,AG$8)>0,\"H\",IF(AG$7=\"Sun\",\"H\",IFERROR(VLOOKUP($D15&\"-\"&AG$8&\"\",pks_3!$A$1:$E$21,5,0),\"P\")))))","v":""},{"$f":"IF(AH$8>TODAY(),\"\",IF($C15=\"\",\"\",IF(COUNTIF(Date,AH$8)>0,\"H\",IF(AH$7=\"Sun\",\"H\",IFERROR(VLOOKUP($D15&\"-\"&AH$8&\"\",pks_3!$A$1:$E$21,5,0),\"P\")))))","v":""},{"$f":"IF(AI$8>TODAY(),\"\",IF($C15=\"\",\"\",IF(COUNTIF(Date,AI$8)>0,\"H\",IF(AI$7=\"Sun\",\"H\",IFERROR(VLOOKUP($D15&\"-\"&AI$8&\"\",pks_3!$A$1:$E$21,5,0),\"P\")))))","v":""},0,0,0,0]
[null,{"$f":"IF(C16=\"\",\"\",COUNTA($C$9:C16))","v":""},null,null,{"$f":"IF(E$8>TODAY(),\"\",IF($C16=\"\",\"\",IF(COUNTIF(Date,E$8)>0,\"H\",IF(E$7=\"Sun\",\"H\",IFERROR(VLOOKUP($D16&\"-\"&E$8&\"\",pks_3!$A$1:$E$21,5,0),\"P\")))))","v":""},{"$f":"IF(F$8>TODAY(),\"\",IF($C16=\"\",\"\",IF(COUNTIF(Date,F$8)>0,\"H\",IF(F$7=\"Sun\",\"H\",IFERROR(VLOOKUP($D16&\"-\"&F$8&\"\",pks_3!$A$1:$E$21,5,0),\"P\")))))","v":""},{"$f":"IF(G$8>TODAY(),\"\",IF($C16=\"\",\"\",IF(COUNTIF(Date,G$8)>0,\"H\",IF(G$7=\"Sun\",\"H\",IFERROR(VLOOKUP($D16&\"-\"&G$8&\"\",pks_3!$A$1:$E$21,5,0),\"P\")))))","v":""},{"$f":"IF(H$8>TODAY(),\"\",IF($C16=\"\",\"\",IF(COUNTIF(Date,H$8)>0,\"H\",IF(H$7=\"Sun\",\"H\",IFERROR(VLOOKUP($D16&\"-\"&H$8&\"\",pks_3!$A$1:$E$21,5,0),\"P\")))))","v":""},{"$f":"IF(I$8>TODAY(),\"\",IF($C16=\"\",\"\",IF(COUNTIF(Date,I$8)>0,\"H\",IF(I$7=\"Sun\",\"H\",IFERROR(VLOOKUP($D16&\"-\"&I$8&\"\",pks_3!$A$1:$E$21,5,0),\"P\")))))","v":""},{"$f":"IF(J$8>TODAY(),\"\",IF($C16=\"\",\"\",IF(COUNTIF(Date,J$8)>0,\"H\",IF(J$7=\"Sun\",\"H\",IFERROR(VLOOKUP($D16&\"-\"&J$8&\"\",pks_3!$A$1:$E$21,5,0),\"P\")))))","v":""},{"$f":"IF(K$8>TODAY(),\"\",IF($C16=\"\",\"\",IF(COUNTIF(Date,K$8)>0,\"H\",IF(K$7=\"Sun\",\"H\",IFERROR(VLOOKUP($D16&\"-\"&K$8&\"\",pks_3!$A$1:$E$21,5,0),\"P\")))))","v":""},{"$f":"IF(L$8>TODAY(),\"\",IF($C16=\"\",\"\",IF(COUNTIF(Date,L$8)>0,\"H\",IF(L$7=\"Sun\",\"H\",IFERROR(VLOOKUP($D16&\"-\"&L$8&\"\",pks_3!$A$1:$E$21,5,0),\"P\")))))","v":""},{"$f":"IF(M$8>TODAY(),\"\",IF($C16=\"\",\"\",IF(COUNTIF(Date,M$8)>0,\"H\",IF(M$7=\"Sun\",\"H\",IFERROR(VLOOKUP($D16&\"-\"&M$8&\"\",pks_3!$A$1:$E$21,5,0),\"P\")))))","v":""},{"$f":"IF(N$8>TODAY(),\"\",IF($C16=\"\",\"\",IF(COUNTIF(Date,N$8)>0,\"H\",IF(N$7=\"Sun\",\"H\",IFERROR(VLOOKUP($D16&\"-\"&N$8&\"\",pks_3!$A$1:$E$21,5,0),\"P\")))))","v":""},{"$f":"IF(O$8>TODAY(),\"\",IF($C16=\"\",\"\",IF(COUNTIF(Date,O$8)>0,\"H\",IF(O$7=\"Sun\",\"H\",IFERROR(VLOOKUP($D16&\"-\"&O$8&\"\",pks_3!$A$1:$E$21,5,0),\"P\")))))","v":""},{"$f":"IF(P$8>TODAY(),\"\",IF($C16=\"\",\"\",IF(COUNTIF(Date,P$8)>0,\"H\",IF(P$7=\"Sun\",\"H\",IFERROR(VLOOKUP($D16&\"-\"&P$8&\"\",pks_3!$A$1:$E$21,5,0),\"P\")))))","v":""},{"$f":"IF(Q$8>TODAY(),\"\",IF($C16=\"\",\"\",IF(COUNTIF(Date,Q$8)>0,\"H\",IF(Q$7=\"Sun\",\"H\",IFERROR(VLOOKUP($D16&\"-\"&Q$8&\"\",pks_3!$A$1:$E$21,5,0),\"P\")))))","v":""},{"$f":"IF(R$8>TODAY(),\"\",IF($C16=\"\",\"\",IF(COUNTIF(Date,R$8)>0,\"H\",IF(R$7=\"Sun\",\"H\",IFERROR(VLOOKUP($D16&\"-\"&R$8&\"\",pks_3!$A$1:$E$21,5,0),\"P\")))))","v":""},{"$f":"IF(S$8>TODAY(),\"\",IF($C16=\"\",\"\",IF(COUNTIF(Date,S$8)>0,\"H\",IF(S$7=\"Sun\",\"H\",IFERROR(VLOOKUP($D16&\"-\"&S$8&\"\",pks_3!$A$1:$E$21,5,0),\"P\")))))","v":""},{"$f":"IF(T$8>TODAY(),\"\",IF($C16=\"\",\"\",IF(COUNTIF(Date,T$8)>0,\"H\",IF(T$7=\"Sun\",\"H\",IFERROR(VLOOKUP($D16&\"-\"&T$8&\"\",pks_3!$A$1:$E$21,5,0),\"P\")))))","v":""},{"$f":"IF(U$8>TODAY(),\"\",IF($C16=\"\",\"\",IF(COUNTIF(Date,U$8)>0,\"H\",IF(U$7=\"Sun\",\"H\",IFERROR(VLOOKUP($D16&\"-\"&U$8&\"\",pks_3!$A$1:$E$21,5,0),\"P\")))))","v":""},{"$f":"IF(V$8>TODAY(),\"\",IF($C16=\"\",\"\",IF(COUNTIF(Date,V$8)>0,\"H\",IF(V$7=\"Sun\",\"H\",IFERROR(VLOOKUP($D16&\"-\"&V$8&\"\",pks_3!$A$1:$E$21,5,0),\"P\")))))","v":""},{"$f":"IF(W$8>TODAY(),\"\",IF($C16=\"\",\"\",IF(COUNTIF(Date,W$8)>0,\"H\",IF(W$7=\"Sun\",\"H\",IFERROR(VLOOKUP($D16&\"-\"&W$8&\"\",pks_3!$A$1:$E$21,5,0),\"P\")))))","v":""},{"$f":"IF(X$8>TODAY(),\"\",IF($C16=\"\",\"\",IF(COUNTIF(Date,X$8)>0,\"H\",IF(X$7=\"Sun\",\"H\",IFERROR(VLOOKUP($D16&\"-\"&X$8&\"\",pks_3!$A$1:$E$21,5,0),\"P\")))))","v":""},{"$f":"IF(Y$8>TODAY(),\"\",IF($C16=\"\",\"\",IF(COUNTIF(Date,Y$8)>0,\"H\",IF(Y$7=\"Sun\",\"H\",IFERROR(VLOOKUP($D16&\"-\"&Y$8&\"\",pks_3!$A$1:$E$21,5,0),\"P\")))))","v":""},{"$f":"IF(Z$8>TODAY(),\"\",IF($C16=\"\",\"\",IF(COUNTIF(Date,Z$8)>0,\"H\",IF(Z$7=\"Sun\",\"H\",IFERROR(VLOOKUP($D16&\"-\"&Z$8&\"\",pks_3!$A$1:$E$21,5,0),\"P\")))))","v":""},{"$f":"IF(AA$8>TODAY(),\"\",IF($C16=\"\",\"\",IF(COUNTIF(Date,AA$8)>0,\"H\",IF(AA$7=\"Sun\",\"H\",IFERROR(VLOOKUP($D16&\"-\"&AA$8&\"\",pks_3!$A$1:$E$21,5,0),\"P\")))))","v":""},{"$f":"IF(AB$8>TODAY(),\"\",IF($C16=\"\",\"\",IF(COUNTIF(Date,AB$8)>0,\"H\",IF(AB$7=\"Sun\",\"H\",IFERROR(VLOOKUP($D16&\"-\"&AB$8&\"\",pks_3!$A$1:$E$21,5,0),\"P\")))))","v":""},{"$f":"IF(AC$8>TODAY(),\"\",IF($C16=\"\",\"\",IF(COUNTIF(Date,AC$8)>0,\"H\",IF(AC$7=\"Sun\",\"H\",IFERROR(VLOOKUP($D16&\"-\"&AC$8&\"\",pks_3!$A$1:$E$21,5,0),\"P\")))))","v":""},{"$f":"IF(AD$8>TODAY(),\"\",IF($C16=\"\",\"\",IF(COUNTIF(Date,AD$8)>0,\"H\",IF(AD$7=\"Sun\",\"H\",IFERROR(VLOOKUP($D16&\"-\"&AD$8&\"\",pks_3!$A$1:$E$21,5,0),\"P\")))))","v":""},{"$f":"IF(AE$8>TODAY(),\"\",IF($C16=\"\",\"\",IF(COUNTIF(Date,AE$8)>0,\"H\",IF(AE$7=\"Sun\",\"H\",IFERROR(VLOOKUP($D16&\"-\"&AE$8&\"\",pks_3!$A$1:$E$21,5,0),\"P\")))))","v":""},{"$f":"IF(AF$8>TODAY(),\"\",IF($C16=\"\",\"\",IF(COUNTIF(Date,AF$8)>0,\"H\",IF(AF$7=\"Sun\",\"H\",IFERROR(VLOOKUP($D16&\"-\"&AF$8&\"\",pks_3!$A$1:$E$21,5,0),\"P\")))))","v":""},{"$f":"IF(AG$8>TODAY(),\"\",IF($C16=\"\",\"\",IF(COUNTIF(Date,AG$8)>0,\"H\",IF(AG$7=\"Sun\",\"H\",IFERROR(VLOOKUP($D16&\"-\"&AG$8&\"\",pks_3!$A$1:$E$21,5,0),\"P\")))))","v":""},{"$f":"IF(AH$8>TODAY(),\"\",IF($C16=\"\",\"\",IF(COUNTIF(Date,AH$8)>0,\"H\",IF(AH$7=\"Sun\",\"H\",IFERROR(VLOOKUP($D16&\"-\"&AH$8&\"\",pks_3!$A$1:$E$21,5,0),\"P\")))))","v":""},{"$f":"IF(AI$8>TODAY(),\"\",IF($C16=\"\",\"\",IF(COUNTIF(Date,AI$8)>0,\"H\",IF(AI$7=\"Sun\",\"H\",IFERROR(VLOOKUP($D16&\"-\"&AI$8&\"\",pks_3!$A$1:$E$21,5,0),\"P\")))))","v":""},0,0,0,0]
[null,{"$f":"IF(C17=\"\",\"\",COUNTA($C$9:C17))","v":""},null,null,{"$f":"IF(E$8>TODAY(),\"\",IF($C17=\"\",\"\",IF(COUNTIF(Date,E$8)>0,\"H\",IF(E$7=\"Sun\",\"H\",IFERROR(VLOOKUP($D17&\"-\"&E$8&\"\",pks_3!$A$1:$E$21,5,0),\"P\")))))","v":""},{"$f":"IF(F$8>TODAY(),\"\",IF($C17=\"\",\"\",IF(COUNTIF(Date,F$8)>0,\"H\",IF(F$7=\"Sun\",\"H\",IFERROR(VLOOKUP($D17&\"-\"&F$8&\"\",pks_3!$A$1:$E$21,5,0),\"P\")))))","v":""},{"$f":"IF(G$8>TODAY(),\"\",IF($C17=\"\",\"\",IF(COUNTIF(Date,G$8)>0,\"H\",IF(G$7=\"Sun\",\"H\",IFERROR(VLOOKUP($D17&\"-\"&G$8&\"\",pks_3!$A$1:$E$21,5,0),\"P\")))))","v":""},{"$f":"IF(H$8>TODAY(),\"\",IF($C17=\"\",\"\",IF(COUNTIF(Date,H$8)>0,\"H\",IF(H$7=\"Sun\",\"H\",IFERROR(VLOOKUP($D17&\"-\"&H$8&\"\",pks_3!$A$1:$E$21,5,0),\"P\")))))","v":""},{"$f":"IF(I$8>TODAY(),\"\",IF($C17=\"\",\"\",IF(COUNTIF(Date,I$8)>0,\"H\",IF(I$7=\"Sun\",\"H\",IFERROR(VLOOKUP($D17&\"-\"&I$8&\"\",pks_3!$A$1:$E$21,5,0),\"P\")))))","v":""},{"$f":"IF(J$8>TODAY(),\"\",IF($C17=\"\",\"\",IF(COUNTIF(Date,J$8)>0,\"H\",IF(J$7=\"Sun\",\"H\",IFERROR(VLOOKUP($D17&\"-\"&J$8&\"\",pks_3!$A$1:$E$21,5,0),\"P\")))))","v":""},{"$f":"IF(K$8>TODAY(),\"\",IF($C17=\"\",\"\",IF(COUNTIF(Date,K$8)>0,\"H\",IF(K$7=\"Sun\",\"H\",IFERROR(VLOOKUP($D17&\"-\"&K$8&\"\",pks_3!$A$1:$E$21,5,0),\"P\")))))","v":""},{"$f":"IF(L$8>TODAY(),\"\",IF($C17=\"\",\"\",IF(COUNTIF(Date,L$8)>0,\"H\",IF(L$7=\"Sun\",\"H\",IFERROR(VLOOKUP($D17&\"-\"&L$8&\"\",pks_3!$A$1:$E$21,5,0),\"P\")))))","v":""},{"$f":"IF(M$8>TODAY(),\"\",IF($C17=\"\",\"\",IF(COUNTIF(Date,M$8)>0,\"H\",IF(M$7=\"Sun\",\"H\",IFERROR(VLOOKUP($D17&\"-\"&M$8&\"\",pks_3!$A$1:$E$21,5,0),\"P\")))))","v":""},{"$f":"IF(N$8>TODAY(),\"\",IF($C17=\"\",\"\",IF(COUNTIF(Date,N$8)>0,\"H\",IF(N$7=\"Sun\",\"H\",IFERROR(VLOOKUP($D17&\"-\"&N$8&\"\",pks_3!$A$1:$E$21,5,0),\"P\")))))","v":""},{"$f":"IF(O$8>TODAY(),\"\",IF($C17=\"\",\"\",IF(COUNTIF(Date,O$8)>0,\"H\",IF(O$7=\"Sun\",\"H\",IFERROR(VLOOKUP($D17&\"-\"&O$8&\"\",pks_3!$A$1:$E$21,5,0),\"P\")))))","v":""},{"$f":"IF(P$8>TODAY(),\"\",IF($C17=\"\",\"\",IF(COUNTIF(Date,P$8)>0,\"H\",IF(P$7=\"Sun\",\"H\",IFERROR(VLOOKUP($D17&\"-\"&P$8&\"\",pks_3!$A$1:$E$21,5,0),\"P\")))))","v":""},{"$f":"IF(Q$8>TODAY(),\"\",IF($C17=\"\",\"\",IF(COUNTIF(Date,Q$8)>0,\"H\",IF(Q$7=\"Sun\",\"H\",IFERROR(VLOOKUP($D17&\"-\"&Q$8&\"\",pks_3!$A$1:$E$21,5,0),\"P\")))))","v":""},{"$f":"IF(R$8>TODAY(),\"\",IF($C17=\"\",\"\",IF(COUNTIF(Date,R$8)>0,\"H\",IF(R$7=\"Sun\",\"H\",IFERROR(VLOOKUP($D17&\"-\"&R$8&\"\",pks_3!$A$1:$E$21,5,0),\"P\")))))","v":""},{"$f":"IF(S$8>TODAY(),\"\",IF($C17=\"\",\"\",IF(COUNTIF(Date,S$8)>0,\"H\",IF(S$7=\"Sun\",\"H\",IFERROR(VLOOKUP($D17&\"-\"&S$8&\"\",pks_3!$A$1:$E$21,5,0),\"P\")))))","v":""},{"$f":"IF(T$8>TODAY(),\"\",IF($C17=\"\",\"\",IF(COUNTIF(Date,T$8)>0,\"H\",IF(T$7=\"Sun\",\"H\",IFERROR(VLOOKUP($D17&\"-\"&T$8&\"\",pks_3!$A$1:$E$21,5,0),\"P\")))))","v":""},{"$f":"IF(U$8>TODAY(),\"\",IF($C17=\"\",\"\",IF(COUNTIF(Date,U$8)>0,\"H\",IF(U$7=\"Sun\",\"H\",IFERROR(VLOOKUP($D17&\"-\"&U$8&\"\",pks_3!$A$1:$E$21,5,0),\"P\")))))","v":""},{"$f":"IF(V$8>TODAY(),\"\",IF($C17=\"\",\"\",IF(COUNTIF(Date,V$8)>0,\"H\",IF(V$7=\"Sun\",\"H\",IFERROR(VLOOKUP($D17&\"-\"&V$8&\"\",pks_3!$A$1:$E$21,5,0),\"P\")))))","v":""},{"$f":"IF(W$8>TODAY(),\"\",IF($C17=\"\",\"\",IF(COUNTIF(Date,W$8)>0,\"H\",IF(W$7=\"Sun\",\"H\",IFERROR(VLOOKUP($D17&\"-\"&W$8&\"\",pks_3!$A$1:$E$21,5,0),\"P\")))))","v":""},{"$f":"IF(X$8>TODAY(),\"\",IF($C17=\"\",\"\",IF(COUNTIF(Date,X$8)>0,\"H\",IF(X$7=\"Sun\",\"H\",IFERROR(VLOOKUP($D17&\"-\"&X$8&\"\",pks_3!$A$1:$E$21,5,0),\"P\")))))","v":""},{"$f":"IF(Y$8>TODAY(),\"\",IF($C17=\"\",\"\",IF(COUNTIF(Date,Y$8)>0,\"H\",IF(Y$7=\"Sun\",\"H\",IFERROR(VLOOKUP($D17&\"-\"&Y$8&\"\",pks_3!$A$1:$E$21,5,0),\"P\")))))","v":""},{"$f":"IF(Z$8>TODAY(),\"\",IF($C17=\"\",\"\",IF(COUNTIF(Date,Z$8)>0,\"H\",IF(Z$7=\"Sun\",\"H\",IFERROR(VLOOKUP($D17&\"-\"&Z$8&\"\",pks_3!$A$1:$E$21,5,0),\"P\")))))","v":""},{"$f":"IF(AA$8>TODAY(),\"\",IF($C17=\"\",\"\",IF(COUNTIF(Date,AA$8)>0,\"H\",IF(AA$7=\"Sun\",\"H\",IFERROR(VLOOKUP($D17&\"-\"&AA$8&\"\",pks_3!$A$1:$E$21,5,0),\"P\")))))","v":""},{"$f":"IF(AB$8>TODAY(),\"\",IF($C17=\"\",\"\",IF(COUNTIF(Date,AB$8)>0,\"H\",IF(AB$7=\"Sun\",\"H\",IFERROR(VLOOKUP($D17&\"-\"&AB$8&\"\",pks_3!$A$1:$E$21,5,0),\"P\")))))","v":""},{"$f":"IF(AC$8>TODAY(),\"\",IF($C17=\"\",\"\",IF(COUNTIF(Date,AC$8)>0,\"H\",IF(AC$7=\"Sun\",\"H\",IFERROR(VLOOKUP($D17&\"-\"&AC$8&\"\",pks_3!$A$1:$E$21,5,0),\"P\")))))","v":""},{"$f":"IF(AD$8>TODAY(),\"\",IF($C17=\"\",\"\",IF(COUNTIF(Date,AD$8)>0,\"H\",IF(AD$7=\"Sun\",\"H\",IFERROR(VLOOKUP($D17&\"-\"&AD$8&\"\",pks_3!$A$1:$E$21,5,0),\"P\")))))","v":""},{"$f":"IF(AE$8>TODAY(),\"\",IF($C17=\"\",\"\",IF(COUNTIF(Date,AE$8)>0,\"H\",IF(AE$7=\"Sun\",\"H\",IFERROR(VLOOKUP($D17&\"-\"&AE$8&\"\",pks_3!$A$1:$E$21,5,0),\"P\")))))","v":""},{"$f":"IF(AF$8>TODAY(),\"\",IF($C17=\"\",\"\",IF(COUNTIF(Date,AF$8)>0,\"H\",IF(AF$7=\"Sun\",\"H\",IFERROR(VLOOKUP($D17&\"-\"&AF$8&\"\",pks_3!$A$1:$E$21,5,0),\"P\")))))","v":""},{"$f":"IF(AG$8>TODAY(),\"\",IF($C17=\"\",\"\",IF(COUNTIF(Date,AG$8)>0,\"H\",IF(AG$7=\"Sun\",\"H\",IFERROR(VLOOKUP($D17&\"-\"&AG$8&\"\",pks_3!$A$1:$E$21,5,0),\"P\")))))","v":""},{"$f":"IF(AH$8>TODAY(),\"\",IF($C17=\"\",\"\",IF(COUNTIF(Date,AH$8)>0,\"H\",IF(AH$7=\"Sun\",\"H\",IFERROR(VLOOKUP($D17&\"-\"&AH$8&\"\",pks_3!$A$1:$E$21,5,0),\"P\")))))","v":""},{"$f":"IF(AI$8>TODAY(),\"\",IF($C17=\"\",\"\",IF(COUNTIF(Date,AI$8)>0,\"H\",IF(AI$7=\"Sun\",\"H\",IFERROR(VLOOKUP($D17&\"-\"&AI$8&\"\",pks_3!$A$1:$E$21,5,0),\"P\")))))","v":""},0,0,0,0]
[null,{"$f":"IF(C18=\"\",\"\",COUNTA($C$9:C18))","v":""},null,null,{"$f":"IF(E$8>TODAY(),\"\",IF($C18=\"\",\"\",IF(COUNTIF(Date,E$8)>0,\"H\",IF(E$7=\"Sun\",\"H\",IFERROR(VLOOKUP($D18&\"-\"&E$8&\"\",pks_3!$A$1:$E$21,5,0),\"P\")))))","v":""},{"$f":"IF(F$8>TODAY(),\"\",IF($C18=\"\",\"\",IF(COUNTIF(Date,F$8)>0,\"H\",IF(F$7=\"Sun\",\"H\",IFERROR(VLOOKUP($D18&\"-\"&F$8&\"\",pks_3!$A$1:$E$21,5,0),\"P\")))))","v":""},{"$f":"IF(G$8>TODAY(),\"\",IF($C18=\"\",\"\",IF(COUNTIF(Date,G$8)>0,\"H\",IF(G$7=\"Sun\",\"H\",IFERROR(VLOOKUP($D18&\"-\"&G$8&\"\",pks_3!$A$1:$E$21,5,0),\"P\")))))","v":""},{"$f":"IF(H$8>TODAY(),\"\",IF($C18=\"\",\"\",IF(COUNTIF(Date,H$8)>0,\"H\",IF(H$7=\"Sun\",\"H\",IFERROR(VLOOKUP($D18&\"-\"&H$8&\"\",pks_3!$A$1:$E$21,5,0),\"P\")))))","v":""},{"$f":"IF(I$8>TODAY(),\"\",IF($C18=\"\",\"\",IF(COUNTIF(Date,I$8)>0,\"H\",IF(I$7=\"Sun\",\"H\",IFERROR(VLOOKUP($D18&\"-\"&I$8&\"\",pks_3!$A$1:$E$21,5,0),\"P\")))))","v":""},{"$f":"IF(J$8>TODAY(),\"\",IF($C18=\"\",\"\",IF(COUNTIF(Date,J$8)>0,\"H\",IF(J$7=\"Sun\",\"H\",IFERROR(VLOOKUP($D18&\"-\"&J$8&\"\",pks_3!$A$1:$E$21,5,0),\"P\")))))","v":""},{"$f":"IF(K$8>TODAY(),\"\",IF($C18=\"\",\"\",IF(COUNTIF(Date,K$8)>0,\"H\",IF(K$7=\"Sun\",\"H\",IFERROR(VLOOKUP($D18&\"-\"&K$8&\"\",pks_3!$A$1:$E$21,5,0),\"P\")))))","v":""},{"$f":"IF(L$8>TODAY(),\"\",IF($C18=\"\",\"\",IF(COUNTIF(Date,L$8)>0,\"H\",IF(L$7=\"Sun\",\"H\",IFERROR(VLOOKUP($D18&\"-\"&L$8&\"\",pks_3!$A$1:$E$21,5,0),\"P\")))))","v":""},{"$f":"IF(M$8>TODAY(),\"\",IF($C18=\"\",\"\",IF(COUNTIF(Date,M$8)>0,\"H\",IF(M$7=\"Sun\",\"H\",IFERROR(VLOOKUP($D18&\"-\"&M$8&\"\",pks_3!$A$1:$E$21,5,0),\"P\")))))","v":""},{"$f":"IF(N$8>TODAY(),\"\",IF($C18=\"\",\"\",IF(COUNTIF(Date,N$8)>0,\"H\",IF(N$7=\"Sun\",\"H\",IFERROR(VLOOKUP($D18&\"-\"&N$8&\"\",pks_3!$A$1:$E$21,5,0),\"P\")))))","v":""},{"$f":"IF(O$8>TODAY(),\"\",IF($C18=\"\",\"\",IF(COUNTIF(Date,O$8)>0,\"H\",IF(O$7=\"Sun\",\"H\",IFERROR(VLOOKUP($D18&\"-\"&O$8&\"\",pks_3!$A$1:$E$21,5,0),\"P\")))))","v":""},{"$f":"IF(P$8>TODAY(),\"\",IF($C18=\"\",\"\",IF(COUNTIF(Date,P$8)>0,\"H\",IF(P$7=\"Sun\",\"H\",IFERROR(VLOOKUP($D18&\"-\"&P$8&\"\",pks_3!$A$1:$E$21,5,0),\"P\")))))","v":""},{"$f":"IF(Q$8>TODAY(),\"\",IF($C18=\"\",\"\",IF(COUNTIF(Date,Q$8)>0,\"H\",IF(Q$7=\"Sun\",\"H\",IFERROR(VLOOKUP($D18&\"-\"&Q$8&\"\",pks_3!$A$1:$E$21,5,0),\"P\")))))","v":""},{"$f":"IF(R$8>TODAY(),\"\",IF($C18=\"\",\"\",IF(COUNTIF(Date,R$8)>0,\"H\",IF(R$7=\"Sun\",\"H\",IFERROR(VLOOKUP($D18&\"-\"&R$8&\"\",pks_3!$A$1:$E$21,5,0),\"P\")))))","v":""},{"$f":"IF(S$8>TODAY(),\"\",IF($C18=\"\",\"\",IF(COUNTIF(Date,S$8)>0,\"H\",IF(S$7=\"Sun\",\"H\",IFERROR(VLOOKUP($D18&\"-\"&S$8&\"\",pks_3!$A$1:$E$21,5,0),\"P\")))))","v":""},{"$f":"IF(T$8>TODAY(),\"\",IF($C18=\"\",\"\",IF(COUNTIF(Date,T$8)>0,\"H\",IF(T$7=\"Sun\",\"H\",IFERROR(VLOOKUP($D18&\"-\"&T$8&\"\",pks_3!$A$1:$E$21,5,0),\"P\")))))","v":""},{"$f":"IF(U$8>TODAY(),\"\",IF($C18=\"\",\"\",IF(COUNTIF(Date,U$8)>0,\"H\",IF(U$7=\"Sun\",\"H\",IFERROR(VLOOKUP($D18&\"-\"&U$8&\"\",pks_3!$A$1:$E$21,5,0),\"P\")))))","v":""},{"$f":"IF(V$8>TODAY(),\"\",IF($C18=\"\",\"\",IF(COUNTIF(Date,V$8)>0,\"H\",IF(V$7=\"Sun\",\"H\",IFERROR(VLOOKUP($D18&\"-\"&V$8&\"\",pks_3!$A$1:$E$21,5,0),\"P\")))))","v":""},{"$f":"IF(W$8>TODAY(),\"\",IF($C18=\"\",\"\",IF(COUNTIF(Date,W$8)>0,\"H\",IF(W$7=\"Sun\",\"H\",IFERROR(VLOOKUP($D18&\"-\"&W$8&\"\",pks_3!$A$1:$E$21,5,0),\"P\")))))","v":""},{"$f":"IF(X$8>TODAY(),\"\",IF($C18=\"\",\"\",IF(COUNTIF(Date,X$8)>0,\"H\",IF(X$7=\"Sun\",\"H\",IFERROR(VLOOKUP($D18&\"-\"&X$8&\"\",pks_3!$A$1:$E$21,5,0),\"P\")))))","v":""},{"$f":"IF(Y$8>TODAY(),\"\",IF($C18=\"\",\"\",IF(COUNTIF(Date,Y$8)>0,\"H\",IF(Y$7=\"Sun\",\"H\",IFERROR(VLOOKUP($D18&\"-\"&Y$8&\"\",pks_3!$A$1:$E$21,5,0),\"P\")))))","v":""},{"$f":"IF(Z$8>TODAY(),\"\",IF($C18=\"\",\"\",IF(COUNTIF(Date,Z$8)>0,\"H\",IF(Z$7=\"Sun\",\"H\",IFERROR(VLOOKUP($D18&\"-\"&Z$8&\"\",pks_3!$A$1:$E$21,5,0),\"P\")))))","v":""},{"$f":"IF(AA$8>TODAY(),\"\",IF($C18=\"\",\"\",IF(COUNTIF(Date,AA$8)>0,\"H\",IF(AA$7=\"Sun\",\"H\",IFERROR(VLOOKUP($D18&\"-\"&AA$8&\"\",pks_3!$A$1:$E$21,5,0),\"P\")))))","v":""},{"$f":"IF(AB$8>TODAY(),\"\",IF($C18=\"\",\"\",IF(COUNTIF(Date,AB$8)>0,\"H\",IF(AB$7=\"Sun\",\"H\",IFERROR(VLOOKUP($D18&\"-\"&AB$8&\"\",pks_3!$A$1:$E$21,5,0),\"P\")))))","v":""},{"$f":"IF(AC$8>TODAY(),\"\",IF($C18=\"\",\"\",IF(COUNTIF(Date,AC$8)>0,\"H\",IF(AC$7=\"Sun\",\"H\",IFERROR(VLOOKUP($D18&\"-\"&AC$8&\"\",pks_3!$A$1:$E$21,5,0),\"P\")))))","v":""},{"$f":"IF(AD$8>TODAY(),\"\",IF($C18=\"\",\"\",IF(COUNTIF(Date,AD$8)>0,\"H\",IF(AD$7=\"Sun\",\"H\",IFERROR(VLOOKUP($D18&\"-\"&AD$8&\"\",pks_3!$A$1:$E$21,5,0),\"P\")))))","v":""},{"$f":"IF(AE$8>TODAY(),\"\",IF($C18=\"\",\"\",IF(COUNTIF(Date,AE$8)>0,\"H\",IF(AE$7=\"Sun\",\"H\",IFERROR(VLOOKUP($D18&\"-\"&AE$8&\"\",pks_3!$A$1:$E$21,5,0),\"P\")))))","v":""},{"$f":"IF(AF$8>TODAY(),\"\",IF($C18=\"\",\"\",IF(COUNTIF(Date,AF$8)>0,\"H\",IF(AF$7=\"Sun\",\"H\",IFERROR(VLOOKUP($D18&\"-\"&AF$8&\"\",pks_3!$A$1:$E$21,5,0),\"P\")))))","v":""},{"$f":"IF(AG$8>TODAY(),\"\",IF($C18=\"\",\"\",IF(COUNTIF(Date,AG$8)>0,\"H\",IF(AG$7=\"Sun\",\"H\",IFERROR(VLOOKUP($D18&\"-\"&AG$8&\"\",pks_3!$A$1:$E$21,5,0),\"P\")))))","v":""},{"$f":"IF(AH$8>TODAY(),\"\",IF($C18=\"\",\"\",IF(COUNTIF(Date,AH$8)>0,\"H\",IF(AH$7=\"Sun\",\"H\",IFERROR(VLOOKUP($D18&\"-\"&AH$8&\"\",pks_3!$A$1:$E$21,5,0),\"P\")))))","v":""},{"$f":"IF(AI$8>TODAY(),\"\",IF($C18=\"\",\"\",IF(COUNTIF(Date,AI$8)>0,\"H\",IF(AI$7=\"Sun\",\"H\",IFERROR(VLOOKUP($D18&\"-\"&AI$8&\"\",pks_3!$A$1:$E$21,5,0),\"P\")))))","v":""},0,0,0,0]
[null,{"$f":"IF(C19=\"\",\"\",COUNTA($C$9:C19))","v":""},null,null,{"$f":"IF(E$8>TODAY(),\"\",IF($C19=\"\",\"\",IF(COUNTIF(Date,E$8)>0,\"H\",IF(E$7=\"Sun\",\"H\",IFERROR(VLOOKUP($D19&\"-\"&E$8&\"\",pks_3!$A$1:$E$21,5,0),\"P\")))))","v":""},{"$f":"IF(F$8>TODAY(),\"\",IF($C19=\"\",\"\",IF(COUNTIF(Date,F$8)>0,\"H\",IF(F$7=\"Sun\",\"H\",IFERROR(VLOOKUP($D19&\"-\"&F$8&\"\",pks_3!$A$1:$E$21,5,0),\"P\")))))","v":""},{"$f":"IF(G$8>TODAY(),\"\",IF($C19=\"\",\"\",IF(COUNTIF(Date,G$8)>0,\"H\",IF(G$7=\"Sun\",\"H\",IFERROR(VLOOKUP($D19&\"-\"&G$8&\"\",pks_3!$A$1:$E$21,5,0),\"P\")))))","v":""},{"$f":"IF(H$8>TODAY(),\"\",IF($C19=\"\",\"\",IF(COUNTIF(Date,H$8)>0,\"H\",IF(H$7=\"Sun\",\"H\",IFERROR(VLOOKUP($D19&\"-\"&H$8&\"\",pks_3!$A$1:$E$21,5,0),\"P\")))))","v":""},{"$f":"IF(I$8>TODAY(),\"\",IF($C19=\"\",\"\",IF(COUNTIF(Date,I$8)>0,\"H\",IF(I$7=\"Sun\",\"H\",IFERROR(VLOOKUP($D19&\"-\"&I$8&\"\",pks_3!$A$1:$E$21,5,0),\"P\")))))","v":""},{"$f":"IF(J$8>TODAY(),\"\",IF($C19=\"\",\"\",IF(COUNTIF(Date,J$8)>0,\"H\",IF(J$7=\"Sun\",\"H\",IFERROR(VLOOKUP($D19&\"-\"&J$8&\"\",pks_3!$A$1:$E$21,5,0),\"P\")))))","v":""},{"$f":"IF(K$8>TODAY(),\"\",IF($C19=\"\",\"\",IF(COUNTIF(Date,K$8)>0,\"H\",IF(K$7=\"Sun\",\"H\",IFERROR(VLOOKUP($D19&\"-\"&K$8&\"\",pks_3!$A$1:$E$21,5,0),\"P\")))))","v":""},{"$f":"IF(L$8>TODAY(),\"\",IF($C19=\"\",\"\",IF(COUNTIF(Date,L$8)>0,\"H\",IF(L$7=\"Sun\",\"H\",IFERROR(VLOOKUP($D19&\"-\"&L$8&\"\",pks_3!$A$1:$E$21,5,0),\"P\")))))","v":""},{"$f":"IF(M$8>TODAY(),\"\",IF($C19=\"\",\"\",IF(COUNTIF(Date,M$8)>0,\"H\",IF(M$7=\"Sun\",\"H\",IFERROR(VLOOKUP($D19&\"-\"&M$8&\"\",pks_3!$A$1:$E$21,5,0),\"P\")))))","v":""},{"$f":"IF(N$8>TODAY(),\"\",IF($C19=\"\",\"\",IF(COUNTIF(Date,N$8)>0,\"H\",IF(N$7=\"Sun\",\"H\",IFERROR(VLOOKUP($D19&\"-\"&N$8&\"\",pks_3!$A$1:$E$21,5,0),\"P\")))))","v":""},{"$f":"IF(O$8>TODAY(),\"\",IF($C19=\"\",\"\",IF(COUNTIF(Date,O$8)>0,\"H\",IF(O$7=\"Sun\",\"H\",IFERROR(VLOOKUP($D19&\"-\"&O$8&\"\",pks_3!$A$1:$E$21,5,0),\"P\")))))","v":""},{"$f":"IF(P$8>TODAY(),\"\",IF($C19=\"\",\"\",IF(COUNTIF(Date,P$8)>0,\"H\",IF(P$7=\"Sun\",\"H\",IFERROR(VLOOKUP($D19&\"-\"&P$8&\"\",pks_3!$A$1:$E$21,5,0),\"P\")))))","v":""},{"$f":"IF(Q$8>TODAY(),\"\",IF($C19=\"\",\"\",IF(COUNTIF(Date,Q$8)>0,\"H\",IF(Q$7=\"Sun\",\"H\",IFERROR(VLOOKUP($D19&\"-\"&Q$8&\"\",pks_3!$A$1:$E$21,5,0),\"P\")))))","v":""},{"$f":"IF(R$8>TODAY(),\"\",IF($C19=\"\",\"\",IF(COUNTIF(Date,R$8)>0,\"H\",IF(R$7=\"Sun\",\"H\",IFERROR(VLOOKUP($D19&\"-\"&R$8&\"\",pks_3!$A$1:$E$21,5,0),\"P\")))))","v":""},{"$f":"IF(S$8>TODAY(),\"\",IF($C19=\"\",\"\",IF(COUNTIF(Date,S$8)>0,\"H\",IF(S$7=\"Sun\",\"H\",IFERROR(VLOOKUP($D19&\"-\"&S$8&\"\",pks_3!$A$1:$E$21,5,0),\"P\")))))","v":""},{"$f":"IF(T$8>TODAY(),\"\",IF($C19=\"\",\"\",IF(COUNTIF(Date,T$8)>0,\"H\",IF(T$7=\"Sun\",\"H\",IFERROR(VLOOKUP($D19&\"-\"&T$8&\"\",pks_3!$A$1:$E$21,5,0),\"P\")))))","v":""},{"$f":"IF(U$8>TODAY(),\"\",IF($C19=\"\",\"\",IF(COUNTIF(Date,U$8)>0,\"H\",IF(U$7=\"Sun\",\"H\",IFERROR(VLOOKUP($D19&\"-\"&U$8&\"\",pks_3!$A$1:$E$21,5,0),\"P\")))))","v":""},{"$f":"IF(V$8>TODAY(),\"\",IF($C19=\"\",\"\",IF(COUNTIF(Date,V$8)>0,\"H\",IF(V$7=\"Sun\",\"H\",IFERROR(VLOOKUP($D19&\"-\"&V$8&\"\",pks_3!$A$1:$E$21,5,0),\"P\")))))","v":""},{"$f":"IF(W$8>TODAY(),\"\",IF($C19=\"\",\"\",IF(COUNTIF(Date,W$8)>0,\"H\",IF(W$7=\"Sun\",\"H\",IFERROR(VLOOKUP($D19&\"-\"&W$8&\"\",pks_3!$A$1:$E$21,5,0),\"P\")))))","v":""},{"$f":"IF(X$8>TODAY(),\"\",IF($C19=\"\",\"\",IF(COUNTIF(Date,X$8)>0,\"H\",IF(X$7=\"Sun\",\"H\",IFERROR(VLOOKUP($D19&\"-\"&X$8&\"\",pks_3!$A$1:$E$21,5,0),\"P\")))))","v":""},{"$f":"IF(Y$8>TODAY(),\"\",IF($C19=\"\",\"\",IF(COUNTIF(Date,Y$8)>0,\"H\",IF(Y$7=\"Sun\",\"H\",IFERROR(VLOOKUP($D19&\"-\"&Y$8&\"\",pks_3!$A$1:$E$21,5,0),\"P\")))))","v":""},{"$f":"IF(Z$8>TODAY(),\"\",IF($C19=\"\",\"\",IF(COUNTIF(Date,Z$8)>0,\"H\",IF(Z$7=\"Sun\",\"H\",IFERROR(VLOOKUP($D19&\"-\"&Z$8&\"\",pks_3!$A$1:$E$21,5,0),\"P\")))))","v":""},{"$f":"IF(AA$8>TODAY(),\"\",IF($C19=\"\",\"\",IF(COUNTIF(Date,AA$8)>0,\"H\",IF(AA$7=\"Sun\",\"H\",IFERROR(VLOOKUP($D19&\"-\"&AA$8&\"\",pks_3!$A$1:$E$21,5,0),\"P\")))))","v":""},{"$f":"IF(AB$8>TODAY(),\"\",IF($C19=\"\",\"\",IF(COUNTIF(Date,AB$8)>0,\"H\",IF(AB$7=\"Sun\",\"H\",IFERROR(VLOOKUP($D19&\"-\"&AB$8&\"\",pks_3!$A$1:$E$21,5,0),\"P\")))))","v":""},{"$f":"IF(AC$8>TODAY(),\"\",IF($C19=\"\",\"\",IF(COUNTIF(Date,AC$8)>0,\"H\",IF(AC$7=\"Sun\",\"H\",IFERROR(VLOOKUP($D19&\"-\"&AC$8&\"\",pks_3!$A$1:$E$21,5,0),\"P\")))))","v":""},{"$f":"IF(AD$8>TODAY(),\"\",IF($C19=\"\",\"\",IF(COUNTIF(Date,AD$8)>0,\"H\",IF(AD$7=\"Sun\",\"H\",IFERROR(VLOOKUP($D19&\"-\"&AD$8&\"\",pks_3!$A$1:$E$21,5,0),\"P\")))))","v":""},{"$f":"IF(AE$8>TODAY(),\"\",IF($C19=\"\",\"\",IF(COUNTIF(Date,AE$8)>0,\"H\",IF(AE$7=\"Sun\",\"H\",IFERROR(VLOOKUP($D19&\"-\"&AE$8&\"\",pks_3!$A$1:$E$21,5,0),\"P\")))))","v":""},{"$f":"IF(AF$8>TODAY(),\"\",IF($C19=\"\",\"\",IF(COUNTIF(Date,AF$8)>0,\"H\",IF(AF$7=\"Sun\",\"H\",IFERROR(VLOOKUP($D19&\"-\"&AF$8&\"\",pks_3!$A$1:$E$21,5,0),\"P\")))))","v":""},{"$f":"IF(AG$8>TODAY(),\"\",IF($C19=\"\",\"\",IF(COUNTIF(Date,AG$8)>0,\"H\",IF(AG$7=\"Sun\",\"H\",IFERROR(VLOOKUP($D19&\"-\"&AG$8&\"\",pks_3!$A$1:$E$21,5,0),\"P\")))))","v":""},{"$f":"IF(AH$8>TODAY(),\"\",IF($C19=\"\",\"\",IF(COUNTIF(Date,AH$8)>0,\"H\",IF(AH$7=\"Sun\",\"H\",IFERROR(VLOOKUP($D19&\"-\"&AH$8&\"\",pks_3!$A$1:$E$21,5,0),\"P\")))))","v":""},{"$f":"IF(AI$8>TODAY(),\"\",IF($C19=\"\",\"\",IF(COUNTIF(Date,AI$8)>0,\"H\",IF(AI$7=\"Sun\",\"H\",IFERROR(VLOOKUP($D19&\"-\"&AI$8&\"\",pks_3!$A$1:$E$21,5,0),\"P\")))))","v":""},0,0,0,0]
[null,{"$f":"IF(C20=\"\",\"\",COUNTA($C$9:C20))","v":""},null,null,{"$f":"IF(E$8>TODAY(),\"\",IF($C20=\"\",\"\",IF(COUNTIF(Date,E$8)>0,\"H\",IF(E$7=\"Sun\",\"H\",IFERROR(VLOOKUP($D20&\"-\"&E$8&\"\",pks_3!$A$1:$E$21,5,0),\"P\")))))","v":""},{"$f":"IF(F$8>TODAY(),\"\",IF($C20=\"\",\"\",IF(COUNTIF(Date,F$8)>0,\"H\",IF(F$7=\"Sun\",\"H\",IFERROR(VLOOKUP($D20&\"-\"&F$8&\"\",pks_3!$A$1:$E$21,5,0),\"P\")))))","v":""},{"$f":"IF(G$8>TODAY(),\"\",IF($C20=\"\",\"\",IF(COUNTIF(Date,G$8)>0,\"H\",IF(G$7=\"Sun\",\"H\",IFERROR(VLOOKUP($D20&\"-\"&G$8&\"\",pks_3!$A$1:$E$21,5,0),\"P\")))))","v":""},{"$f":"IF(H$8>TODAY(),\"\",IF($C20=\"\",\"\",IF(COUNTIF(Date,H$8)>0,\"H\",IF(H$7=\"Sun\",\"H\",IFERROR(VLOOKUP($D20&\"-\"&H$8&\"\",pks_3!$A$1:$E$21,5,0),\"P\")))))","v":""},{"$f":"IF(I$8>TODAY(),\"\",IF($C20=\"\",\"\",IF(COUNTIF(Date,I$8)>0,\"H\",IF(I$7=\"Sun\",\"H\",IFERROR(VLOOKUP($D20&\"-\"&I$8&\"\",pks_3!$A$1:$E$21,5,0),\"P\")))))","v":""},{"$f":"IF(J$8>TODAY(),\"\",IF($C20=\"\",\"\",IF(COUNTIF(Date,J$8)>0,\"H\",IF(J$7=\"Sun\",\"H\",IFERROR(VLOOKUP($D20&\"-\"&J$8&\"\",pks_3!$A$1:$E$21,5,0),\"P\")))))","v":""},{"$f":"IF(K$8>TODAY(),\"\",IF($C20=\"\",\"\",IF(COUNTIF(Date,K$8)>0,\"H\",IF(K$7=\"Sun\",\"H\",IFERROR(VLOOKUP($D20&\"-\"&K$8&\"\",pks_3!$A$1:$E$21,5,0),\"P\")))))","v":""},{"$f":"IF(L$8>TODAY(),\"\",IF($C20=\"\",\"\",IF(COUNTIF(Date,L$8)>0,\"H\",IF(L$7=\"Sun\",\"H\",IFERROR(VLOOKUP($D20&\"-\"&L$8&\"\",pks_3!$A$1:$E$21,5,0),\"P\")))))","v":""},{"$f":"IF(M$8>TODAY(),\"\",IF($C20=\"\",\"\",IF(COUNTIF(Date,M$8)>0,\"H\",IF(M$7=\"Sun\",\"H\",IFERROR(VLOOKUP($D20&\"-\"&M$8&\"\",pks_3!$A$1:$E$21,5,0),\"P\")))))","v":""},{"$f":"IF(N$8>TODAY(),\"\",IF($C20=\"\",\"\",IF(COUNTIF(Date,N$8)>0,\"H\",IF(N$7=\"Sun\",\"H\",IFERROR(VLOOKUP($D20&\"-\"&N$8&\"\",pks_3!$A$1:$E$21,5,0),\"P\")))))","v":""},{"$f":"IF(O$8>TODAY(),\"\",IF($C20=\"\",\"\",IF(COUNTIF(Date,O$8)>0,\"H\",IF(O$7=\"Sun\",\"H\",IFERROR(VLOOKUP($D20&\"-\"&O$8&\"\",pks_3!$A$1:$E$21,5,0),\"P\")))))","v":""},{"$f":"IF(P$8>TODAY(),\"\",IF($C20=\"\",\"\",IF(COUNTIF(Date,P$8)>0,\"H\",IF(P$7=\"Sun\",\"H\",IFERROR(VLOOKUP($D20&\"-\"&P$8&\"\",pks_3!$A$1:$E$21,5,0),\"P\")))))","v":""},{"$f":"IF(Q$8>TODAY(),\"\",IF($C20=\"\",\"\",IF(COUNTIF(Date,Q$8)>0,\"H\",IF(Q$7=\"Sun\",\"H\",IFERROR(VLOOKUP($D20&\"-\"&Q$8&\"\",pks_3!$A$1:$E$21,5,0),\"P\")))))","v":""},{"$f":"IF(R$8>TODAY(),\"\",IF($C20=\"\",\"\",IF(COUNTIF(Date,R$8)>0,\"H\",IF(R$7=\"Sun\",\"H\",IFERROR(VLOOKUP($D20&\"-\"&R$8&\"\",pks_3!$A$1:$E$21,5,0),\"P\")))))","v":""},{"$f":"IF(S$8>TODAY(),\"\",IF($C20=\"\",\"\",IF(COUNTIF(Date,S$8)>0,\"H\",IF(S$7=\"Sun\",\"H\",IFERROR(VLOOKUP($D20&\"-\"&S$8&\"\",pks_3!$A$1:$E$21,5,0),\"P\")))))","v":""},{"$f":"IF(T$8>TODAY(),\"\",IF($C20=\"\",\"\",IF(COUNTIF(Date,T$8)>0,\"H\",IF(T$7=\"Sun\",\"H\",IFERROR(VLOOKUP($D20&\"-\"&T$8&\"\",pks_3!$A$1:$E$21,5,0),\"P\")))))","v":""},{"$f":"IF(U$8>TODAY(),\"\",IF($C20=\"\",\"\",IF(COUNTIF(Date,U$8)>0,\"H\",IF(U$7=\"Sun\",\"H\",IFERROR(VLOOKUP($D20&\"-\"&U$8&\"\",pks_3!$A$1:$E$21,5,0),\"P\")))))","v":""},{"$f":"IF(V$8>TODAY(),\"\",IF($C20=\"\",\"\",IF(COUNTIF(Date,V$8)>0,\"H\",IF(V$7=\"Sun\",\"H\",IFERROR(VLOOKUP($D20&\"-\"&V$8&\"\",pks_3!$A$1:$E$21,5,0),\"P\")))))","v":""},{"$f":"IF(W$8>TODAY(),\"\",IF($C20=\"\",\"\",IF(COUNTIF(Date,W$8)>0,\"H\",IF(W$7=\"Sun\",\"H\",IFERROR(VLOOKUP($D20&\"-\"&W$8&\"\",pks_3!$A$1:$E$21,5,0),\"P\")))))","v":""},{"$f":"IF(X$8>TODAY(),\"\",IF($C20=\"\",\"\",IF(COUNTIF(Date,X$8)>0,\"H\",IF(X$7=\"Sun\",\"H\",IFERROR(VLOOKUP($D20&\"-\"&X$8&\"\",pks_3!$A$1:$E$21,5,0),\"P\")))))","v":""},{"$f":"IF(Y$8>TODAY(),\"\",IF($C20=\"\",\"\",IF(COUNTIF(Date,Y$8)>0,\"H\",IF(Y$7=\"Sun\",\"H\",IFERROR(VLOOKUP($D20&\"-\"&Y$8&\"\",pks_3!$A$1:$E$21,5,0),\"P\")))))","v":""},{"$f":"IF(Z$8>TODAY(),\"\",IF($C20=\"\",\"\",IF(COUNTIF(Date,Z$8)>0,\"H\",IF(Z$7=\"Sun\",\"H\",IFERROR(VLOOKUP($D20&\"-\"&Z$8&\"\",pks_3!$A$1:$E$21,5,0),\"P\")))))","v":""},{"$f":"IF(AA$8>TODAY(),\"\",IF($C20=\"\",\"\",IF(COUNTIF(Date,AA$8)>0,\"H\",IF(AA$7=\"Sun\",\"H\",IFERROR(VLOOKUP($D20&\"-\"&AA$8&\"\",pks_3!$A$1:$E$21,5,0),\"P\")))))","v":""},{"$f":"IF(AB$8>TODAY(),\"\",IF($C20=\"\",\"\",IF(COUNTIF(Date,AB$8)>0,\"H\",IF(AB$7=\"Sun\",\"H\",IFERROR(VLOOKUP($D20&\"-\"&AB$8&\"\",pks_3!$A$1:$E$21,5,0),\"P\")))))","v":""},{"$f":"IF(AC$8>TODAY(),\"\",IF($C20=\"\",\"\",IF(COUNTIF(Date,AC$8)>0,\"H\",IF(AC$7=\"Sun\",\"H\",IFERROR(VLOOKUP($D20&\"-\"&AC$8&\"\",pks_3!$A$1:$E$21,5,0),\"P\")))))","v":""},{"$f":"IF(AD$8>TODAY(),\"\",IF($C20=\"\",\"\",IF(COUNTIF(Date,AD$8)>0,\"H\",IF(AD$7=\"Sun\",\"H\",IFERROR(VLOOKUP($D20&\"-\"&AD$8&\"\",pks_3!$A$1:$E$21,5,0),\"P\")))))","v":""},{"$f":"IF(AE$8>TODAY(),\"\",IF($C20=\"\",\"\",IF(COUNTIF(Date,AE$8)>0,\"H\",IF(AE$7=\"Sun\",\"H\",IFERROR(VLOOKUP($D20&\"-\"&AE$8&\"\",pks_3!$A$1:$E$21,5,0),\"P\")))))","v":""},{"$f":"IF(AF$8>TODAY(),\"\",IF($C20=\"\",\"\",IF(COUNTIF(Date,AF$8)>0,\"H\",IF(AF$7=\"Sun\",\"H\",IFERROR(VLOOKUP($D20&\"-\"&AF$8&\"\",pks_3!$A$1:$E$21,5,0),\"P\")))))","v":""},{"$f":"IF(AG$8>TODAY(),\"\",IF($C20=\"\",\"\",IF(COUNTIF(Date,AG$8)>0,\"H\",IF(AG$7=\"Sun\",\"H\",IFERROR(VLOOKUP($D20&\"-\"&AG$8&\"\",pks_3!$A$1:$E$21,5,0),\"P\")))))","v":""},{"$f":"IF(AH$8>TODAY(),\"\",IF($C20=\"\",\"\",IF(COUNTIF(Date,AH$8)>0,\"H\",IF(AH$7=\"Sun\",\"H\",IFERROR(VLOOKUP($D20&\"-\"&AH$8&\"\",pks_3!$A$1:$E$21,5,0),\"P\")))))","v":""},{"$f":"IF(AI$8>TODAY(),\"\",IF($C20=\"\",\"\",IF(COUNTIF(Date,AI$8)>0,\"H\",IF(AI$7=\"Sun\",\"H\",IFERROR(VLOOKUP($D20&\"-\"&AI$8&\"\",pks_3!$A$1:$E$21,5,0),\"P\")))))","v":""},0,0,0,0]
[null,{"$f":"IF(C21=\"\",\"\",COUNTA($C$9:C21))","v":""},null,null,{"$f":"IF(E$8>TODAY(),\"\",IF($C21=\"\",\"\",IF(COUNTIF(Date,E$8)>0,\"H\",IF(E$7=\"Sun\",\"H\",IFERROR(VLOOKUP($D21&\"-\"&E$8&\"\",pks_3!$A$1:$E$21,5,0),\"P\")))))","v":""},{"$f":"IF(F$8>TODAY(),\"\",IF($C21=\"\",\"\",IF(COUNTIF(Date,F$8)>0,\"H\",IF(F$7=\"Sun\",\"H\",IFERROR(VLOOKUP($D21&\"-\"&F$8&\"\",pks_3!$A$1:$E$21,5,0),\"P\")))))","v":""},{"$f":"IF(G$8>TODAY(),\"\",IF($C21=\"\",\"\",IF(COUNTIF(Date,G$8)>0,\"H\",IF(G$7=\"Sun\",\"H\",IFERROR(VLOOKUP($D21&\"-\"&G$8&\"\",pks_3!$A$1:$E$21,5,0),\"P\")))))","v":""},{"$f":"IF(H$8>TODAY(),\"\",IF($C21=\"\",\"\",IF(COUNTIF(Date,H$8)>0,\"H\",IF(H$7=\"Sun\",\"H\",IFERROR(VLOOKUP($D21&\"-\"&H$8&\"\",pks_3!$A$1:$E$21,5,0),\"P\")))))","v":""},{"$f":"IF(I$8>TODAY(),\"\",IF($C21=\"\",\"\",IF(COUNTIF(Date,I$8)>0,\"H\",IF(I$7=\"Sun\",\"H\",IFERROR(VLOOKUP($D21&\"-\"&I$8&\"\",pks_3!$A$1:$E$21,5,0),\"P\")))))","v":""},{"$f":"IF(J$8>TODAY(),\"\",IF($C21=\"\",\"\",IF(COUNTIF(Date,J$8)>0,\"H\",IF(J$7=\"Sun\",\"H\",IFERROR(VLOOKUP($D21&\"-\"&J$8&\"\",pks_3!$A$1:$E$21,5,0),\"P\")))))","v":""},{"$f":"IF(K$8>TODAY(),\"\",IF($C21=\"\",\"\",IF(COUNTIF(Date,K$8)>0,\"H\",IF(K$7=\"Sun\",\"H\",IFERROR(VLOOKUP($D21&\"-\"&K$8&\"\",pks_3!$A$1:$E$21,5,0),\"P\")))))","v":""},{"$f":"IF(L$8>TODAY(),\"\",IF($C21=\"\",\"\",IF(COUNTIF(Date,L$8)>0,\"H\",IF(L$7=\"Sun\",\"H\",IFERROR(VLOOKUP($D21&\"-\"&L$8&\"\",pks_3!$A$1:$E$21,5,0),\"P\")))))","v":""},{"$f":"IF(M$8>TODAY(),\"\",IF($C21=\"\",\"\",IF(COUNTIF(Date,M$8)>0,\"H\",IF(M$7=\"Sun\",\"H\",IFERROR(VLOOKUP($D21&\"-\"&M$8&\"\",pks_3!$A$1:$E$21,5,0),\"P\")))))","v":""},{"$f":"IF(N$8>TODAY(),\"\",IF($C21=\"\",\"\",IF(COUNTIF(Date,N$8)>0,\"H\",IF(N$7=\"Sun\",\"H\",IFERROR(VLOOKUP($D21&\"-\"&N$8&\"\",pks_3!$A$1:$E$21,5,0),\"P\")))))","v":""},{"$f":"IF(O$8>TODAY(),\"\",IF($C21=\"\",\"\",IF(COUNTIF(Date,O$8)>0,\"H\",IF(O$7=\"Sun\",\"H\",IFERROR(VLOOKUP($D21&\"-\"&O$8&\"\",pks_3!$A$1:$E$21,5,0),\"P\")))))","v":""},{"$f":"IF(P$8>TODAY(),\"\",IF($C21=\"\",\"\",IF(COUNTIF(Date,P$8)>0,\"H\",IF(P$7=\"Sun\",\"H\",IFERROR(VLOOKUP($D21&\"-\"&P$8&\"\",pks_3!$A$1:$E$21,5,0),\"P\")))))","v":""},{"$f":"IF(Q$8>TODAY(),\"\",IF($C21=\"\",\"\",IF(COUNTIF(Date,Q$8)>0,\"H\",IF(Q$7=\"Sun\",\"H\",IFERROR(VLOOKUP($D21&\"-\"&Q$8&\"\",pks_3!$A$1:$E$21,5,0),\"P\")))))","v":""},{"$f":"IF(R$8>TODAY(),\"\",IF($C21=\"\",\"\",IF(COUNTIF(Date,R$8)>0,\"H\",IF(R$7=\"Sun\",\"H\",IFERROR(VLOOKUP($D21&\"-\"&R$8&\"\",pks_3!$A$1:$E$21,5,0),\"P\")))))","v":""},{"$f":"IF(S$8>TODAY(),\"\",IF($C21=\"\",\"\",IF(COUNTIF(Date,S$8)>0,\"H\",IF(S$7=\"Sun\",\"H\",IFERROR(VLOOKUP($D21&\"-\"&S$8&\"\",pks_3!$A$1:$E$21,5,0),\"P\")))))","v":""},{"$f":"IF(T$8>TODAY(),\"\",IF($C21=\"\",\"\",IF(COUNTIF(Date,T$8)>0,\"H\",IF(T$7=\"Sun\",\"H\",IFERROR(VLOOKUP($D21&\"-\"&T$8&\"\",pks_3!$A$1:$E$21,5,0),\"P\")))))","v":""},{"$f":"IF(U$8>TODAY(),\"\",IF($C21=\"\",\"\",IF(COUNTIF(Date,U$8)>0,\"H\",IF(U$7=\"Sun\",\"H\",IFERROR(VLOOKUP($D21&\"-\"&U$8&\"\",pks_3!$A$1:$E$21,5,0),\"P\")))))","v":""},{"$f":"IF(V$8>TODAY(),\"\",IF($C21=\"\",\"\",IF(COUNTIF(Date,V$8)>0,\"H\",IF(V$7=\"Sun\",\"H\",IFERROR(VLOOKUP($D21&\"-\"&V$8&\"\",pks_3!$A$1:$E$21,5,0),\"P\")))))","v":""},{"$f":"IF(W$8>TODAY(),\"\",IF($C21=\"\",\"\",IF(COUNTIF(Date,W$8)>0,\"H\",IF(W$7=\"Sun\",\"H\",IFERROR(VLOOKUP($D21&\"-\"&W$8&\"\",pks_3!$A$1:$E$21,5,0),\"P\")))))","v":""},{"$f":"IF(X$8>TODAY(),\"\",IF($C21=\"\",\"\",IF(COUNTIF(Date,X$8)>0,\"H\",IF(X$7=\"Sun\",\"H\",IFERROR(VLOOKUP($D21&\"-\"&X$8&\"\",pks_3!$A$1:$E$21,5,0),\"P\")))))","v":""},{"$f":"IF(Y$8>TODAY(),\"\",IF($C21=\"\",\"\",IF(COUNTIF(Date,Y$8)>0,\"H\",IF(Y$7=\"Sun\",\"H\",IFERROR(VLOOKUP($D21&\"-\"&Y$8&\"\",pks_3!$A$1:$E$21,5,0),\"P\")))))","v":""},{"$f":"IF(Z$8>TODAY(),\"\",IF($C21=\"\",\"\",IF(COUNTIF(Date,Z$8)>0,\"H\",IF(Z$7=\"Sun\",\"H\",IFERROR(VLOOKUP($D21&\"-\"&Z$8&\"\",pks_3!$A$1:$E$21,5,0),\"P\")))))","v":""},{"$f":"IF(AA$8>TODAY(),\"\",IF($C21=\"\",\"\",IF(COUNTIF(Date,AA$8)>0,\"H\",IF(AA$7=\"Sun\",\"H\",IFERROR(VLOOKUP($D21&\"-\"&AA$8&\"\",pks_3!$A$1:$E$21,5,0),\"P\")))))","v":""},{"$f":"IF(AB$8>TODAY(),\"\",IF($C21=\"\",\"\",IF(COUNTIF(Date,AB$8)>0,\"H\",IF(AB$7=\"Sun\",\"H\",IFERROR(VLOOKUP($D21&\"-\"&AB$8&\"\",pks_3!$A$1:$E$21,5,0),\"P\")))))","v":""},{"$f":"IF(AC$8>TODAY(),\"\",IF($C21=\"\",\"\",IF(COUNTIF(Date,AC$8)>0,\"H\",IF(AC$7=\"Sun\",\"H\",IFERROR(VLOOKUP($D21&\"-\"&AC$8&\"\",pks_3!$A$1:$E$21,5,0),\"P\")))))","v":""},{"$f":"IF(AD$8>TODAY(),\"\",IF($C21=\"\",\"\",IF(COUNTIF(Date,AD$8)>0,\"H\",IF(AD$7=\"Sun\",\"H\",IFERROR(VLOOKUP($D21&\"-\"&AD$8&\"\",pks_3!$A$1:$E$21,5,0),\"P\")))))","v":""},{"$f":"IF(AE$8>TODAY(),\"\",IF($C21=\"\",\"\",IF(COUNTIF(Date,AE$8)>0,\"H\",IF(AE$7=\"Sun\",\"H\",IFERROR(VLOOKUP($D21&\"-\"&AE$8&\"\",pks_3!$A$1:$E$21,5,0),\"P\")))))","v":""},{"$f":"IF(AF$8>TODAY(),\"\",IF($C21=\"\",\"\",IF(COUNTIF(Date,AF$8)>0,\"H\",IF(AF$7=\"Sun\",\"H\",IFERROR(VLOOKUP($D21&\"-\"&AF$8&\"\",pks_3!$A$1:$E$21,5,0),\"P\")))))","v":""},{"$f":"IF(AG$8>TODAY(),\"\",IF($C21=\"\",\"\",IF(COUNTIF(Date,AG$8)>0,\"H\",IF(AG$7=\"Sun\",\"H\",IFERROR(VLOOKUP($D21&\"-\"&AG$8&\"\",pks_3!$A$1:$E$21,5,0),\"P\")))))","v":""},{"$f":"IF(AH$8>TODAY(),\"\",IF($C21=\"\",\"\",IF(COUNTIF(Date,AH$8)>0,\"H\",IF(AH$7=\"Sun\",\"H\",IFERROR(VLOOKUP($D21&\"-\"&AH$8&\"\",pks_3!$A$1:$E$21,5,0),\"P\")))))","v":""},{"$f":"IF(AI$8>TODAY(),\"\",IF($C21=\"\",\"\",IF(COUNTIF(Date,AI$8)>0,\"H\",IF(AI$7=\"Sun\",\"H\",IFERROR(VLOOKUP($D21&\"-\"&AI$8&\"\",pks_3!$A$1:$E$21,5,0),\"P\")))))","v":""},0,0,0,0]
[null,{"$f":"IF(C22=\"\",\"\",COUNTA($C$9:C22))","v":""},null,null,{"$f":"IF(E$8>TODAY(),\"\",IF($C22=\"\",\"\",IF(COUNTIF(Date,E$8)>0,\"H\",IF(E$7=\"Sun\",\"H\",IFERROR(VLOOKUP($D22&\"-\"&E$8&\"\",pks_3!$A$1:$E$21,5,0),\"P\")))))","v":""},{"$f":"IF(F$8>TODAY(),\"\",IF($C22=\"\",\"\",IF(COUNTIF(Date,F$8)>0,\"H\",IF(F$7=\"Sun\",\"H\",IFERROR(VLOOKUP($D22&\"-\"&F$8&\"\",pks_3!$A$1:$E$21,5,0),\"P\")))))","v":""},{"$f":"IF(G$8>TODAY(),\"\",IF($C22=\"\",\"\",IF(COUNTIF(Date,G$8)>0,\"H\",IF(G$7=\"Sun\",\"H\",IFERROR(VLOOKUP($D22&\"-\"&G$8&\"\",pks_3!$A$1:$E$21,5,0),\"P\")))))","v":""},{"$f":"IF(H$8>TODAY(),\"\",IF($C22=\"\",\"\",IF(COUNTIF(Date,H$8)>0,\"H\",IF(H$7=\"Sun\",\"H\",IFERROR(VLOOKUP($D22&\"-\"&H$8&\"\",pks_3!$A$1:$E$21,5,0),\"P\")))))","v":""},{"$f":"IF(I$8>TODAY(),\"\",IF($C22=\"\",\"\",IF(COUNTIF(Date,I$8)>0,\"H\",IF(I$7=\"Sun\",\"H\",IFERROR(VLOOKUP($D22&\"-\"&I$8&\"\",pks_3!$A$1:$E$21,5,0),\"P\")))))","v":""},{"$f":"IF(J$8>TODAY(),\"\",IF($C22=\"\",\"\",IF(COUNTIF(Date,J$8)>0,\"H\",IF(J$7=\"Sun\",\"H\",IFERROR(VLOOKUP($D22&\"-\"&J$8&\"\",pks_3!$A$1:$E$21,5,0),\"P\")))))","v":""},{"$f":"IF(K$8>TODAY(),\"\",IF($C22=\"\",\"\",IF(COUNTIF(Date,K$8)>0,\"H\",IF(K$7=\"Sun\",\"H\",IFERROR(VLOOKUP($D22&\"-\"&K$8&\"\",pks_3!$A$1:$E$21,5,0),\"P\")))))","v":""},{"$f":"IF(L$8>TODAY(),\"\",IF($C22=\"\",\"\",IF(COUNTIF(Date,L$8)>0,\"H\",IF(L$7=\"Sun\",\"H\",IFERROR(VLOOKUP($D22&\"-\"&L$8&\"\",pks_3!$A$1:$E$21,5,0),\"P\")))))","v":""},{"$f":"IF(M$8>TODAY(),\"\",IF($C22=\"\",\"\",IF(COUNTIF(Date,M$8)>0,\"H\",IF(M$7=\"Sun\",\"H\",IFERROR(VLOOKUP($D22&\"-\"&M$8&\"\",pks_3!$A$1:$E$21,5,0),\"P\")))))","v":""},{"$f":"IF(N$8>TODAY(),\"\",IF($C22=\"\",\"\",IF(COUNTIF(Date,N$8)>0,\"H\",IF(N$7=\"Sun\",\"H\",IFERROR(VLOOKUP($D22&\"-\"&N$8&\"\",pks_3!$A$1:$E$21,5,0),\"P\")))))","v":""},{"$f":"IF(O$8>TODAY(),\"\",IF($C22=\"\",\"\",IF(COUNTIF(Date,O$8)>0,\"H\",IF(O$7=\"Sun\",\"H\",IFERROR(VLOOKUP($D22&\"-\"&O$8&\"\",pks_3!$A$1:$E$21,5,0),\"P\")))))","v":""},{"$f":"IF(P$8>TODAY(),\"\",IF($C22=\"\",\"\",IF(COUNTIF(Date,P$8)>0,\"H\",IF(P$7=\"Sun\",\"H\",IFERROR(VLOOKUP($D22&\"-\"&P$8&\"\",pks_3!$A$1:$E$21,5,0),\"P\")))))","v":""},{"$f":"IF(Q$8>TODAY(),\"\",IF($C22=\"\",\"\",IF(COUNTIF(Date,Q$8)>0,\"H\",IF(Q$7=\"Sun\",\"H\",IFERROR(VLOOKUP($D22&\"-\"&Q$8&\"\",pks_3!$A$1:$E$21,5,0),\"P\")))))","v":""},{"$f":"IF(R$8>TODAY(),\"\",IF($C22=\"\",\"\",IF(COUNTIF(Date,R$8)>0,\"H\",IF(R$7=\"Sun\",\"H\",IFERROR(VLOOKUP($D22&\"-\"&R$8&\"\",pks_3!$A$1:$E$21,5,0),\"P\")))))","v":""},{"$f":"IF(S$8>TODAY(),\"\",IF($C22=\"\",\"\",IF(COUNTIF(Date,S$8)>0,\"H\",IF(S$7=\"Sun\",\"H\",IFERROR(VLOOKUP($D22&\"-\"&S$8&\"\",pks_3!$A$1:$E$21,5,0),\"P\")))))","v":""},{"$f":"IF(T$8>TODAY(),\"\",IF($C22=\"\",\"\",IF(COUNTIF(Date,T$8)>0,\"H\",IF(T$7=\"Sun\",\"H\",IFERROR(VLOOKUP($D22&\"-\"&T$8&\"\",pks_3!$A$1:$E$21,5,0),\"P\")))))","v":""},{"$f":"IF(U$8>TODAY(),\"\",IF($C22=\"\",\"\",IF(COUNTIF(Date,U$8)>0,\"H\",IF(U$7=\"Sun\",\"H\",IFERROR(VLOOKUP($D22&\"-\"&U$8&\"\",pks_3!$A$1:$E$21,5,0),\"P\")))))","v":""},{"$f":"IF(V$8>TODAY(),\"\",IF($C22=\"\",\"\",IF(COUNTIF(Date,V$8)>0,\"H\",IF(V$7=\"Sun\",\"H\",IFERROR(VLOOKUP($D22&\"-\"&V$8&\"\",pks_3!$A$1:$E$21,5,0),\"P\")))))","v":""},{"$f":"IF(W$8>TODAY(),\"\",IF($C22=\"\",\"\",IF(COUNTIF(Date,W$8)>0,\"H\",IF(W$7=\"Sun\",\"H\",IFERROR(VLOOKUP($D22&\"-\"&W$8&\"\",pks_3!$A$1:$E$21,5,0),\"P\")))))","v":""},{"$f":"IF(X$8>TODAY(),\"\",IF($C22=\"\",\"\",IF(COUNTIF(Date,X$8)>0,\"H\",IF(X$7=\"Sun\",\"H\",IFERROR(VLOOKUP($D22&\"-\"&X$8&\"\",pks_3!$A$1:$E$21,5,0),\"P\")))))","v":""},{"$f":"IF(Y$8>TODAY(),\"\",IF($C22=\"\",\"\",IF(COUNTIF(Date,Y$8)>0,\"H\",IF(Y$7=\"Sun\",\"H\",IFERROR(VLOOKUP($D22&\"-\"&Y$8&\"\",pks_3!$A$1:$E$21,5,0),\"P\")))))","v":""},{"$f":"IF(Z$8>TODAY(),\"\",IF($C22=\"\",\"\",IF(COUNTIF(Date,Z$8)>0,\"H\",IF(Z$7=\"Sun\",\"H\",IFERROR(VLOOKUP($D22&\"-\"&Z$8&\"\",pks_3!$A$1:$E$21,5,0),\"P\")))))","v":""},{"$f":"IF(AA$8>TODAY(),\"\",IF($C22=\"\",\"\",IF(COUNTIF(Date,AA$8)>0,\"H\",IF(AA$7=\"Sun\",\"H\",IFERROR(VLOOKUP($D22&\"-\"&AA$8&\"\",pks_3!$A$1:$E$21,5,0),\"P\")))))","v":""},{"$f":"IF(AB$8>TODAY(),\"\",IF($C22=\"\",\"\",IF(COUNTIF(Date,AB$8)>0,\"H\",IF(AB$7=\"Sun\",\"H\",IFERROR(VLOOKUP($D22&\"-\"&AB$8&\"\",pks_3!$A$1:$E$21,5,0),\"P\")))))","v":""},{"$f":"IF(AC$8>TODAY(),\"\",IF($C22=\"\",\"\",IF(COUNTIF(Date,AC$8)>0,\"H\",IF(AC$7=\"Sun\",\"H\",IFERROR(VLOOKUP($D22&\"-\"&AC$8&\"\",pks_3!$A$1:$E$21,5,0),\"P\")))))","v":""},{"$f":"IF(AD$8>TODAY(),\"\",IF($C22=\"\",\"\",IF(COUNTIF(Date,AD$8)>0,\"H\",IF(AD$7=\"Sun\",\"H\",IFERROR(VLOOKUP($D22&\"-\"&AD$8&\"\",pks_3!$A$1:$E$21,5,0),\"P\")))))","v":""},{"$f":"IF(AE$8>TODAY(),\"\",IF($C22=\"\",\"\",IF(COUNTIF(Date,AE$8)>0,\"H\",IF(AE$7=\"Sun\",\"H\",IFERROR(VLOOKUP($D22&\"-\"&AE$8&\"\",pks_3!$A$1:$E$21,5,0),\"P\")))))","v":""},{"$f":"IF(AF$8>TODAY(),\"\",IF($C22=\"\",\"\",IF(COUNTIF(Date,AF$8)>0,\"H\",IF(AF$7=\"Sun\",\"H\",IFERROR(VLOOKUP($D22&\"-\"&AF$8&\"\",pks_3!$A$1:$E$21,5,0),\"P\")))))","v":""},{"$f":"IF(AG$8>TODAY(),\"\",IF($C22=\"\",\"\",IF(COUNTIF(Date,AG$8)>0,\"H\",IF(AG$7=\"Sun\",\"H\",IFERROR(VLOOKUP($D22&\"-\"&AG$8&\"\",pks_3!$A$1:$E$21,5,0),\"P\")))))","v":""},{"$f":"IF(AH$8>TODAY(),\"\",IF($C22=\"\",\"\",IF(COUNTIF(Date,AH$8)>0,\"H\",IF(AH$7=\"Sun\",\"H\",IFERROR(VLOOKUP($D22&\"-\"&AH$8&\"\",pks_3!$A$1:$E$21,5,0),\"P\")))))","v":""},{"$f":"IF(AI$8>TODAY(),\"\",IF($C22=\"\",\"\",IF(COUNTIF(Date,AI$8)>0,\"H\",IF(AI$7=\"Sun\",\"H\",IFERROR(VLOOKUP($D22&\"-\"&AI$8&\"\",pks_3!$A$1:$E$21,5,0),\"P\")))))","v":""},0,0,0,0]
[null,{"$f":"IF(C23=\"\",\"\",COUNTA($C$9:C23))","v":""},null,null,{"$f":"IF(E$8>TODAY(),\"\",IF($C23=\"\",\"\",IF(COUNTIF(Date,E$8)>0,\"H\",IF(E$7=\"Sun\",\"H\",IFERROR(VLOOKUP($D23&\"-\"&E$8&\"\",pks_3!$A$1:$E$21,5,0),\"P\")))))","v":""},{"$f":"IF(F$8>TODAY(),\"\",IF($C23=\"\",\"\",IF(COUNTIF(Date,F$8)>0,\"H\",IF(F$7=\"Sun\",\"H\",IFERROR(VLOOKUP($D23&\"-\"&F$8&\"\",pks_3!$A$1:$E$21,5,0),\"P\")))))","v":""},{"$f":"IF(G$8>TODAY(),\"\",IF($C23=\"\",\"\",IF(COUNTIF(Date,G$8)>0,\"H\",IF(G$7=\"Sun\",\"H\",IFERROR(VLOOKUP($D23&\"-\"&G$8&\"\",pks_3!$A$1:$E$21,5,0),\"P\")))))","v":""},{"$f":"IF(H$8>TODAY(),\"\",IF($C23=\"\",\"\",IF(COUNTIF(Date,H$8)>0,\"H\",IF(H$7=\"Sun\",\"H\",IFERROR(VLOOKUP($D23&\"-\"&H$8&\"\",pks_3!$A$1:$E$21,5,0),\"P\")))))","v":""},{"$f":"IF(I$8>TODAY(),\"\",IF($C23=\"\",\"\",IF(COUNTIF(Date,I$8)>0,\"H\",IF(I$7=\"Sun\",\"H\",IFERROR(VLOOKUP($D23&\"-\"&I$8&\"\",pks_3!$A$1:$E$21,5,0),\"P\")))))","v":""},{"$f":"IF(J$8>TODAY(),\"\",IF($C23=\"\",\"\",IF(COUNTIF(Date,J$8)>0,\"H\",IF(J$7=\"Sun\",\"H\",IFERROR(VLOOKUP($D23&\"-\"&J$8&\"\",pks_3!$A$1:$E$21,5,0),\"P\")))))","v":""},{"$f":"IF(K$8>TODAY(),\"\",IF($C23=\"\",\"\",IF(COUNTIF(Date,K$8)>0,\"H\",IF(K$7=\"Sun\",\"H\",IFERROR(VLOOKUP($D23&\"-\"&K$8&\"\",pks_3!$A$1:$E$21,5,0),\"P\")))))","v":""},{"$f":"IF(L$8>TODAY(),\"\",IF($C23=\"\",\"\",IF(COUNTIF(Date,L$8)>0,\"H\",IF(L$7=\"Sun\",\"H\",IFERROR(VLOOKUP($D23&\"-\"&L$8&\"\",pks_3!$A$1:$E$21,5,0),\"P\")))))","v":""},{"$f":"IF(M$8>TODAY(),\"\",IF($C23=\"\",\"\",IF(COUNTIF(Date,M$8)>0,\"H\",IF(M$7=\"Sun\",\"H\",IFERROR(VLOOKUP($D23&\"-\"&M$8&\"\",pks_3!$A$1:$E$21,5,0),\"P\")))))","v":""},{"$f":"IF(N$8>TODAY(),\"\",IF($C23=\"\",\"\",IF(COUNTIF(Date,N$8)>0,\"H\",IF(N$7=\"Sun\",\"H\",IFERROR(VLOOKUP($D23&\"-\"&N$8&\"\",pks_3!$A$1:$E$21,5,0),\"P\")))))","v":""},{"$f":"IF(O$8>TODAY(),\"\",IF($C23=\"\",\"\",IF(COUNTIF(Date,O$8)>0,\"H\",IF(O$7=\"Sun\",\"H\",IFERROR(VLOOKUP($D23&\"-\"&O$8&\"\",pks_3!$A$1:$E$21,5,0),\"P\")))))","v":""},{"$f":"IF(P$8>TODAY(),\"\",IF($C23=\"\",\"\",IF(COUNTIF(Date,P$8)>0,\"H\",IF(P$7=\"Sun\",\"H\",IFERROR(VLOOKUP($D23&\"-\"&P$8&\"\",pks_3!$A$1:$E$21,5,0),\"P\")))))","v":""},{"$f":"IF(Q$8>TODAY(),\"\",IF($C23=\"\",\"\",IF(COUNTIF(Date,Q$8)>0,\"H\",IF(Q$7=\"Sun\",\"H\",IFERROR(VLOOKUP($D23&\"-\"&Q$8&\"\",pks_3!$A$1:$E$21,5,0),\"P\")))))","v":""},{"$f":"IF(R$8>TODAY(),\"\",IF($C23=\"\",\"\",IF(COUNTIF(Date,R$8)>0,\"H\",IF(R$7=\"Sun\",\"H\",IFERROR(VLOOKUP($D23&\"-\"&R$8&\"\",pks_3!$A$1:$E$21,5,0),\"P\")))))","v":""},{"$f":"IF(S$8>TODAY(),\"\",IF($C23=\"\",\"\",IF(COUNTIF(Date,S$8)>0,\"H\",IF(S$7=\"Sun\",\"H\",IFERROR(VLOOKUP($D23&\"-\"&S$8&\"\",pks_3!$A$1:$E$21,5,0),\"P\")))))","v":""},{"$f":"IF(T$8>TODAY(),\"\",IF($C23=\"\",\"\",IF(COUNTIF(Date,T$8)>0,\"H\",IF(T$7=\"Sun\",\"H\",IFERROR(VLOOKUP($D23&\"-\"&T$8&\"\",pks_3!$A$1:$E$21,5,0),\"P\")))))","v":""},{"$f":"IF(U$8>TODAY(),\"\",IF($C23=\"\",\"\",IF(COUNTIF(Date,U$8)>0,\"H\",IF(U$7=\"Sun\",\"H\",IFERROR(VLOOKUP($D23&\"-\"&U$8&\"\",pks_3!$A$1:$E$21,5,0),\"P\")))))","v":""},{"$f":"IF(V$8>TODAY(),\"\",IF($C23=\"\",\"\",IF(COUNTIF(Date,V$8)>0,\"H\",IF(V$7=\"Sun\",\"H\",IFERROR(VLOOKUP($D23&\"-\"&V$8&\"\",pks_3!$A$1:$E$21,5,0),\"P\")))))","v":""},{"$f":"IF(W$8>TODAY(),\"\",IF($C23=\"\",\"\",IF(COUNTIF(Date,W$8)>0,\"H\",IF(W$7=\"Sun\",\"H\",IFERROR(VLOOKUP($D23&\"-\"&W$8&\"\",pks_3!$A$1:$E$21,5,0),\"P\")))))","v":""},{"$f":"IF(X$8>TODAY(),\"\",IF($C23=\"\",\"\",IF(COUNTIF(Date,X$8)>0,\"H\",IF(X$7=\"Sun\",\"H\",IFERROR(VLOOKUP($D23&\"-\"&X$8&\"\",pks_3!$A$1:$E$21,5,0),\"P\")))))","v":""},{"$f":"IF(Y$8>TODAY(),\"\",IF($C23=\"\",\"\",IF(COUNTIF(Date,Y$8)>0,\"H\",IF(Y$7=\"Sun\",\"H\",IFERROR(VLOOKUP($D23&\"-\"&Y$8&\"\",pks_3!$A$1:$E$21,5,0),\"P\")))))","v":""},{"$f":"IF(Z$8>TODAY(),\"\",IF($C23=\"\",\"\",IF(COUNTIF(Date,Z$8)>0,\"H\",IF(Z$7=\"Sun\",\"H\",IFERROR(VLOOKUP($D23&\"-\"&Z$8&\"\",pks_3!$A$1:$E$21,5,0),\"P\")))))","v":""},{"$f":"IF(AA$8>TODAY(),\"\",IF($C23=\"\",\"\",IF(COUNTIF(Date,AA$8)>0,\"H\",IF(AA$7=\"Sun\",\"H\",IFERROR(VLOOKUP($D23&\"-\"&AA$8&\"\",pks_3!$A$1:$E$21,5,0),\"P\")))))","v":""},{"$f":"IF(AB$8>TODAY(),\"\",IF($C23=\"\",\"\",IF(COUNTIF(Date,AB$8)>0,\"H\",IF(AB$7=\"Sun\",\"H\",IFERROR(VLOOKUP($D23&\"-\"&AB$8&\"\",pks_3!$A$1:$E$21,5,0),\"P\")))))","v":""},{"$f":"IF(AC$8>TODAY(),\"\",IF($C23=\"\",\"\",IF(COUNTIF(Date,AC$8)>0,\"H\",IF(AC$7=\"Sun\",\"H\",IFERROR(VLOOKUP($D23&\"-\"&AC$8&\"\",pks_3!$A$1:$E$21,5,0),\"P\")))))","v":""},{"$f":"IF(AD$8>TODAY(),\"\",IF($C23=\"\",\"\",IF(COUNTIF(Date,AD$8)>0,\"H\",IF(AD$7=\"Sun\",\"H\",IFERROR(VLOOKUP($D23&\"-\"&AD$8&\"\",pks_3!$A$1:$E$21,5,0),\"P\")))))","v":""},{"$f":"IF(AE$8>TODAY(),\"\",IF($C23=\"\",\"\",IF(COUNTIF(Date,AE$8)>0,\"H\",IF(AE$7=\"Sun\",\"H\",IFERROR(VLOOKUP($D23&\"-\"&AE$8&\"\",pks_3!$A$1:$E$21,5,0),\"P\")))))","v":""},{"$f":"IF(AF$8>TODAY(),\"\",IF($C23=\"\",\"\",IF(COUNTIF(Date,AF$8)>0,\"H\",IF(AF$7=\"Sun\",\"H\",IFERROR(VLOOKUP($D23&\"-\"&AF$8&\"\",pks_3!$A$1:$E$21,5,0),\"P\")))))","v":""},{"$f":"IF(AG$8>TODAY(),\"\",IF($C23=\"\",\"\",IF(COUNTIF(Date,AG$8)>0,\"H\",IF(AG$7=\"Sun\",\"H\",IFERROR(VLOOKUP($D23&\"-\"&AG$8&\"\",pks_3!$A$1:$E$21,5,0),\"P\")))))","v":""},{"$f":"IF(AH$8>TODAY(),\"\",IF($C23=\"\",\"\",IF(COUNTIF(Date,AH$8)>0,\"H\",IF(AH$7=\"Sun\",\"H\",IFERROR(VLOOKUP($D23&\"-\"&AH$8&\"\",pks_3!$A$1:$E$21,5,0),\"P\")))))","v":""},{"$f":"IF(AI$8>TODAY(),\"\",IF($C23=\"\",\"\",IF(COUNTIF(Date,AI$8)>0,\"H\",IF(AI$7=\"Sun\",\"H\",IFERROR(VLOOKUP($D23&\"-\"&AI$8&\"\",pks_3!$A$1:$E$21,5,0),\"P\")))))","v":""},0,0,0,0]
[null,{"$f":"IF(C24=\"\",\"\",COUNTA($C$9:C24))","v":""},null,null,{"$f":"IF(E$8>TODAY(),\"\",IF($C24=\"\",\"\",IF(COUNTIF(Date,E$8)>0,\"H\",IF(E$7=\"Sun\",\"H\",IFERROR(VLOOKUP($D24&\"-\"&E$8&\"\",pks_3!$A$1:$E$21,5,0),\"P\")))))","v":""},{"$f":"IF(F$8>TODAY(),\"\",IF($C24=\"\",\"\",IF(COUNTIF(Date,F$8)>0,\"H\",IF(F$7=\"Sun\",\"H\",IFERROR(VLOOKUP($D24&\"-\"&F$8&\"\",pks_3!$A$1:$E$21,5,0),\"P\")))))","v":""},{"$f":"IF(G$8>TODAY(),\"\",IF($C24=\"\",\"\",IF(COUNTIF(Date,G$8)>0,\"H\",IF(G$7=\"Sun\",\"H\",IFERROR(VLOOKUP($D24&\"-\"&G$8&\"\",pks_3!$A$1:$E$21,5,0),\"P\")))))","v":""},{"$f":"IF(H$8>TODAY(),\"\",IF($C24=\"\",\"\",IF(COUNTIF(Date,H$8)>0,\"H\",IF(H$7=\"Sun\",\"H\",IFERROR(VLOOKUP($D24&\"-\"&H$8&\"\",pks_3!$A$1:$E$21,5,0),\"P\")))))","v":""},{"$f":"IF(I$8>TODAY(),\"\",IF($C24=\"\",\"\",IF(COUNTIF(Date,I$8)>0,\"H\",IF(I$7=\"Sun\",\"H\",IFERROR(VLOOKUP($D24&\"-\"&I$8&\"\",pks_3!$A$1:$E$21,5,0),\"P\")))))","v":""},{"$f":"IF(J$8>TODAY(),\"\",IF($C24=\"\",\"\",IF(COUNTIF(Date,J$8)>0,\"H\",IF(J$7=\"Sun\",\"H\",IFERROR(VLOOKUP($D24&\"-\"&J$8&\"\",pks_3!$A$1:$E$21,5,0),\"P\")))))","v":""},{"$f":"IF(K$8>TODAY(),\"\",IF($C24=\"\",\"\",IF(COUNTIF(Date,K$8)>0,\"H\",IF(K$7=\"Sun\",\"H\",IFERROR(VLOOKUP($D24&\"-\"&K$8&\"\",pks_3!$A$1:$E$21,5,0),\"P\")))))","v":""},{"$f":"IF(L$8>TODAY(),\"\",IF($C24=\"\",\"\",IF(COUNTIF(Date,L$8)>0,\"H\",IF(L$7=\"Sun\",\"H\",IFERROR(VLOOKUP($D24&\"-\"&L$8&\"\",pks_3!$A$1:$E$21,5,0),\"P\")))))","v":""},{"$f":"IF(M$8>TODAY(),\"\",IF($C24=\"\",\"\",IF(COUNTIF(Date,M$8)>0,\"H\",IF(M$7=\"Sun\",\"H\",IFERROR(VLOOKUP($D24&\"-\"&M$8&\"\",pks_3!$A$1:$E$21,5,0),\"P\")))))","v":""},{"$f":"IF(N$8>TODAY(),\"\",IF($C24=\"\",\"\",IF(COUNTIF(Date,N$8)>0,\"H\",IF(N$7=\"Sun\",\"H\",IFERROR(VLOOKUP($D24&\"-\"&N$8&\"\",pks_3!$A$1:$E$21,5,0),\"P\")))))","v":""},{"$f":"IF(O$8>TODAY(),\"\",IF($C24=\"\",\"\",IF(COUNTIF(Date,O$8)>0,\"H\",IF(O$7=\"Sun\",\"H\",IFERROR(VLOOKUP($D24&\"-\"&O$8&\"\",pks_3!$A$1:$E$21,5,0),\"P\")))))","v":""},{"$f":"IF(P$8>TODAY(),\"\",IF($C24=\"\",\"\",IF(COUNTIF(Date,P$8)>0,\"H\",IF(P$7=\"Sun\",\"H\",IFERROR(VLOOKUP($D24&\"-\"&P$8&\"\",pks_3!$A$1:$E$21,5,0),\"P\")))))","v":""},{"$f":"IF(Q$8>TODAY(),\"\",IF($C24=\"\",\"\",IF(COUNTIF(Date,Q$8)>0,\"H\",IF(Q$7=\"Sun\",\"H\",IFERROR(VLOOKUP($D24&\"-\"&Q$8&\"\",pks_3!$A$1:$E$21,5,0),\"P\")))))","v":""},{"$f":"IF(R$8>TODAY(),\"\",IF($C24=\"\",\"\",IF(COUNTIF(Date,R$8)>0,\"H\",IF(R$7=\"Sun\",\"H\",IFERROR(VLOOKUP($D24&\"-\"&R$8&\"\",pks_3!$A$1:$E$21,5,0),\"P\")))))","v":""},{"$f":"IF(S$8>TODAY(),\"\",IF($C24=\"\",\"\",IF(COUNTIF(Date,S$8)>0,\"H\",IF(S$7=\"Sun\",\"H\",IFERROR(VLOOKUP($D24&\"-\"&S$8&\"\",pks_3!$A$1:$E$21,5,0),\"P\")))))","v":""},{"$f":"IF(T$8>TODAY(),\"\",IF($C24=\"\",\"\",IF(COUNTIF(Date,T$8)>0,\"H\",IF(T$7=\"Sun\",\"H\",IFERROR(VLOOKUP($D24&\"-\"&T$8&\"\",pks_3!$A$1:$E$21,5,0),\"P\")))))","v":""},{"$f":"IF(U$8>TODAY(),\"\",IF($C24=\"\",\"\",IF(COUNTIF(Date,U$8)>0,\"H\",IF(U$7=\"Sun\",\"H\",IFERROR(VLOOKUP($D24&\"-\"&U$8&\"\",pks_3!$A$1:$E$21,5,0),\"P\")))))","v":""},{"$f":"IF(V$8>TODAY(),\"\",IF($C24=\"\",\"\",IF(COUNTIF(Date,V$8)>0,\"H\",IF(V$7=\"Sun\",\"H\",IFERROR(VLOOKUP($D24&\"-\"&V$8&\"\",pks_3!$A$1:$E$21,5,0),\"P\")))))","v":""},{"$f":"IF(W$8>TODAY(),\"\",IF($C24=\"\",\"\",IF(COUNTIF(Date,W$8)>0,\"H\",IF(W$7=\"Sun\",\"H\",IFERROR(VLOOKUP($D24&\"-\"&W$8&\"\",pks_3!$A$1:$E$21,5,0),\"P\")))))","v":""},{"$f":"IF(X$8>TODAY(),\"\",IF($C24=\"\",\"\",IF(COUNTIF(Date,X$8)>0,\"H\",IF(X$7=\"Sun\",\"H\",IFERROR(VLOOKUP($D24&\"-\"&X$8&\"\",pks_3!$A$1:$E$21,5,0),\"P\")))))","v":""},{"$f":"IF(Y$8>TODAY(),\"\",IF($C24=\"\",\"\",IF(COUNTIF(Date,Y$8)>0,\"H\",IF(Y$7=\"Sun\",\"H\",IFERROR(VLOOKUP($D24&\"-\"&Y$8&\"\",pks_3!$A$1:$E$21,5,0),\"P\")))))","v":""},{"$f":"IF(Z$8>TODAY(),\"\",IF($C24=\"\",\"\",IF(COUNTIF(Date,Z$8)>0,\"H\",IF(Z$7=\"Sun\",\"H\",IFERROR(VLOOKUP($D24&\"-\"&Z$8&\"\",pks_3!$A$1:$E$21,5,0),\"P\")))))","v":""},{"$f":"IF(AA$8>TODAY(),\"\",IF($C24=\"\",\"\",IF(COUNTIF(Date,AA$8)>0,\"H\",IF(AA$7=\"Sun\",\"H\",IFERROR(VLOOKUP($D24&\"-\"&AA$8&\"\",pks_3!$A$1:$E$21,5,0),\"P\")))))","v":""},{"$f":"IF(AB$8>TODAY(),\"\",IF($C24=\"\",\"\",IF(COUNTIF(Date,AB$8)>0,\"H\",IF(AB$7=\"Sun\",\"H\",IFERROR(VLOOKUP($D24&\"-\"&AB$8&\"\",pks_3!$A$1:$E$21,5,0),\"P\")))))","v":""},{"$f":"IF(AC$8>TODAY(),\"\",IF($C24=\"\",\"\",IF(COUNTIF(Date,AC$8)>0,\"H\",IF(AC$7=\"Sun\",\"H\",IFERROR(VLOOKUP($D24&\"-\"&AC$8&\"\",pks_3!$A$1:$E$21,5,0),\"P\")))))","v":""},{"$f":"IF(AD$8>TODAY(),\"\",IF($C24=\"\",\"\",IF(COUNTIF(Date,AD$8)>0,\"H\",IF(AD$7=\"Sun\",\"H\",IFERROR(VLOOKUP($D24&\"-\"&AD$8&\"\",pks_3!$A$1:$E$21,5,0),\"P\")))))","v":""},{"$f":"IF(AE$8>TODAY(),\"\",IF($C24=\"\",\"\",IF(COUNTIF(Date,AE$8)>0,\"H\",IF(AE$7=\"Sun\",\"H\",IFERROR(VLOOKUP($D24&\"-\"&AE$8&\"\",pks_3!$A$1:$E$21,5,0),\"P\")))))","v":""},{"$f":"IF(AF$8>TODAY(),\"\",IF($C24=\"\",\"\",IF(COUNTIF(Date,AF$8)>0,\"H\",IF(AF$7=\"Sun\",\"H\",IFERROR(VLOOKUP($D24&\"-\"&AF$8&\"\",pks_3!$A$1:$E$21,5,0),\"P\")))))","v":""},{"$f":"IF(AG$8>TODAY(),\"\",IF($C24=\"\",\"\",IF(COUNTIF(Date,AG$8)>0,\"H\",IF(AG$7=\"Sun\",\"H\",IFERROR(VLOOKUP($D24&\"-\"&AG$8&\"\",pks_3!$A$1:$E$21,5,0),\"P\")))))","v":""},{"$f":"IF(AH$8>TODAY(),\"\",IF($C24=\"\",\"\",IF(COUNTIF(Date,AH$8)>0,\"H\",IF(AH$7=\"Sun\",\"H\",IFERROR(VLOOKUP($D24&\"-\"&AH$8&\"\",pks_3!$A$1:$E$21,5,0),\"P\")))))","v":""},{"$f":"IF(AI$8>TODAY(),\"\",IF($C24=\"\",\"\",IF(COUNTIF(Date,AI$8)>0,\"H\",IF(AI$7=\"Sun\",\"H\",IFERROR(VLOOKUP($D24&\"-\"&AI$8&\"\",pks_3!$A$1:$E$21,5,0),\"P\")))))","v":""},0,0,0,0]
[null,{"$f":"IF(C25=\"\",\"\",COUNTA($C$9:C25))","v":""},null,null,{"$f":"IF(E$8>TODAY(),\"\",IF($C25=\"\",\"\",IF(COUNTIF(Date,E$8)>0,\"H\",IF(E$7=\"Sun\",\"H\",IFERROR(VLOOKUP($D25&\"-\"&E$8&\"\",pks_3!$A$1:$E$21,5,0),\"P\")))))","v":""},{"$f":"IF(F$8>TODAY(),\"\",IF($C25=\"\",\"\",IF(COUNTIF(Date,F$8)>0,\"H\",IF(F$7=\"Sun\",\"H\",IFERROR(VLOOKUP($D25&\"-\"&F$8&\"\",pks_3!$A$1:$E$21,5,0),\"P\")))))","v":""},{"$f":"IF(G$8>TODAY(),\"\",IF($C25=\"\",\"\",IF(COUNTIF(Date,G$8)>0,\"H\",IF(G$7=\"Sun\",\"H\",IFERROR(VLOOKUP($D25&\"-\"&G$8&\"\",pks_3!$A$1:$E$21,5,0),\"P\")))))","v":""},{"$f":"IF(H$8>TODAY(),\"\",IF($C25=\"\",\"\",IF(COUNTIF(Date,H$8)>0,\"H\",IF(H$7=\"Sun\",\"H\",IFERROR(VLOOKUP($D25&\"-\"&H$8&\"\",pks_3!$A$1:$E$21,5,0),\"P\")))))","v":""},{"$f":"IF(I$8>TODAY(),\"\",IF($C25=\"\",\"\",IF(COUNTIF(Date,I$8)>0,\"H\",IF(I$7=\"Sun\",\"H\",IFERROR(VLOOKUP($D25&\"-\"&I$8&\"\",pks_3!$A$1:$E$21,5,0),\"P\")))))","v":""},{"$f":"IF(J$8>TODAY(),\"\",IF($C25=\"\",\"\",IF(COUNTIF(Date,J$8)>0,\"H\",IF(J$7=\"Sun\",\"H\",IFERROR(VLOOKUP($D25&\"-\"&J$8&\"\",pks_3!$A$1:$E$21,5,0),\"P\")))))","v":""},{"$f":"IF(K$8>TODAY(),\"\",IF($C25=\"\",\"\",IF(COUNTIF(Date,K$8)>0,\"H\",IF(K$7=\"Sun\",\"H\",IFERROR(VLOOKUP($D25&\"-\"&K$8&\"\",pks_3!$A$1:$E$21,5,0),\"P\")))))","v":""},{"$f":"IF(L$8>TODAY(),\"\",IF($C25=\"\",\"\",IF(COUNTIF(Date,L$8)>0,\"H\",IF(L$7=\"Sun\",\"H\",IFERROR(VLOOKUP($D25&\"-\"&L$8&\"\",pks_3!$A$1:$E$21,5,0),\"P\")))))","v":""},{"$f":"IF(M$8>TODAY(),\"\",IF($C25=\"\",\"\",IF(COUNTIF(Date,M$8)>0,\"H\",IF(M$7=\"Sun\",\"H\",IFERROR(VLOOKUP($D25&\"-\"&M$8&\"\",pks_3!$A$1:$E$21,5,0),\"P\")))))","v":""},{"$f":"IF(N$8>TODAY(),\"\",IF($C25=\"\",\"\",IF(COUNTIF(Date,N$8)>0,\"H\",IF(N$7=\"Sun\",\"H\",IFERROR(VLOOKUP($D25&\"-\"&N$8&\"\",pks_3!$A$1:$E$21,5,0),\"P\")))))","v":""},{"$f":"IF(O$8>TODAY(),\"\",IF($C25=\"\",\"\",IF(COUNTIF(Date,O$8)>0,\"H\",IF(O$7=\"Sun\",\"H\",IFERROR(VLOOKUP($D25&\"-\"&O$8&\"\",pks_3!$A$1:$E$21,5,0),\"P\")))))","v":""},{"$f":"IF(P$8>TODAY(),\"\",IF($C25=\"\",\"\",IF(COUNTIF(Date,P$8)>0,\"H\",IF(P$7=\"Sun\",\"H\",IFERROR(VLOOKUP($D25&\"-\"&P$8&\"\",pks_3!$A$1:$E$21,5,0),\"P\")))))","v":""},{"$f":"IF(Q$8>TODAY(),\"\",IF($C25=\"\",\"\",IF(COUNTIF(Date,Q$8)>0,\"H\",IF(Q$7=\"Sun\",\"H\",IFERROR(VLOOKUP($D25&\"-\"&Q$8&\"\",pks_3!$A$1:$E$21,5,0),\"P\")))))","v":""},{"$f":"IF(R$8>TODAY(),\"\",IF($C25=\"\",\"\",IF(COUNTIF(Date,R$8)>0,\"H\",IF(R$7=\"Sun\",\"H\",IFERROR(VLOOKUP($D25&\"-\"&R$8&\"\",pks_3!$A$1:$E$21,5,0),\"P\")))))","v":""},{"$f":"IF(S$8>TODAY(),\"\",IF($C25=\"\",\"\",IF(COUNTIF(Date,S$8)>0,\"H\",IF(S$7=\"Sun\",\"H\",IFERROR(VLOOKUP($D25&\"-\"&S$8&\"\",pks_3!$A$1:$E$21,5,0),\"P\")))))","v":""},{"$f":"IF(T$8>TODAY(),\"\",IF($C25=\"\",\"\",IF(COUNTIF(Date,T$8)>0,\"H\",IF(T$7=\"Sun\",\"H\",IFERROR(VLOOKUP($D25&\"-\"&T$8&\"\",pks_3!$A$1:$E$21,5,0),\"P\")))))","v":""},{"$f":"IF(U$8>TODAY(),\"\",IF($C25=\"\",\"\",IF(COUNTIF(Date,U$8)>0,\"H\",IF(U$7=\"Sun\",\"H\",IFERROR(VLOOKUP($D25&\"-\"&U$8&\"\",pks_3!$A$1:$E$21,5,0),\"P\")))))","v":""},{"$f":"IF(V$8>TODAY(),\"\",IF($C25=\"\",\"\",IF(COUNTIF(Date,V$8)>0,\"H\",IF(V$7=\"Sun\",\"H\",IFERROR(VLOOKUP($D25&\"-\"&V$8&\"\",pks_3!$A$1:$E$21,5,0),\"P\")))))","v":""},{"$f":"IF(W$8>TODAY(),\"\",IF($C25=\"\",\"\",IF(COUNTIF(Date,W$8)>0,\"H\",IF(W$7=\"Sun\",\"H\",IFERROR(VLOOKUP($D25&\"-\"&W$8&\"\",pks_3!$A$1:$E$21,5,0),\"P\")))))","v":""},{"$f":"IF(X$8>TODAY(),\"\",IF($C25=\"\",\"\",IF(COUNTIF(Date,X$8)>0,\"H\",IF(X$7=\"Sun\",\"H\",IFERROR(VLOOKUP($D25&\"-\"&X$8&\"\",pks_3!$A$1:$E$21,5,0),\"P\")))))","v":""},{"$f":"IF(Y$8>TODAY(),\"\",IF($C25=\"\",\"\",IF(COUNTIF(Date,Y$8)>0,\"H\",IF(Y$7=\"Sun\",\"H\",IFERROR(VLOOKUP($D25&\"-\"&Y$8&\"\",pks_3!$A$1:$E$21,5,0),\"P\")))))","v":""},{"$f":"IF(Z$8>TODAY(),\"\",IF($C25=\"\",\"\",IF(COUNTIF(Date,Z$8)>0,\"H\",IF(Z$7=\"Sun\",\"H\",IFERROR(VLOOKUP($D25&\"-\"&Z$8&\"\",pks_3!$A$1:$E$21,5,0),\"P\")))))","v":""},{"$f":"IF(AA$8>TODAY(),\"\",IF($C25=\"\",\"\",IF(COUNTIF(Date,AA$8)>0,\"H\",IF(AA$7=\"Sun\",\"H\",IFERROR(VLOOKUP($D25&\"-\"&AA$8&\"\",pks_3!$A$1:$E$21,5,0),\"P\")))))","v":""},{"$f":"IF(AB$8>TODAY(),\"\",IF($C25=\"\",\"\",IF(COUNTIF(Date,AB$8)>0,\"H\",IF(AB$7=\"Sun\",\"H\",IFERROR(VLOOKUP($D25&\"-\"&AB$8&\"\",pks_3!$A$1:$E$21,5,0),\"P\")))))","v":""},{"$f":"IF(AC$8>TODAY(),\"\",IF($C25=\"\",\"\",IF(COUNTIF(Date,AC$8)>0,\"H\",IF(AC$7=\"Sun\",\"H\",IFERROR(VLOOKUP($D25&\"-\"&AC$8&\"\",pks_3!$A$1:$E$21,5,0),\"P\")))))","v":""},{"$f":"IF(AD$8>TODAY(),\"\",IF($C25=\"\",\"\",IF(COUNTIF(Date,AD$8)>0,\"H\",IF(AD$7=\"Sun\",\"H\",IFERROR(VLOOKUP($D25&\"-\"&AD$8&\"\",pks_3!$A$1:$E$21,5,0),\"P\")))))","v":""},{"$f":"IF(AE$8>TODAY(),\"\",IF($C25=\"\",\"\",IF(COUNTIF(Date,AE$8)>0,\"H\",IF(AE$7=\"Sun\",\"H\",IFERROR(VLOOKUP($D25&\"-\"&AE$8&\"\",pks_3!$A$1:$E$21,5,0),\"P\")))))","v":""},{"$f":"IF(AF$8>TODAY(),\"\",IF($C25=\"\",\"\",IF(COUNTIF(Date,AF$8)>0,\"H\",IF(AF$7=\"Sun\",\"H\",IFERROR(VLOOKUP($D25&\"-\"&AF$8&\"\",pks_3!$A$1:$E$21,5,0),\"P\")))))","v":""},{"$f":"IF(AG$8>TODAY(),\"\",IF($C25=\"\",\"\",IF(COUNTIF(Date,AG$8)>0,\"H\",IF(AG$7=\"Sun\",\"H\",IFERROR(VLOOKUP($D25&\"-\"&AG$8&\"\",pks_3!$A$1:$E$21,5,0),\"P\")))))","v":""},{"$f":"IF(AH$8>TODAY(),\"\",IF($C25=\"\",\"\",IF(COUNTIF(Date,AH$8)>0,\"H\",IF(AH$7=\"Sun\",\"H\",IFERROR(VLOOKUP($D25&\"-\"&AH$8&\"\",pks_3!$A$1:$E$21,5,0),\"P\")))))","v":""},{"$f":"IF(AI$8>TODAY(),\"\",IF($C25=\"\",\"\",IF(COUNTIF(Date,AI$8)>0,\"H\",IF(AI$7=\"Sun\",\"H\",IFERROR(VLOOKUP($D25&\"-\"&AI$8&\"\",pks_3!$A$1:$E$21,5,0),\"P\")))))","v":""},0,0,0,0]
[null,{"$f":"IF(C26=\"\",\"\",COUNTA($C$9:C26))","v":""},null,null,{"$f":"IF(E$8>TODAY(),\"\",IF($C26=\"\",\"\",IF(COUNTIF(Date,E$8)>0,\"H\",IF(E$7=\"Sun\",\"H\",IFERROR(VLOOKUP($D26&\"-\"&E$8&\"\",pks_3!$A$1:$E$21,5,0),\"P\")))))","v":""},{"$f":"IF(F$8>TODAY(),\"\",IF($C26=\"\",\"\",IF(COUNTIF(Date,F$8)>0,\"H\",IF(F$7=\"Sun\",\"H\",IFERROR(VLOOKUP($D26&\"-\"&F$8&\"\",pks_3!$A$1:$E$21,5,0),\"P\")))))","v":""},{"$f":"IF(G$8>TODAY(),\"\",IF($C26=\"\",\"\",IF(COUNTIF(Date,G$8)>0,\"H\",IF(G$7=\"Sun\",\"H\",IFERROR(VLOOKUP($D26&\"-\"&G$8&\"\",pks_3!$A$1:$E$21,5,0),\"P\")))))","v":""},{"$f":"IF(H$8>TODAY(),\"\",IF($C26=\"\",\"\",IF(COUNTIF(Date,H$8)>0,\"H\",IF(H$7=\"Sun\",\"H\",IFERROR(VLOOKUP($D26&\"-\"&H$8&\"\",pks_3!$A$1:$E$21,5,0),\"P\")))))","v":""},{"$f":"IF(I$8>TODAY(),\"\",IF($C26=\"\",\"\",IF(COUNTIF(Date,I$8)>0,\"H\",IF(I$7=\"Sun\",\"H\",IFERROR(VLOOKUP($D26&\"-\"&I$8&\"\",pks_3!$A$1:$E$21,5,0),\"P\")))))","v":""},{"$f":"IF(J$8>TODAY(),\"\",IF($C26=\"\",\"\",IF(COUNTIF(Date,J$8)>0,\"H\",IF(J$7=\"Sun\",\"H\",IFERROR(VLOOKUP($D26&\"-\"&J$8&\"\",pks_3!$A$1:$E$21,5,0),\"P\")))))","v":""},{"$f":"IF(K$8>TODAY(),\"\",IF($C26=\"\",\"\",IF(COUNTIF(Date,K$8)>0,\"H\",IF(K$7=\"Sun\",\"H\",IFERROR(VLOOKUP($D26&\"-\"&K$8&\"\",pks_3!$A$1:$E$21,5,0),\"P\")))))","v":""},{"$f":"IF(L$8>TODAY(),\"\",IF($C26=\"\",\"\",IF(COUNTIF(Date,L$8)>0,\"H\",IF(L$7=\"Sun\",\"H\",IFERROR(VLOOKUP($D26&\"-\"&L$8&\"\",pks_3!$A$1:$E$21,5,0),\"P\")))))","v":""},{"$f":"IF(M$8>TODAY(),\"\",IF($C26=\"\",\"\",IF(COUNTIF(Date,M$8)>0,\"H\",IF(M$7=\"Sun\",\"H\",IFERROR(VLOOKUP($D26&\"-\"&M$8&\"\",pks_3!$A$1:$E$21,5,0),\"P\")))))","v":""},{"$f":"IF(N$8>TODAY(),\"\",IF($C26=\"\",\"\",IF(COUNTIF(Date,N$8)>0,\"H\",IF(N$7=\"Sun\",\"H\",IFERROR(VLOOKUP($D26&\"-\"&N$8&\"\",pks_3!$A$1:$E$21,5,0),\"P\")))))","v":""},{"$f":"IF(O$8>TODAY(),\"\",IF($C26=\"\",\"\",IF(COUNTIF(Date,O$8)>0,\"H\",IF(O$7=\"Sun\",\"H\",IFERROR(VLOOKUP($D26&\"-\"&O$8&\"\",pks_3!$A$1:$E$21,5,0),\"P\")))))","v":""},{"$f":"IF(P$8>TODAY(),\"\",IF($C26=\"\",\"\",IF(COUNTIF(Date,P$8)>0,\"H\",IF(P$7=\"Sun\",\"H\",IFERROR(VLOOKUP($D26&\"-\"&P$8&\"\",pks_3!$A$1:$E$21,5,0),\"P\")))))","v":""},{"$f":"IF(Q$8>TODAY(),\"\",IF($C26=\"\",\"\",IF(COUNTIF(Date,Q$8)>0,\"H\",IF(Q$7=\"Sun\",\"H\",IFERROR(VLOOKUP($D26&\"-\"&Q$8&\"\",pks_3!$A$1:$E$21,5,0),\"P\")))))","v":""},{"$f":"IF(R$8>TODAY(),\"\",IF($C26=\"\",\"\",IF(COUNTIF(Date,R$8)>0,\"H\",IF(R$7=\"Sun\",\"H\",IFERROR(VLOOKUP($D26&\"-\"&R$8&\"\",pks_3!$A$1:$E$21,5,0),\"P\")))))","v":""},{"$f":"IF(S$8>TODAY(),\"\",IF($C26=\"\",\"\",IF(COUNTIF(Date,S$8)>0,\"H\",IF(S$7=\"Sun\",\"H\",IFERROR(VLOOKUP($D26&\"-\"&S$8&\"\",pks_3!$A$1:$E$21,5,0),\"P\")))))","v":""},{"$f":"IF(T$8>TODAY(),\"\",IF($C26=\"\",\"\",IF(COUNTIF(Date,T$8)>0,\"H\",IF(T$7=\"Sun\",\"H\",IFERROR(VLOOKUP($D26&\"-\"&T$8&\"\",pks_3!$A$1:$E$21,5,0),\"P\")))))","v":""},{"$f":"IF(U$8>TODAY(),\"\",IF($C26=\"\",\"\",IF(COUNTIF(Date,U$8)>0,\"H\",IF(U$7=\"Sun\",\"H\",IFERROR(VLOOKUP($D26&\"-\"&U$8&\"\",pks_3!$A$1:$E$21,5,0),\"P\")))))","v":""},{"$f":"IF(V$8>TODAY(),\"\",IF($C26=\"\",\"\",IF(COUNTIF(Date,V$8)>0,\"H\",IF(V$7=\"Sun\",\"H\",IFERROR(VLOOKUP($D26&\"-\"&V$8&\"\",pks_3!$A$1:$E$21,5,0),\"P\")))))","v":""},{"$f":"IF(W$8>TODAY(),\"\",IF($C26=\"\",\"\",IF(COUNTIF(Date,W$8)>0,\"H\",IF(W$7=\"Sun\",\"H\",IFERROR(VLOOKUP($D26&\"-\"&W$8&\"\",pks_3!$A$1:$E$21,5,0),\"P\")))))","v":""},{"$f":"IF(X$8>TODAY(),\"\",IF($C26=\"\",\"\",IF(COUNTIF(Date,X$8)>0,\"H\",IF(X$7=\"Sun\",\"H\",IFERROR(VLOOKUP($D26&\"-\"&X$8&\"\",pks_3!$A$1:$E$21,5,0),\"P\")))))","v":""},{"$f":"IF(Y$8>TODAY(),\"\",IF($C26=\"\",\"\",IF(COUNTIF(Date,Y$8)>0,\"H\",IF(Y$7=\"Sun\",\"H\",IFERROR(VLOOKUP($D26&\"-\"&Y$8&\"\",pks_3!$A$1:$E$21,5,0),\"P\")))))","v":""},{"$f":"IF(Z$8>TODAY(),\"\",IF($C26=\"\",\"\",IF(COUNTIF(Date,Z$8)>0,\"H\",IF(Z$7=\"Sun\",\"H\",IFERROR(VLOOKUP($D26&\"-\"&Z$8&\"\",pks_3!$A$1:$E$21,5,0),\"P\")))))","v":""},{"$f":"IF(AA$8>TODAY(),\"\",IF($C26=\"\",\"\",IF(COUNTIF(Date,AA$8)>0,\"H\",IF(AA$7=\"Sun\",\"H\",IFERROR(VLOOKUP($D26&\"-\"&AA$8&\"\",pks_3!$A$1:$E$21,5,0),\"P\")))))","v":""},{"$f":"IF(AB$8>TODAY(),\"\",IF($C26=\"\",\"\",IF(COUNTIF(Date,AB$8)>0,\"H\",IF(AB$7=\"Sun\",\"H\",IFERROR(VLOOKUP($D26&\"-\"&AB$8&\"\",pks_3!$A$1:$E$21,5,0),\"P\")))))","v":""},{"$f":"IF(AC$8>TODAY(),\"\",IF($C26=\"\",\"\",IF(COUNTIF(Date,AC$8)>0,\"H\",IF(AC$7=\"Sun\",\"H\",IFERROR(VLOOKUP($D26&\"-\"&AC$8&\"\",pks_3!$A$1:$E$21,5,0),\"P\")))))","v":""},{"$f":"IF(AD$8>TODAY(),\"\",IF($C26=\"\",\"\",IF(COUNTIF(Date,AD$8)>0,\"H\",IF(AD$7=\"Sun\",\"H\",IFERROR(VLOOKUP($D26&\"-\"&AD$8&\"\",pks_3!$A$1:$E$21,5,0),\"P\")))))","v":""},{"$f":"IF(AE$8>TODAY(),\"\",IF($C26=\"\",\"\",IF(COUNTIF(Date,AE$8)>0,\"H\",IF(AE$7=\"Sun\",\"H\",IFERROR(VLOOKUP($D26&\"-\"&AE$8&\"\",pks_3!$A$1:$E$21,5,0),\"P\")))))","v":""},{"$f":"IF(AF$8>TODAY(),\"\",IF($C26=\"\",\"\",IF(COUNTIF(Date,AF$8)>0,\"H\",IF(AF$7=\"Sun\",\"H\",IFERROR(VLOOKUP($D26&\"-\"&AF$8&\"\",pks_3!$A$1:$E$21,5,0),\"P\")))))","v":""},{"$f":"IF(AG$8>TODAY(),\"\",IF($C26=\"\",\"\",IF(COUNTIF(Date,AG$8)>0,\"H\",IF(AG$7=\"Sun\",\"H\",IFERROR(VLOOKUP($D26&\"-\"&AG$8&\"\",pks_3!$A$1:$E$21,5,0),\"P\")))))","v":""},{"$f":"IF(AH$8>TODAY(),\"\",IF($C26=\"\",\"\",IF(COUNTIF(Date,AH$8)>0,\"H\",IF(AH$7=\"Sun\",\"H\",IFERROR(VLOOKUP($D26&\"-\"&AH$8&\"\",pks_3!$A$1:$E$21,5,0),\"P\")))))","v":""},{"$f":"IF(AI$8>TODAY(),\"\",IF($C26=\"\",\"\",IF(COUNTIF(Date,AI$8)>0,\"H\",IF(AI$7=\"Sun\",\"H\",IFERROR(VLOOKUP($D26&\"-\"&AI$8&\"\",pks_3!$A$1:$E$21,5,0),\"P\")))))","v":""},0,0,0,0]
[null,{"$f":"IF(C27=\"\",\"\",COUNTA($C$9:C27))","v":""},null,null,{"$f":"IF(E$8>TODAY(),\"\",IF($C27=\"\",\"\",IF(COUNTIF(Date,E$8)>0,\"H\",IF(E$7=\"Sun\",\"H\",IFERROR(VLOOKUP($D27&\"-\"&E$8&\"\",pks_3!$A$1:$E$21,5,0),\"P\")))))","v":""},{"$f":"IF(F$8>TODAY(),\"\",IF($C27=\"\",\"\",IF(COUNTIF(Date,F$8)>0,\"H\",IF(F$7=\"Sun\",\"H\",IFERROR(VLOOKUP($D27&\"-\"&F$8&\"\",pks_3!$A$1:$E$21,5,0),\"P\")))))","v":""},{"$f":"IF(G$8>TODAY(),\"\",IF($C27=\"\",\"\",IF(COUNTIF(Date,G$8)>0,\"H\",IF(G$7=\"Sun\",\"H\",IFERROR(VLOOKUP($D27&\"-\"&G$8&\"\",pks_3!$A$1:$E$21,5,0),\"P\")))))","v":""},{"$f":"IF(H$8>TODAY(),\"\",IF($C27=\"\",\"\",IF(COUNTIF(Date,H$8)>0,\"H\",IF(H$7=\"Sun\",\"H\",IFERROR(VLOOKUP($D27&\"-\"&H$8&\"\",pks_3!$A$1:$E$21,5,0),\"P\")))))","v":""},{"$f":"IF(I$8>TODAY(),\"\",IF($C27=\"\",\"\",IF(COUNTIF(Date,I$8)>0,\"H\",IF(I$7=\"Sun\",\"H\",IFERROR(VLOOKUP($D27&\"-\"&I$8&\"\",pks_3!$A$1:$E$21,5,0),\"P\")))))","v":""},{"$f":"IF(J$8>TODAY(),\"\",IF($C27=\"\",\"\",IF(COUNTIF(Date,J$8)>0,\"H\",IF(J$7=\"Sun\",\"H\",IFERROR(VLOOKUP($D27&\"-\"&J$8&\"\",pks_3!$A$1:$E$21,5,0),\"P\")))))","v":""},{"$f":"IF(K$8>TODAY(),\"\",IF($C27=\"\",\"\",IF(COUNTIF(Date,K$8)>0,\"H\",IF(K$7=\"Sun\",\"H\",IFERROR(VLOOKUP($D27&\"-\"&K$8&\"\",pks_3!$A$1:$E$21,5,0),\"P\")))))","v":""},{"$f":"IF(L$8>TODAY(),\"\",IF($C27=\"\",\"\",IF(COUNTIF(Date,L$8)>0,\"H\",IF(L$7=\"Sun\",\"H\",IFERROR(VLOOKUP($D27&\"-\"&L$8&\"\",pks_3!$A$1:$E$21,5,0),\"P\")))))","v":""},{"$f":"IF(M$8>TODAY(),\"\",IF($C27=\"\",\"\",IF(COUNTIF(Date,M$8)>0,\"H\",IF(M$7=\"Sun\",\"H\",IFERROR(VLOOKUP($D27&\"-\"&M$8&\"\",pks_3!$A$1:$E$21,5,0),\"P\")))))","v":""},{"$f":"IF(N$8>TODAY(),\"\",IF($C27=\"\",\"\",IF(COUNTIF(Date,N$8)>0,\"H\",IF(N$7=\"Sun\",\"H\",IFERROR(VLOOKUP($D27&\"-\"&N$8&\"\",pks_3!$A$1:$E$21,5,0),\"P\")))))","v":""},{"$f":"IF(O$8>TODAY(),\"\",IF($C27=\"\",\"\",IF(COUNTIF(Date,O$8)>0,\"H\",IF(O$7=\"Sun\",\"H\",IFERROR(VLOOKUP($D27&\"-\"&O$8&\"\",pks_3!$A$1:$E$21,5,0),\"P\")))))","v":""},{"$f":"IF(P$8>TODAY(),\"\",IF($C27=\"\",\"\",IF(COUNTIF(Date,P$8)>0,\"H\",IF(P$7=\"Sun\",\"H\",IFERROR(VLOOKUP($D27&\"-\"&P$8&\"\",pks_3!$A$1:$E$21,5,0),\"P\")))))","v":""},{"$f":"IF(Q$8>TODAY(),\"\",IF($C27=\"\",\"\",IF(COUNTIF(Date,Q$8)>0,\"H\",IF(Q$7=\"Sun\",\"H\",IFERROR(VLOOKUP($D27&\"-\"&Q$8&\"\",pks_3!$A$1:$E$21,5,0),\"P\")))))","v":""},{"$f":"IF(R$8>TODAY(),\"\",IF($C27=\"\",\"\",IF(COUNTIF(Date,R$8)>0,\"H\",IF(R$7=\"Sun\",\"H\",IFERROR(VLOOKUP($D27&\"-\"&R$8&\"\",pks_3!$A$1:$E$21,5,0),\"P\")))))","v":""},{"$f":"IF(S$8>TODAY(),\"\",IF($C27=\"\",\"\",IF(COUNTIF(Date,S$8)>0,\"H\",IF(S$7=\"Sun\",\"H\",IFERROR(VLOOKUP($D27&\"-\"&S$8&\"\",pks_3!$A$1:$E$21,5,0),\"P\")))))","v":""},{"$f":"IF(T$8>TODAY(),\"\",IF($C27=\"\",\"\",IF(COUNTIF(Date,T$8)>0,\"H\",IF(T$7=\"Sun\",\"H\",IFERROR(VLOOKUP($D27&\"-\"&T$8&\"\",pks_3!$A$1:$E$21,5,0),\"P\")))))","v":""},{"$f":"IF(U$8>TODAY(),\"\",IF($C27=\"\",\"\",IF(COUNTIF(Date,U$8)>0,\"H\",IF(U$7=\"Sun\",\"H\",IFERROR(VLOOKUP($D27&\"-\"&U$8&\"\",pks_3!$A$1:$E$21,5,0),\"P\")))))","v":""},{"$f":"IF(V$8>TODAY(),\"\",IF($C27=\"\",\"\",IF(COUNTIF(Date,V$8)>0,\"H\",IF(V$7=\"Sun\",\"H\",IFERROR(VLOOKUP($D27&\"-\"&V$8&\"\",pks_3!$A$1:$E$21,5,0),\"P\")))))","v":""},{"$f":"IF(W$8>TODAY(),\"\",IF($C27=\"\",\"\",IF(COUNTIF(Date,W$8)>0,\"H\",IF(W$7=\"Sun\",\"H\",IFERROR(VLOOKUP($D27&\"-\"&W$8&\"\",pks_3!$A$1:$E$21,5,0),\"P\")))))","v":""},{"$f":"IF(X$8>TODAY(),\"\",IF($C27=\"\",\"\",IF(COUNTIF(Date,X$8)>0,\"H\",IF(X$7=\"Sun\",\"H\",IFERROR(VLOOKUP($D27&\"-\"&X$8&\"\",pks_3!$A$1:$E$21,5,0),\"P\")))))","v":""},{"$f":"IF(Y$8>TODAY(),\"\",IF($C27=\"\",\"\",IF(COUNTIF(Date,Y$8)>0,\"H\",IF(Y$7=\"Sun\",\"H\",IFERROR(VLOOKUP($D27&\"-\"&Y$8&\"\",pks_3!$A$1:$E$21,5,0),\"P\")))))","v":""},{"$f":"IF(Z$8>TODAY(),\"\",IF($C27=\"\",\"\",IF(COUNTIF(Date,Z$8)>0,\"H\",IF(Z$7=\"Sun\",\"H\",IFERROR(VLOOKUP($D27&\"-\"&Z$8&\"\",pks_3!$A$1:$E$21,5,0),\"P\")))))","v":""},{"$f":"IF(AA$8>TODAY(),\"\",IF($C27=\"\",\"\",IF(COUNTIF(Date,AA$8)>0,\"H\",IF(AA$7=\"Sun\",\"H\",IFERROR(VLOOKUP($D27&\"-\"&AA$8&\"\",pks_3!$A$1:$E$21,5,0),\"P\")))))","v":""},{"$f":"IF(AB$8>TODAY(),\"\",IF($C27=\"\",\"\",IF(COUNTIF(Date,AB$8)>0,\"H\",IF(AB$7=\"Sun\",\"H\",IFERROR(VLOOKUP($D27&\"-\"&AB$8&\"\",pks_3!$A$1:$E$21,5,0),\"P\")))))","v":""},{"$f":"IF(AC$8>TODAY(),\"\",IF($C27=\"\",\"\",IF(COUNTIF(Date,AC$8)>0,\"H\",IF(AC$7=\"Sun\",\"H\",IFERROR(VLOOKUP($D27&\"-\"&AC$8&\"\",pks_3!$A$1:$E$21,5,0),\"P\")))))","v":""},{"$f":"IF(AD$8>TODAY(),\"\",IF($C27=\"\",\"\",IF(COUNTIF(Date,AD$8)>0,\"H\",IF(AD$7=\"Sun\",\"H\",IFERROR(VLOOKUP($D27&\"-\"&AD$8&\"\",pks_3!$A$1:$E$21,5,0),\"P\")))))","v":""},{"$f":"IF(AE$8>TODAY(),\"\",IF($C27=\"\",\"\",IF(COUNTIF(Date,AE$8)>0,\"H\",IF(AE$7=\"Sun\",\"H\",IFERROR(VLOOKUP($D27&\"-\"&AE$8&\"\",pks_3!$A$1:$E$21,5,0),\"P\")))))","v":""},{"$f":"IF(AF$8>TODAY(),\"\",IF($C27=\"\",\"\",IF(COUNTIF(Date,AF$8)>0,\"H\",IF(AF$7=\"Sun\",\"H\",IFERROR(VLOOKUP($D27&\"-\"&AF$8&\"\",pks_3!$A$1:$E$21,5,0),\"P\")))))","v":""},{"$f":"IF(AG$8>TODAY(),\"\",IF($C27=\"\",\"\",IF(COUNTIF(Date,AG$8)>0,\"H\",IF(AG$7=\"Sun\",\"H\",IFERROR(VLOOKUP($D27&\"-\"&AG$8&\"\",pks_3!$A$1:$E$21,5,0),\"P\")))))","v":""},{"$f":"IF(AH$8>TODAY(),\"\",IF($C27=\"\",\"\",IF(COUNTIF(Date,AH$8)>0,\"H\",IF(AH$7=\"Sun\",\"H\",IFERROR(VLOOKUP($D27&\"-\"&AH$8&\"\",pks_3!$A$1:$E$21,5,0),\"P\")))))","v":""},{"$f":"IF(AI$8>TODAY(),\"\",IF($C27=\"\",\"\",IF(COUNTIF(Date,AI$8)>0,\"H\",IF(AI$7=\"Sun\",\"H\",IFERROR(VLOOKUP($D27&\"-\"&AI$8&\"\",pks_3!$A$1:$E$21,5,0),\"P\")))))","v":""},0,0,0,0]
[null,{"$f":"IF(C28=\"\",\"\",COUNTA($C$9:C28))","v":""},null,null,{"$f":"IF(E$8>TODAY(),\"\",IF($C28=\"\",\"\",IF(COUNTIF(Date,E$8)>0,\"H\",IF(E$7=\"Sun\",\"H\",IFERROR(VLOOKUP($D28&\"-\"&E$8&\"\",pks_3!$A$1:$E$21,5,0),\"P\")))))","v":""},{"$f":"IF(F$8>TODAY(),\"\",IF($C28=\"\",\"\",IF(COUNTIF(Date,F$8)>0,\"H\",IF(F$7=\"Sun\",\"H\",IFERROR(VLOOKUP($D28&\"-\"&F$8&\"\",pks_3!$A$1:$E$21,5,0),\"P\")))))","v":""},{"$f":"IF(G$8>TODAY(),\"\",IF($C28=\"\",\"\",IF(COUNTIF(Date,G$8)>0,\"H\",IF(G$7=\"Sun\",\"H\",IFERROR(VLOOKUP($D28&\"-\"&G$8&\"\",pks_3!$A$1:$E$21,5,0),\"P\")))))","v":""},{"$f":"IF(H$8>TODAY(),\"\",IF($C28=\"\",\"\",IF(COUNTIF(Date,H$8)>0,\"H\",IF(H$7=\"Sun\",\"H\",IFERROR(VLOOKUP($D28&\"-\"&H$8&\"\",pks_3!$A$1:$E$21,5,0),\"P\")))))","v":""},{"$f":"IF(I$8>TODAY(),\"\",IF($C28=\"\",\"\",IF(COUNTIF(Date,I$8)>0,\"H\",IF(I$7=\"Sun\",\"H\",IFERROR(VLOOKUP($D28&\"-\"&I$8&\"\",pks_3!$A$1:$E$21,5,0),\"P\")))))","v":""},{"$f":"IF(J$8>TODAY(),\"\",IF($C28=\"\",\"\",IF(COUNTIF(Date,J$8)>0,\"H\",IF(J$7=\"Sun\",\"H\",IFERROR(VLOOKUP($D28&\"-\"&J$8&\"\",pks_3!$A$1:$E$21,5,0),\"P\")))))","v":""},{"$f":"IF(K$8>TODAY(),\"\",IF($C28=\"\",\"\",IF(COUNTIF(Date,K$8)>0,\"H\",IF(K$7=\"Sun\",\"H\",IFERROR(VLOOKUP($D28&\"-\"&K$8&\"\",pks_3!$A$1:$E$21,5,0),\"P\")))))","v":""},{"$f":"IF(L$8>TODAY(),\"\",IF($C28=\"\",\"\",IF(COUNTIF(Date,L$8)>0,\"H\",IF(L$7=\"Sun\",\"H\",IFERROR(VLOOKUP($D28&\"-\"&L$8&\"\",pks_3!$A$1:$E$21,5,0),\"P\")))))","v":""},{"$f":"IF(M$8>TODAY(),\"\",IF($C28=\"\",\"\",IF(COUNTIF(Date,M$8)>0,\"H\",IF(M$7=\"Sun\",\"H\",IFERROR(VLOOKUP($D28&\"-\"&M$8&\"\",pks_3!$A$1:$E$21,5,0),\"P\")))))","v":""},{"$f":"IF(N$8>TODAY(),\"\",IF($C28=\"\",\"\",IF(COUNTIF(Date,N$8)>0,\"H\",IF(N$7=\"Sun\",\"H\",IFERROR(VLOOKUP($D28&\"-\"&N$8&\"\",pks_3!$A$1:$E$21,5,0),\"P\")))))","v":""},{"$f":"IF(O$8>TODAY(),\"\",IF($C28=\"\",\"\",IF(COUNTIF(Date,O$8)>0,\"H\",IF(O$7=\"Sun\",\"H\",IFERROR(VLOOKUP($D28&\"-\"&O$8&\"\",pks_3!$A$1:$E$21,5,0),\"P\")))))","v":""},{"$f":"IF(P$8>TODAY(),\"\",IF($C28=\"\",\"\",IF(COUNTIF(Date,P$8)>0,\"H\",IF(P$7=\"Sun\",\"H\",IFERROR(VLOOKUP($D28&\"-\"&P$8&\"\",pks_3!$A$1:$E$21,5,0),\"P\")))))","v":""},{"$f":"IF(Q$8>TODAY(),\"\",IF($C28=\"\",\"\",IF(COUNTIF(Date,Q$8)>0,\"H\",IF(Q$7=\"Sun\",\"H\",IFERROR(VLOOKUP($D28&\"-\"&Q$8&\"\",pks_3!$A$1:$E$21,5,0),\"P\")))))","v":""},{"$f":"IF(R$8>TODAY(),\"\",IF($C28=\"\",\"\",IF(COUNTIF(Date,R$8)>0,\"H\",IF(R$7=\"Sun\",\"H\",IFERROR(VLOOKUP($D28&\"-\"&R$8&\"\",pks_3!$A$1:$E$21,5,0),\"P\")))))","v":""},{"$f":"IF(S$8>TODAY(),\"\",IF($C28=\"\",\"\",IF(COUNTIF(Date,S$8)>0,\"H\",IF(S$7=\"Sun\",\"H\",IFERROR(VLOOKUP($D28&\"-\"&S$8&\"\",pks_3!$A$1:$E$21,5,0),\"P\")))))","v":""},{"$f":"IF(T$8>TODAY(),\"\",IF($C28=\"\",\"\",IF(COUNTIF(Date,T$8)>0,\"H\",IF(T$7=\"Sun\",\"H\",IFERROR(VLOOKUP($D28&\"-\"&T$8&\"\",pks_3!$A$1:$E$21,5,0),\"P\")))))","v":""},{"$f":"IF(U$8>TODAY(),\"\",IF($C28=\"\",\"\",IF(COUNTIF(Date,U$8)>0,\"H\",IF(U$7=\"Sun\",\"H\",IFERROR(VLOOKUP($D28&\"-\"&U$8&\"\",pks_3!$A$1:$E$21,5,0),\"P\")))))","v":""},{"$f":"IF(V$8>TODAY(),\"\",IF($C28=\"\",\"\",IF(COUNTIF(Date,V$8)>0,\"H\",IF(V$7=\"Sun\",\"H\",IFERROR(VLOOKUP($D28&\"-\"&V$8&\"\",pks_3!$A$1:$E$21,5,0),\"P\")))))","v":""},{"$f":"IF(W$8>TODAY(),\"\",IF($C28=\"\",\"\",IF(COUNTIF(Date,W$8)>0,\"H\",IF(W$7=\"Sun\",\"H\",IFERROR(VLOOKUP($D28&\"-\"&W$8&\"\",pks_3!$A$1:$E$21,5,0),\"P\")))))","v":""},{"$f":"IF(X$8>TODAY(),\"\",IF($C28=\"\",\"\",IF(COUNTIF(Date,X$8)>0,\"H\",IF(X$7=\"Sun\",\"H\",IFERROR(VLOOKUP($D28&\"-\"&X$8&\"\",pks_3!$A$1:$E$21,5,0),\"P\")))))","v":""},{"$f":"IF(Y$8>TODAY(),\"\",IF($C28=\"\",\"\",IF(COUNTIF(Date,Y$8)>0,\"H\",IF(Y$7=\"Sun\",\"H\",IFERROR(VLOOKUP($D28&\"-\"&Y$8&\"\",pks_3!$A$1:$E$21,5,0),\"P\")))))","v":""},{"$f":"IF(Z$8>TODAY(),\"\",IF($C28=\"\",\"\",IF(COUNTIF(Date,Z$8)>0,\"H\",IF(Z$7=\"Sun\",\"H\",IFERROR(VLOOKUP($D28&\"-\"&Z$8&\"\",pks_3!$A$1:$E$21,5,0),\"P\")))))","v":""},{"$f":"IF(AA$8>TODAY(),\"\",IF($C28=\"\",\"\",IF(COUNTIF(Date,AA$8)>0,\"H\",IF(AA$7=\"Sun\",\"H\",IFERROR(VLOOKUP($D28&\"-\"&AA$8&\"\",pks_3!$A$1:$E$21,5,0),\"P\")))))","v":""},{"$f":"IF(AB$8>TODAY(),\"\",IF($C28=\"\",\"\",IF(COUNTIF(Date,AB$8)>0,\"H\",IF(AB$7=\"Sun\",\"H\",IFERROR(VLOOKUP($D28&\"-\"&AB$8&\"\",pks_3!$A$1:$E$21,5,0),\"P\")))))","v":""},{"$f":"IF(AC$8>TODAY(),\"\",IF($C28=\"\",\"\",IF(COUNTIF(Date,AC$8)>0,\"H\",IF(AC$7=\"Sun\",\"H\",IFERROR(VLOOKUP($D28&\"-\"&AC$8&\"\",pks_3!$A$1:$E$21,5,0),\"P\")))))","v":""},{"$f":"IF(AD$8>TODAY(),\"\",IF($C28=\"\",\"\",IF(COUNTIF(Date,AD$8)>0,\"H\",IF(AD$7=\"Sun\",\"H\",IFERROR(VLOOKUP($D28&\"-\"&AD$8&\"\",pks_3!$A$1:$E$21,5,0),\"P\")))))","v":""},{"$f":"IF(AE$8>TODAY(),\"\",IF($C28=\"\",\"\",IF(COUNTIF(Date,AE$8)>0,\"H\",IF(AE$7=\"Sun\",\"H\",IFERROR(VLOOKUP($D28&\"-\"&AE$8&\"\",pks_3!$A$1:$E$21,5,0),\"P\")))))","v":""},{"$f":"IF(AF$8>TODAY(),\"\",IF($C28=\"\",\"\",IF(COUNTIF(Date,AF$8)>0,\"H\",IF(AF$7=\"Sun\",\"H\",IFERROR(VLOOKUP($D28&\"-\"&AF$8&\"\",pks_3!$A$1:$E$21,5,0),\"P\")))))","v":""},{"$f":"IF(AG$8>TODAY(),\"\",IF($C28=\"\",\"\",IF(COUNTIF(Date,AG$8)>0,\"H\",IF(AG$7=\"Sun\",\"H\",IFERROR(VLOOKUP($D28&\"-\"&AG$8&\"\",pks_3!$A$1:$E$21,5,0),\"P\")))))","v":""},{"$f":"IF(AH$8>TODAY(),\"\",IF($C28=\"\",\"\",IF(COUNTIF(Date,AH$8)>0,\"H\",IF(AH$7=\"Sun\",\"H\",IFERROR(VLOOKUP($D28&\"-\"&AH$8&\"\",pks_3!$A$1:$E$21,5,0),\"P\")))))","v":""},{"$f":"IF(AI$8>TODAY(),\"\",IF($C28=\"\",\"\",IF(COUNTIF(Date,AI$8)>0,\"H\",IF(AI$7=\"Sun\",\"H\",IFERROR(VLOOKUP($D28&\"-\"&AI$8&\"\",pks_3!$A$1:$E$21,5,0),\"P\")))))","v":""},0,0,0,0]

{"sheet":"pks_2","index":1,"n_rows":2,"n_cols":2,"rows_kept":2,"cut":false,"hidden":false,"merged":[]}
[null,"Holiday Date"]
[null,"2024-10-02"]

{"sheet":"pks_3","index":2,"n_rows":21,"n_cols":5,"rows_kept":21,"cut":false,"hidden":false,"merged":[]}
[2012,"Employee Name","Employee ID","Date","Leave Type"]
[{"$f":"C2&\"-\"&D2&\"\"","v":"5678-45572"},"Pramod Kumar Saini",5678,"2024-10-07","C/L"]
[{"$f":"C3&\"-\"&D3&\"\"","v":"-"}]
["-"]
["-"]
["1234-45577","Pramod Kumar Saini",1234,"2024-10-12","P/L"]
["-"]
["-"]
["-"]
["-"]
["-"]
["-"]
["-"]
["-"]
["-"]
["-"]
["-"]
["-"]
["-"]
["-"]
["-"]