{"text_format":"1","workbook":"xlsx","n_sheets":3,"sheets":["pks_1","pks_2","pks_3"],"not_rendered":{"charts":0,"images":1,"macros":1,"external_links":0,"defined_names":5,"comments":0,"pivot_tables":0},"unopened":[],"bounds":{"document_bytes":16777216,"sheet_cells":100000,"rows_first":2000,"rows_last":500,"rows_between":2000,"halvings":0,"cell_chars":16384,"cell_head_chars":4096},"cells_cut":0,"cells_raw":0,"read":"whole","date_system":"1900"}

{"sheet":"pks_1","index":0,"n_rows":28,"n_cols":39,"rows_kept":28,"cut":false,"hidden":false,"merged":[[0,1,0,38],[2,4,2,31],[6,1,7,1],[6,2,7,2],[6,3,7,3],[6,35,7,35],[6,36,6,38]]}
[null,"Govt Sr Sc School Malutana (Thanagazi) Alwar"]
[]
[null,null,"2023-01-01",null,"कर्मचारी मासिक उपस्थिति पत्रक"]
[]
[null,null,{"$f":"\"माह/वर्ष :- \"&TEXT(E8,\"MMM/YYYY\")","v":"माह/वर्ष :- Jan/2023"},null,{"$f":"\" कुल दिवस :- \"&COUNT(E8:AI8)","v":" कुल दिवस :- 31"},null,null,null,null,null,null,null,null,null,{"$f":"\"अवकाश : भारत सरकार, राजस्थान सरकार, विभागीय, साप्ताहिक, स्थानीय एवं अन्य :- \"&COUNTIFS(E9:AI9,\"H\")","v":"अवकाश : भारत सरकार, राजस्थान सरकार, विभागीय, साप्ताहिक, स्थानीय एवं अन्य :- 5"},null,null,null,null,null,null,null,null,null,null,null,null,null,null,null,null,null,null,null,{"$f":"\"कुल कार्यदिवस :-\"&COUNT(E8:AI8)-COUNTIFS(E9:AI9,\"H\")","v":"कुल कार्यदिवस :-26"}]
[]
[null,"क्र.सं.","नाम कर्मचारी /अधिकारी ","एम्प्लोयी आईडी",{"$f":"TEXT(E8,\"DDD\")","v":"Sun"},{"$f":"TEXT(F8,\"DDD\")","v":"Mon"},"Tue","Wed","Thu","Fri","Sat","Sun","Mon","Tue","Wed","Thu","Fri","Sat","Sun","Mon","Tue","Wed","Thu","Fri","Sat","Sun","Mon","Tue","Wed","Thu","Fri","Sat","Sun","Mon","Tue","उपस्थित","अवकाश"]
[null,null,null,null,{"$f":"C3","v":"2023-01-01"},{"$f":"E8+1","v":"2023-01-02"},{"$f":"F8+1","v":"2023-01-03"},{"$f":"G8+1","v":"2023-01-04"},"2023-01-05","2023-01-06","2023-01-07","2023-01-08","2023-01-09","2023-01-10","2023-01-11","2023-01-12","2023-01-13","2023-01-14","2023-01-15","2023-01-16","2023-01-17","2023-01-18","2023-01-19","2023-01-20","2023-01-21","2023-01-22","2023-01-23","2023-01-24","2023-01-25","2023-01-26","2023-01-27","2023-01-28",{"$f":"IFERROR(IF(AF8+1>EOMONTH(E8,0),\"\",AF8+1),\"\")","v":"2023-01-29"},{"$f":"IFERROR(IF(AG8+1>EOMONTH(F8,0),\"\",AG8+1),\"\")","v":"2023-01-30"},{"$f":"IFERROR(IF(AH8+1>EOMONTH(G8,0),\"\",AH8+1),\"\")","v":"2023-01-31"},null,"C/L","M/L","P/L"]
[null,{"$f":"IF(C9=\"\",\"\",COUNTA($C$9:C9))","v":1},"Pramod Kumar Saini",1234,{"$f":"IF(E$8>TODAY(),\"\",IF($C9=\"\",\"\",IF(COUNTIF(Date,E$8)>0,\"H\",IF(E$7=\"Sun\",\"H\",IFERROR(VLOOKUP($D9&\"-\"&E$8&\"\",pks_3!$A$1:$E$21,5,0),\"P\")))))","v":"H"},{"$f":"IF(F$8>TODAY(),\"\",IF($C9=\"\",\"\",IF(COUNTIF(Date,F$8)>0,\"H\",IF(F$7=\"Sun\",\"H\",IFERROR(VLOOKUP($D9&\"-\"&F$8&\"\",pks_3!$A$1:$E$21,5,0),\"P\")))))","v":"P"},{"$f":"IF(G$8>TODAY(),\"\",IF($C9=\"\",\"\",IF(COUNTIF(Date,G$8)>0,\"H\",IF(G$7=\"Sun\",\"H\",IFERROR(VLOOKUP($D9&\"-\"&G$8&\"\",pks_3!$A$1:$E$21,5,0),\"P\")))))","v":"P"},{"$f":"IF(H$8>TODAY(),\"\",IF($C9=\"\",\"\",IF(COUNTIF(Date,H$8)>0,\"H\",IF(H$7=\"Sun\",\"H\",IFERROR(VLOOKUP($D9&\"-\"&H$8&\"\",pks_3!$A$1:$E$21,5,0),\"P\")))))","v":"P"},{"$f":"IF(I$8>TODAY(),\"\",IF($C9=\"\",\"\",IF(COUNTIF(Date,I$8)>0,\"H\",IF(I$7=\"Sun\",\"H\",IFERROR(VLOOKUP($D9&\"-\"&I$8&\"\",pks_3!$A$1:$E$21,5,0),\"P\")))))","v":"P"},{"$f":"IF(J$8>TODAY(),\"\",IF($C9=\"\",\"\",IF(COUNTIF(Date,J$8)>0,\"H\",IF(J$7=\"Sun\",\"H\",IFERROR(VLOOKUP($D9&\"-\"&J$8&\"\",pks_3!$A$1:$E$21,5,0),\"P\")))))","v":"P"},{"$f":"IF(K$8>TODAY(),\"\",IF($C9=\"\",\"\",IF(COUNTIF(Date,K$8)>0,\"H\",IF(K$7=\"Sun\",\"H\",IFERROR(VLOOKUP($D9&\"-\"&K$8&\"\",pks_3!$A$1:$E$21,5,0),\"P\")))))","v":"P"},{"$f":"IF(L$8>TODAY(),\"\",IF($C9=\"\",\"\",IF(COUNTIF(Date,L$8)>0,\"H\",IF(L$7=\"Sun\",\"H\",IFERROR(VLOOKUP($D9&\"-\"&L$8&\"\",pks_3!$A$1:$E$21,5,0),\"P\")))))","v":"H"},{"$f":"IF(M$8>TODAY(),\"\",IF($C9=\"\",\"\",IF(COUNTIF(Date,M$8)>0,\"H\",IF(M$7=\"Sun\",\"H\",IFERROR(VLOOKUP($D9&\"-\"&M$8&\"\",pks_3!$A$1:$E$21,5,0),\"P\")))))","v":"P"},{"$f":"IF(N$8>TODAY(),\"\",IF($C9=\"\",\"\",IF(COUNTIF(Date,N$8)>0,\"H\",IF(N$7=\"Sun\",\"H\",IFERROR(VLOOKUP($D9&\"-\"&N$8&\"\",pks_3!$A$1:$E$21,5,0),\"P\")))))","v":"P"},{"$f":"IF(O$8>TODAY(),\"\",IF($C9=\"\",\"\",IF(COUNTIF(Date,O$8)>0,\"H\",IF(O$7=\"Sun\",\"H\",IFERROR(VLOOKUP($D9&\"-\"&O$8&\"\",pks_3!$A$1:$E$21,5,0),\"P\")))))","v":"P"},{"$f":"IF(P$8>TODAY(),\"\",IF($C9=\"\",\"\",IF(COUNTIF(Date,P$8)>0,\"H\",IF(P$7=\"Sun\",\"H\",IFERROR(VLOOKUP($D9&\"-\"&P$8&\"\",pks_3!$A$1:$E$21,5,0),\"P\")))))","v":"P"},{"$f":"IF(Q$8>TODAY(),\"\",IF($C9=\"\",\"\",IF(COUNTIF(Date,Q$8)>0,\"H\",IF(Q$7=\"Sun\",\"H\",IFERROR(VLOOKUP($D9&\"-\"&Q$8&\"\",pks_3!$A$1:$E$21,5,0),\"P\")))))","v":"P"},{"$f":"IF(R$8>TODAY(),\"\",IF($C9=\"\",\"\",IF(COUNTIF(Date,R$8)>0,\"H\",IF(R$7=\"Sun\",\"H\",IFERROR(VLOOKUP($D9&\"-\"&R$8&\"\",pks_3!$A$1:$E$21,5,0),\"P\")))))","v":"P"},{"$f":"IF(S$8>TODAY(),\"\",IF($C9=\"\",\"\",IF(COUNTIF(Date,S$8)>0,\"H\",IF(S$7=\"Sun\",\"H\",IFERROR(VLOOKUP($D9&\"-\"&S$8&\"\",pks_3!$A$1:$E$21,5,0),\"P\")))))","v":"H"},{"$f":"IF(T$8>TODAY(),\"\",IF($C9=\"\",\"\",IF(COUNTIF(Date,T$8)>0,\"H\",IF(T$7=\"Sun\",\"H\",IFERROR(VLOOKUP($D9&\"-\"&T$8&\"\",pks_3!$A$1:$E$21,5,0),\"P\")))))","v":"P"},{"$f":"IF(U$8>TODAY(),\"\",IF($C9=\"\",\"\",IF(COUNTIF(Date,U$8)>0,\"H\",IF(U$7=\"Sun\",\"H\",IFERROR(VLOOKUP($D9&\"-\"&U$8&\"\",pks_3!$A$1:$E$21,5,0),\"P\")))))","v":"P"},{"$f":"IF(V$8>TODAY(),\"\",IF($C9=\"\",\"\",IF(COUNTIF(Date,V$8)>0,\"H\",IF(V$7=\"Sun\",\"H\",IFERROR(VLOOKUP($D9&\"-\"&V$8&\"\",pks_3!$A$1:$E$21,5,0),\"P\")))))","v":"P"},{"$f":"IF(W$8>TODAY(),\"\",IF($C9=\"\",\"\",IF(COUNTIF(Date,W$8)>0,\"H\",IF(W$7=\"Sun\",\"H\",IFERROR(VLOOKUP($D9&\"-\"&W$8&\"\",pks_3!$A$1:$E$21,5,0),\"P\")))))","v":"P"},{"$f":"IF(X$8>TODAY(),\"\",IF($C9=\"\",\"\",IF(COUNTIF(Date,X$8)>0,\"H\",IF(X$7=\"Sun\",\"H\",IFERROR(VLOOKUP($D9&\"-\"&X$8&\"\",pks_3!$A$1:$E$21,5,0),\"P\")))))","v":"P"},{"$f":"IF(Y$8>TODAY(),\"\",IF($C9=\"\",\"\",IF(COUNTIF(Date,Y$8)>0,\"H\",IF(Y$7=\"Sun\",\"H\",IFERROR(VLOOKUP($D9&\"-\"&Y$8&\"\",pks_3!$A$1:$E$21,5,0),\"P\")))))","v":"P"},{"$f":"IF(Z$8>TODAY(),\"\",IF($C9=\"\",\"\",IF(COUNTIF(Date,Z$8)>0,\"H\",IF(Z$7=\"Sun\",\"H\",IFERROR(VLOOKUP($D9&\"-\"&Z$8&\"\",pks_3!$A$1:$E$21,5,0),\"P\")))))","v":"H"},{"$f":"IF(AA$8>TODAY(),\"\",IF($C9=\"\",\"\",IF(COUNTIF(Date,AA$8)>0,\"H\",IF(AA$7=\"Sun\",\"H\",IFERROR(VLOOKUP($D9&\"-\"&AA$8&\"\",pks_3!$A$1:$E$21,5,0),\"P\")))))","v":"P"},{"$f":"IF(AB$8>TODAY(),\"\",IF($C9=\"\",\"\",IF(COUNTIF(Date,AB$8)>0,\"H\",IF(AB$7=\"Sun\",\"H\",IFERROR(VLOOKUP($D9&\"-\"&AB$8&\"\",pks_3!$A$1:$E$21,5,0),\"P\")))))","v":"P"},{"$f":"IF(AC$8>TODAY(),\"\",IF($C9=\"\",\"\",IF(COUNTIF(Date,AC$8)>0,\"H\",IF(AC$7=\"Sun\",\"H\",IFERROR(VLOOKUP($D9&\"-\"&AC$8&\"\",pks_3!$A$1:$E$21,5,0),\"P\")))))","v":"P"},{"$f":"IF(AD$8>TODAY(),\"\",IF($C9=\"\",\"\",IF(COUNTIF(Date,AD$8)>0,\"H\",IF(AD$7=\"Sun\",\"H\",IFERROR(VLOOKUP($D9&\"-\"&AD$8&\"\",pks_3!$A$1:$E$21,5,0),\"P\")))))","v":"P"},{"$f":"IF(AE$8>TODAY(),\"\",IF($C9=\"\",\"\",IF(COUNTIF(Date,AE$8)>0,\"H\",IF(AE$7=\"Sun\",\"H\",IFERROR(VLOOKUP($D9&\"-\"&AE$8&\"\",pks_3!$A$1:$E$21,5,0),\"P\")))))","v":"P"},{"$f":"IF(AF$8>TODAY(),\"\",IF($C9=\"\",\"\",IF(COUNTIF(Date,AF$8)>0,\"H\",IF(AF$7=\"Sun\",\"H\",IFERROR(VLOOKUP($D9&\"-\"&AF$8&\"\",pks_3!$A$1:$E$21,5,0),\"P\")))))","v":"P"},{"$f":"IF(AG$8>TODAY(),\"\",IF($C9=\"\",\"\",IF(COUNTIF(Date,AG$8)>0,\"H\",IF(AG$7=\"Sun\",\"H\",IFERROR(VLOOKUP($D9&\"-\"&AG$8&\"\",pks_3!$A$1:$E$21,5,0),\"P\")))))","v":"H"},{"$f":"IF(AH$8>TODAY(),\"\",IF($C9=\"\",\"\",IF(COUNTIF(Date,AH$8)>0,\"H\",IF(AH$7=\"Sun\",\"H\",IFERROR(VLOOKUP($D9&\"-\"&AH$8&\"\",pks_3!$A$1:$E$21,5,0),\"P\")))))","v":"P"},{"$f":"IF(AI$8>TODAY(),\"\",IF($C9=\"\",\"\",IF(COUNTIF(Date,AI$8)>0,\"H\",IF(AI$7=\"Sun\",\"H\",IFERROR(VLOOKUP($D9&\"-\"&AI$8&\"\",pks_3!$A$1:$E$21,5,0),\"P\")))))","v":"P"},{"$f":"COUNTIFS(E9:AI9,\"p\")","v":26},{"$f":"COUNTIFS(E9:AI9,\"c/l\")","v":0},{"$f":"COUNTIFS(E9:AI9,\"m/l\")","v":0},{"$f":"COUNTIFS(E9:AI9,\"p/l\")","v":0}]
[null,{"$f":"IF(C10=\"\",\"\",COUNTA($C$9:C10))","v":2},"ABC",234,{"$f":"IF(E$8>TODAY(),\"\",IF($C10=\"\",\"\",IF(COUNTIF(Date,E$8)>0,\"H\",IF(E$7=\"Sun\",\"H\",IFERROR(VLOOKUP($D10&\"-\"&E$8&\"\",pks_3!$A$1:$E$21,5,0),\"P\")))))","v":"H"},{"$f":"IF(F$8>TODAY(),\"\",IF($C10=\"\",\"\",IF(COUNTIF(Date,F$8)>0,\"H\",IF(F$7=\"Sun\",\"H\",IFERROR(VLOOKUP($D10&\"-\"&F$8&\"\",pks_3!$A$1:$E$21,5,0),\"P\")))))","v":"P"},{"$f":"IF(G$8>TODAY(),\"\",IF($C10=\"\",\"\",IF(COUNTIF(Date,G$8)>0,\"H\",IF(G$7=\"Sun\",\"H\",IFERROR(VLOOKUP($D10&\"-\"&G$8&\"\",pks_3!$A$1:$E$21,5,0),\"P\")))))","v":"P"},{"$f":"IF(H$8>TODAY(),\"\",IF($C10=\"\",\"\",IF(COUNTIF(Date,H$8)>0,\"H\",IF(H$7=\"Sun\",\"H\",IFERROR(VLOOKUP($D10&\"-\"&H$8&\"\",pks_3!$A$1:$E$21,5,0),\"P\")))))","v":"P"},{"$f":"IF(I$8>TODAY(),\"\",IF($C10=\"\",\"\",IF(COUNTIF(Date,I$8)>0,\"H\",IF(I$7=\"Sun\",\"H\",IFERROR(VLOOKUP($D10&\"-\"&I$8&\"\",pks_3!$A$1:$E$21,5,0),\"P\")))))","v":"P"},{"$f":"IF(J$8>TODAY(),\"\",IF($C10=\"\",\"\",IF(COUNTIF(Date,J$8)>0,\"H\",IF(J$7=\"Sun\",\"H\",IFERROR(VLOOKUP($D10&\"-\"&J$8&\"\",pks_3!$A$1:$E$21,5,0),\"P\")))))","v":"P"},{"$f":"IF(K$8>TODAY(),\"\",IF($C10=\"\",\"\",IF(COUNTIF(Date,K$8)>0,\"H\",IF(K$7=\"Sun\",\"H\",IFERROR(VLOOKUP($D10&\"-\"&K$8&\"\",pks_3!$A$1:$E$21,5,0),\"P\")))))","v":"P"},{"$f":"IF(L$8>TODAY(),\"\",IF($C10=\"\",\"\",IF(COUNTIF(Date,L$8)>0,\"H\",IF(L$7=\"Sun\",\"H\",IFERROR(VLOOKUP($D10&\"-\"&L$8&\"\",pks_3!$A$1:$E$21,5,0),\"P\")))))","v":"H"},{"$f":"IF(M$8>TODAY(),\"\",IF($C10=\"\",\"\",IF(COUNTIF(Date,M$8)>0,\"H\",IF(M$7=\"Sun\",\"H\",IFERROR(VLOOKUP($D10&\"-\"&M$8&\"\",pks_3!$A$1:$E$21,5,0),\"P\")))))","v":"P"},{"$f":"IF(N$8>TODAY(),\"\",IF($C10=\"\",\"\",IF(COUNTIF(Date,N$8)>0,\"H\",IF(N$7=\"Sun\",\"H\",IFERROR(VLOOKUP($D10&\"-\"&N$8&\"\",pks_3!$A$1:$E$21,5,0),\"P\")))))","v":"P"},{"$f":"IF(O$8>TODAY(),\"\",IF($C10=\"\",\"\",IF(COUNTIF(Date,O$8)>0,\"H\",IF(O$7=\"Sun\",\"H\",IFERROR(VLOOKUP($D10&\"-\"&O$8&\"\",pks_3!$A$1:$E$21,5,0),\"P\")))))","v":"P"},{"$f":"IF(P$8>TODAY(),\"\",IF($C10=\"\",\"\",IF(COUNTIF(Date,P$8)>0,\"H\",IF(P$7=\"Sun\",\"H\",IFERROR(VLOOKUP($D10&\"-\"&P$8&\"\",pks_3!$A$1:$E$21,5,0),\"P\")))))","v":"P"},{"$f":"IF(Q$8>TODAY(),\"\",IF($C10=\"\",\"\",IF(COUNTIF(Date,Q$8)>0,\"H\",IF(Q$7=\"Sun\",\"H\",IFERROR(VLOOKUP($D10&\"-\"&Q$8&\"\",pks_3!$A$1:$E$21,5,0),\"P\")))))","v":"P"},{"$f":"IF(R$8>TODAY(),\"\",IF($C10=\"\",\"\",IF(COUNTIF(Date,R$8)>0,\"H\",IF(R$7=\"Sun\",\"H\",IFERROR(VLOOKUP($D10&\"-\"&R$8&\"\",pks_3!$A$1:$E$21,5,0),\"P\")))))","v":"P"},{"$f":"IF(S$8>TODAY(),\"\",IF($C10=\"\",\"\",IF(COUNTIF(Date,S$8)>0,\"H\",IF(S$7=\"Sun\",\"H\",IFERROR(VLOOKUP($D10&\"-\"&S$8&\"\",pks_3!$A$1:$E$21,5,0),\"P\")))))","v":"H"},{"$f":"IF(T$8>TODAY(),\"\",IF($C10=\"\",\"\",IF(COUNTIF(Date,T$8)>0,\"H\",IF(T$7=\"Sun\",\"H\",IFERROR(VLOOKUP($D10&\"-\"&T$8&\"\",pks_3!$A$1:$E$21,5,0),\"P\")))))","v":"P"},{"$f":"IF(U$8>TODAY(),\"\",IF($C10=\"\",\"\",IF(COUNTIF(Date,U$8)>0,\"H\",IF(U$7=\"Sun\",\"H\",IFERROR(VLOOKUP($D10&\"-\"&U$8&\"\",pks_3!$A$1:$E$21,5,0),\"P\")))))","v":"P"},{"$f":"IF(V$8>TODAY(),\"\",IF($C10=\"\",\"\",IF(COUNTIF(Date,V$8)>0,\"H\",IF(V$7=\"Sun\",\"H\",IFERROR(VLOOKUP($D10&\"-\"&V$8&\"\",pks_3!$A$1:$E$21,5,0),\"P\")))))","v":"P"},{"$f":"IF(W$8>TODAY(),\"\",IF($C10=\"\",\"\",IF(COUNTIF(Date,W$8)>0,\"H\",IF(W$7=\"Sun\",\"H\",IFERROR(VLOOKUP($D10&\"-\"&W$8&\"\",pks_3!$A$1:$E$21,5,0),\"P\")))))","v":"P"},{"$f":"IF(X$8>TODAY(),\"\",IF($C10=\"\",\"\",IF(COUNTIF(Date,X$8)>0,\"H\",IF(X$7=\"Sun\",\"H\",IFERROR(VLOOKUP($D10&\"-\"&X$8&\"\",pks_3!$A$1:$E$21,5,0),\"P\")))))","v":"P"},{"$f":"IF(Y$8>TODAY(),\"\",IF($C10=\"\",\"\",IF(COUNTIF(Date,Y$8)>0,\"H\",IF(Y$7=\"Sun\",\"H\",IFERROR(VLOOKUP($D10&\"-\"&Y$8&\"\",pks_3!$A$1:$E$21,5,0),\"P\")))))","v":"P"},{"$f":"IF(Z$8>TODAY(),\"\",IF($C10=\"\",\"\",IF(COUNTIF(Date,Z$8)>0,\"H\",IF(Z$7=\"Sun\",\"H\",IFERROR(VLOOKUP($D10&\"-\"&Z$8&\"\",pks_3!$A$1:$E$21,5,0),\"P\")))))","v":"H"},{"$f":"IF(AA$8>TODAY(),\"\",IF($C10=\"\",\"\",IF(COUNTIF(Date,AA$8)>0,\"H\",IF(AA$7=\"Sun\",\"H\",IFERROR(VLOOKUP($D10&\"-\"&AA$8&\"\",pks_3!$A$1:$E$21,5,0),\"P\")))))","v":"P"},{"$f":"IF(AB$8>TODAY(),\"\",IF($C10=\"\",\"\",IF(COUNTIF(Date,AB$8)>0,\"H\",IF(AB$7=\"Sun\",\"H\",IFERROR(VLOOKUP($D10&\"-\"&AB$8&\"\",pks_3!$A$1:$E$21,5,0),\"P\")))))","v":"P"},{"$f":"IF(AC$8>TODAY(),\"\",IF($C10=\"\",\"\",IF(COUNTIF(Date,AC$8)>0,\"H\",IF(AC$7=\"Sun\",\"H\",IFERROR(VLOOKUP($D10&\"-\"&AC$8&\"\",pks_3!$A$1:$E$21,5,0),\"P\")))))","v":"P"},{"$f":"IF(AD$8>TODAY(),\"\",IF($C10=\"\",\"\",IF(COUNTIF(Date,AD$8)>0,\"H\",IF(AD$7=\"Sun\",\"H\",IFERROR(VLOOKUP($D10&\"-\"&AD$8&\"\",pks_3!$A$1:$E$21,5,0),\"P\")))))","v":"P"},{"$f":"IF(AE$8>TODAY(),\"\",IF($C10=\"\",\"\",IF(COUNTIF(Date,AE$8)>0,\"H\",IF(AE$7=\"Sun\",\"H\",IFERROR(VLOOKUP($D10&\"-\"&AE$8&\"\",pks_3!$A$1:$E$21,5,0),\"P\")))))","v":"P"},{"$f":"IF(AF$8>TODAY(),\"\",IF($C10=\"\",\"\",IF(COUNTIF(Date,AF$8)>0,\"H\",IF(AF$7=\"Sun\",\"H\",IFERROR(VLOOKUP($D10&\"-\"&AF$8&\"\",pks_3!$A$1:$E$21,5,0),\"P\")))))","v":"P"},{"$f":"IF(AG$8>TODAY(),\"\",IF($C10=\"\",\"\",IF(COUNTIF(Date,AG$8)>0,\"H\",IF(AG$7=\"Sun\",\"H\",IFERROR(VLOOKUP($D10&\"-\"&AG$8&\"\",pks_3!$A$1:$E$21,5,0),\"P\")))))","v":"H"},{"$f":"IF(AH$8>TODAY(),\"\",IF($C10=\"\",\"\",IF(COUNTIF(Date,AH$8)>0,\"H\",IF(AH$7=\"Sun\",\"H\",IFERROR(VLOOKUP($D10&\"-\"&AH$8&\"\",pks_3!$A$1:$E$21,5,0),\"P\")))))","v":"P"},{"$f":"IF(AI$8>TODAY(),\"\",IF($C10=\"\",\"\",IF(COUNTIF(Date,AI$8)>0,\"H\",IF(AI$7=\"Sun\",\"H\",IFERROR(VLOOKUP($D10&\"-\"&AI$8&\"\",pks_3!$A$1:$E$21,5,0),\"P\")))))","v":"P"},{"$f":"COUNTIFS(E10:AI10,\"p\")","v":26},{"$f":"COUNTIFS(E10:AI10,\"c/l\")","v":0},{"$f":"COUNTIFS(E10:AI10,\"m/l\")","v":0},{"$f":"COUNTIFS(E10:AI10,\"p/l\")","v":0}]
{"$rows_left_out":19}
{"sheet":"pks_2","index":1,"n_rows":2,"n_cols":2,"rows_kept":2,"cut":false,"hidden":false,"merged":[]}
[null,"Holiday Date"]
[null,"2024-10-02"]

{"sheet":"pks_3","index":2,"n_rows":21,"n_cols":5,"rows_kept":21,"cut":false,"hidden":false,"merged":[]}
[2012,"Employee Name","Employee ID","Date","Leave Type"]
[{"$f":"C2&\"-\"&D2&\"\"","v":"5678-45572"},"Pramod Kumar Saini",5678,"2024-10-07","C/L"]
[{"$f":"C3&\"-\"&D3&\"\"","v":"-"}]
["-"]
["-"]
["1234-45577","Pramod Kumar Saini",1234,"2024-10-12","P/L"]
["-"]
["-"]
["-"]
["-"]
{"$rows_left_out":11}