{"text_format":"1","workbook":"xlsx","n_sheets":17,"sheets":["roll","rn_01","rn_02","rn_03","rn_04","rn_05","rn_06","rn_07","rn_08","rn_09","rn_10","pks","p-2","p-3","p-1","rs-2","rs-3"],"not_rendered":{"charts":0,"images":1,"macros":1,"external_links":0,"defined_names":15,"comments":0,"pivot_tables":0},"unopened":[],"bounds":{"document_bytes":16777216,"sheet_cells":100000,"rows_first":2000,"rows_last":500,"rows_between":2000,"halvings":0,"cell_chars":16384,"cell_head_chars":4096},"cells_cut":0,"cells_raw":0,"read":"whole","date_system":"1900"}

{"sheet":"roll","index":0,"n_rows":815,"n_cols":3,"rows_kept":815,"cut":false,"hidden":false,"merged":[[11,1,11,2],[10,1,10,2],[2,1,2,2],[4,1,4,2],[6,1,6,2],[8,1,8,2],[3,1,3,2],[5,1,5,2],[7,1,7,2],[9,1,9,2]]}
[]
[]
[]
[]
[]
[]
[]
[]
[]
[]
[]
[]
[]
[]
[null,"Sl No","Exam Roll No"]
[null,1,10001]
[null,{"$f":"B16+1","v":2},501]
[null,{"$f":"B17+1","v":3},{"$f":"C16+1","v":10002}]
[null,4,{"$f":"C17+1","v":502}]
[null,5,{"$f":"C18+1","v":10003}]
[null,6,503]
[null,7,10004]
[null,8,504]
[null,9,10005]
[null,10,505]
[null,11,10006]
[null,12,506]
[null,13,10007]
[null,14,507]
[null,15,10008]
[null,16,508]
[null,17,10009]
[null,18,509]
[null,19,10010]
[null,20,510]
[null,21,10011]
[null,22,511]
[null,23,10012]
[null,24,512]
[null,25,10013]
[null,26,513]
[null,27,10014]
[null,28,514]
[null,29,10015]
[null,30,515]
[null,31,10016]
[null,32,516]
[null,33,10017]
[null,34,517]
[null,35,10018]
[null,36,518]
[null,37,10019]
[null,38,519]
[null,39,10020]
[null,40,520]
[null,41,10021]
[null,42,521]
[null,43,10022]
[null,44,522]
[null,45,10023]
[null,46,523]
[null,47,10024]
[null,48,524]
[null,49,10025]
[null,50,525]
[null,51,10026]
[null,52,526]
[null,53,10027]
[null,54,527]
[null,55,10028]
[null,56,528]
[null,57,10029]
[null,58,529]
[null,59,10030]
[null,60,530]
[null,61,10031]
[null,62,531]
[null,63,10032]
[null,64,532]
[null,65,10033]
[null,66,533]
[null,{"$f":"B81+1","v":67},10034]
[null,68,534]
[null,69,{"$f":"C82+1","v":10035}]
[null,70,535]
[null,71,10036]
[null,72,536]
[null,73,10037]
[null,74,537]
[null,75,10038]
[null,76,538]
[null,77,10039]
[null,78,539]
[null,79,10040]
[null,80,540]
[null,81,10041]
[null,82,541]
[null,83,10042]
[null,84,542]
[null,85,10043]
[null,86,543]
[null,87,10044]
[null,88,544]
[null,89,10045]
[null,90,545]
[null,91,10046]
[null,92,546]
[null,93,10047]
[null,94,547]
[null,95,10048]
[null,96,548]
[null,97,10049]
[null,98,549]
[null,99,10050]
[null,100,550]
[null,101,10051]
[null,102,551]
[null,103,10052]
[null,104,552]
[null,105,10053]
[null,106,553]
[null,107,10054]
[null,108,554]
[null,109,10055]
[null,110,555]
[null,111,10056]
[null,112,556]
[null,113,10057]
[null,114,557]
[null,115,10058]
[null,116,558]
[null,117,10059]
[null,118,559]
[null,119,10060]
[null,120,560]
[null,121,10061]
[null,122,561]
[null,123,10062]
[null,124,562]
[null,125,10063]
[null,126,563]
[null,127,10064]
[null,128,564]
[null,129,10065]
[null,130,565]
[null,{"$f":"B145+1","v":131},10066]
[null,132,566]
[null,133,{"$f":"C146+1","v":10067}]
[null,134,567]
[null,135,10068]
[null,136,568]
[null,137,10069]
[null,138,569]
[null,139,10070]
[null,140,570]
[null,141,10071]
[null,142,571]
[null,143,10072]
[null,144,572]
[null,145,10073]
[null,146,573]
[null,147,10074]
[null,148,574]
[null,149,10075]
[null,150,575]
[null,151,10076]
[null,152,576]
[null,153,10077]
[null,154,577]
[null,155,10078]
[null,156,578]
[null,157,10079]
[null,158,579]
[null,159,10080]
[null,160,580]
[null,161,10081]
[null,162,581]
[null,163,10082]
[null,164,582]
[null,165,10083]
[null,166,583]
[null,167,10084]
[null,168,584]
[null,169,10085]
[null,170,585]
[null,171,10086]
[null,172,586]
[null,173,10087]
[null,174,587]
[null,175,10088]
[null,176,588]
[null,177,10089]
[null,178,589]
[null,179,10090]
[null,180,590]
[null,181,10091]
[null,182,591]
[null,183,10092]
[null,184,592]
[null,185,10093]
[null,186,593]
[null,187,10094]
[null,188,594]
[null,189,10095]
[null,190,595]
[null,191,10096]
[null,192,596]
[null,193,10097]
[null,194,597]
[null,{"$f":"B209+1","v":195},10098]
[null,196,598]
[null,197,{"$f":"C210+1","v":10099}]
[null,198,599]
[null,199,10100]
[null,200,600]
[null,201,10101]
[null,202,601]
[null,203,10102]
[null,204,602]
[null,205,10103]
[null,206,603]
[null,207,10104]
[null,208,604]
[null,209,10105]
[null,210,605]
[null,211,10106]
[null,212,606]
[null,213,10107]
[null,214,607]
[null,215,10108]
[null,216,608]
[null,217,10109]
[null,218,609]
[null,219,10110]
[null,220,610]
[null,221,10111]
[null,222,611]
[null,223,10112]
[null,224,612]
[null,225,10113]
[null,226,613]
[null,227,10114]
[null,228,614]
[null,229,10115]
[null,230,615]
[null,231,10116]
[null,232,616]
[null,233,10117]
[null,234,617]
[null,235,10118]
[null,236,618]
[null,237,10119]
[null,238,619]
[null,239,10120]
[null,240,620]
[null,241,10121]
[null,242,621]
[null,243,10122]
[null,244,622]
[null,245,10123]
[null,246,623]
[null,247,10124]
[null,248,624]
[null,249,10125]
[null,250,625]
[null,251,10126]
[null,252,626]
[null,253,10127]
[null,254,627]
[null,255,10128]
[null,256,628]
[null,257,10129]
[null,258,629]
[null,{"$f":"B273+1","v":259},10130]
[null,260,630]
[null,261,{"$f":"C274+1","v":10131}]
[null,262,631]
[null,263,10132]
[null,264,632]
[null,265,10133]
[null,266,633]
[null,267,10134]
[null,268,634]
[null,269,10135]
[null,270,635]
[null,271,10136]
[null,272,636]
[null,273,10137]
[null,274,637]
[null,275,10138]
[null,276,638]
[null,277,10139]
[null,278,639]
[null,279,10140]
[null,280,640]
[null,281,10141]
[null,282,641]
[null,283,10142]
[null,284,642]
[null,285,10143]
[null,286,643]
[null,287,10144]
[null,288,644]
[null,289,10145]
[null,290,645]
[null,291,10146]
[null,292,646]
[null,293,10147]
[null,294,647]
[null,295,10148]
[null,296,648]
[null,297,10149]
[null,298,649]
[null,299,10150]
[null,300,650]
[null,301,10151]
[null,302,651]
[null,303,10152]
[null,304,652]
[null,305,10153]
[null,306,653]
[null,307,10154]
[null,308,654]
[null,309,10155]
[null,310,655]
[null,311,10156]
[null,312,656]
[null,313,10157]
[null,314,657]
[null,315,10158]
[null,316,658]
[null,317,10159]
[null,318,659]
[null,319,10160]
[null,320,660]
[null,321,10161]
[null,322,661]
[null,{"$f":"B337+1","v":323},10162]
[null,324,662]
[null,325,{"$f":"C338+1","v":10163}]
[null,326,663]
[null,327,10164]
[null,328,664]
[null,329,10165]
[null,330,665]
[null,331,10166]
[null,332,666]
[null,333,10167]
[null,334,667]
[null,335,10168]
[null,336,668]
[null,337,10169]
[null,338,669]
[null,339,10170]
[null,340,670]
[null,341,10171]
[null,342,671]
[null,343,10172]
[null,344,672]
[null,345,10173]
[null,346,673]
[null,347,10174]
[null,348,674]
[null,349,10175]
[null,350,675]
[null,351,10176]
[null,352,676]
[null,353,10177]
[null,354,677]
[null,355,10178]
[null,356,678]
[null,357,10179]
[null,358,679]
[null,359,10180]
[null,360,680]
[null,361,10181]
[null,362,681]
[null,363,10182]
[null,364,682]
[null,365,10183]
[null,366,683]
[null,367,10184]
[null,368,684]
[null,369,10185]
[null,370,685]
[null,371,10186]
[null,372,686]
[null,373,10187]
[null,374,687]
[null,375,10188]
[null,376,688]
[null,377,10189]
[null,378,689]
[null,379,10190]
[null,380,690]
[null,381,10191]
[null,382,691]
[null,383,10192]
[null,384,692]
[null,385,10193]
[null,386,693]
[null,{"$f":"B401+1","v":387},10194]
[null,388,694]
[null,389,{"$f":"C402+1","v":10195}]
[null,390,695]
[null,391,10196]
[null,392,696]
[null,393,10197]
[null,394,697]
[null,395,10198]
[null,396,698]
[null,397,10199]
[null,398,699]
[null,399,10200]
[null,400,700]
[null,401,10201]
[null,402,701]
[null,403,10202]
[null,404,702]
[null,405,10203]
[null,406,703]
[null,407,10204]
[null,408,704]
[null,409,10205]
[null,410,705]
[null,411,10206]
[null,412,706]
[null,413,10207]
[null,414,707]
[null,415,10208]
[null,416,708]
[null,417,10209]
[null,418,709]
[null,419,10210]
[null,420,710]
[null,421,10211]
[null,422,711]
[null,423,10212]
[null,424,712]
[null,425,10213]
[null,426,713]
[null,427,10214]
[null,428,714]
[null,429,10215]
[null,430,715]
[null,431,10216]
[null,432,716]
[null,433,10217]
[null,434,717]
[null,435,10218]
[null,436,718]
[null,437,10219]
[null,438,719]
[null,439,10220]
[null,440,720]
[null,441,10221]
[null,442,721]
[null,443,10222]
[null,444,722]
[null,445,10223]
[null,446,723]
[null,447,10224]
[null,448,724]
[null,449,10225]
[null,450,725]
[null,{"$f":"B465+1","v":451},10226]
[null,452,726]
[null,453,{"$f":"C466+1","v":10227}]
[null,454,727]
[null,455,10228]
[null,456,728]
[null,457,10229]
[null,458,729]
[null,459,10230]
[null,460,730]
[null,461,10231]
[null,462,731]
[null,463,10232]
[null,464,732]
[null,465,10233]
[null,466,733]
[null,467,10234]
[null,468,734]
[null,469,10235]
[null,470,735]
[null,471,10236]
[null,472,736]
[null,473,10237]
[null,474,737]
[null,475,10238]
[null,476,738]
[null,477,10239]
[null,478,739]
[null,479,10240]
[null,480,740]
[null,481,10241]
[null,482,741]
[null,483,10242]
[null,484,742]
[null,485,10243]
[null,486,743]
[null,487,10244]
[null,488,744]
[null,489,10245]
[null,490,745]
[null,491,10246]
[null,492,746]
[null,493,10247]
[null,494,747]
[null,495,10248]
[null,496,748]
[null,497,10249]
[null,498,749]
[null,499,10250]
[null,500,750]
[null,501,10251]
[null,502,751]
[null,503,10252]
[null,504,752]
[null,505,10253]
[null,506,753]
[null,507,10254]
[null,508,754]
[null,509,10255]
[null,510,755]
[null,511,10256]
[null,512,756]
[null,513,10257]
[null,514,757]
[null,{"$f":"B529+1","v":515},10258]
[null,516,758]
[null,517,{"$f":"C530+1","v":10259}]
[null,518,759]
[null,519,10260]
[null,520,760]
[null,521,10261]
[null,522,761]
[null,523,10262]
[null,524,762]
[null,525,10263]
[null,526,763]
[null,527,10264]
[null,528,764]
[null,529,10265]
[null,530,765]
[null,531,10266]
[null,532,766]
[null,533,10267]
[null,534,767]
[null,535,10268]
[null,536,768]
[null,537,10269]
[null,538,769]
[null,539,10270]
[null,540,770]
[null,541,10271]
[null,542,771]
[null,543,10272]
[null,544,772]
[null,545,10273]
[null,546,773]
[null,547,10274]
[null,548,774]
[null,549,10275]
[null,550,775]
[null,551,10276]
[null,552,776]
[null,553,10277]
[null,554,777]
[null,555,10278]
[null,556,778]
[null,557,10279]
[null,558,779]
[null,559,10280]
[null,560,780]
[null,561,10281]
[null,562,781]
[null,563,10282]
[null,564,782]
[null,565,10283]
[null,566,783]
[null,567,10284]
[null,568,784]
[null,569,10285]
[null,570,785]
[null,571,10286]
[null,572,786]
[null,573,10287]
[null,574,787]
[null,575,10288]
[null,576,788]
[null,577,10289]
[null,578,789]
[null,{"$f":"B593+1","v":579},10290]
[null,580,790]
[null,581,{"$f":"C594+1","v":10291}]
[null,582,791]
[null,583,10292]
[null,584,792]
[null,585,10293]
[null,586,793]
[null,587,10294]
[null,588,794]
[null,589,10295]
[null,590,795]
[null,591,10296]
[null,592,796]
[null,593,10297]
[null,594,797]
[null,595,10298]
[null,596,798]
[null,597,10299]
[null,598,799]
[null,599,10300]
[null,600,800]
[null,601,10301]
[null,602,801]
[null,603,10302]
[null,604,802]
[null,605,10303]
[null,606,803]
[null,607,10304]
[null,608,804]
[null,609,10305]
[null,610,805]
[null,611,10306]
[null,612,806]
[null,613,10307]
[null,614,807]
[null,615,10308]
[null,616,808]
[null,617,10309]
[null,618,809]
[null,619,10310]
[null,620,810]
[null,621,10311]
[null,622,811]
[null,623,10312]
[null,624,812]
[null,625,10313]
[null,626,813]
[null,627,10314]
[null,628,814]
[null,629,10315]
[null,630,815]
[null,631,10316]
[null,632,816]
[null,633,10317]
[null,634,817]
[null,635,10318]
[null,636,818]
[null,637,10319]
[null,638,819]
[null,639,10320]
[null,640,820]
[null,641,10321]
[null,642,821]
[null,{"$f":"B657+1","v":643},10322]
[null,644,822]
[null,645,{"$f":"C658+1","v":10323}]
[null,646,823]
[null,647,10324]
[null,648,824]
[null,649,10325]
[null,650,825]
[null,651,10326]
[null,652,826]
[null,653,10327]
[null,654,827]
[null,655,10328]
[null,656,828]
[null,657,10329]
[null,658,829]
[null,659,10330]
[null,660,830]
[null,661,10331]
[null,662,831]
[null,663,10332]
[null,664,832]
[null,665,10333]
[null,666,833]
[null,667,10334]
[null,668,834]
[null,669,10335]
[null,670,835]
[null,671,10336]
[null,672,836]
[null,673,10337]
[null,674,837]
[null,675,10338]
[null,676,838]
[null,677,10339]
[null,678,839]
[null,679,10340]
[null,680,840]
[null,681,10341]
[null,682,841]
[null,683,10342]
[null,684,842]
[null,685,10343]
[null,686,843]
[null,687,10344]
[null,688,844]
[null,689,10345]
[null,690,845]
[null,691,10346]
[null,692,846]
[null,693,10347]
[null,694,847]
[null,695,10348]
[null,696,848]
[null,697,10349]
[null,698,849]
[null,699,10350]
[null,700,850]
[null,701,10351]
[null,702,851]
[null,703,10352]
[null,704,852]
[null,705,10353]
[null,706,853]
[null,{"$f":"B721+1","v":707},10354]
[null,708,854]
[null,709,{"$f":"C722+1","v":10355}]
[null,710,855]
[null,711,10356]
[null,712,856]
[null,713,10357]
[null,714,857]
[null,715,10358]
[null,716,858]
[null,717,10359]
[null,718,859]
[null,719,10360]
[null,720,860]
[null,721,10361]
[null,722,861]
[null,723,10362]
[null,724,862]
[null,725,10363]
[null,726,863]
[null,727,10364]
[null,728,864]
[null,729,10365]
[null,730,865]
[null,731,10366]
[null,732,866]
[null,733,10367]
[null,734,867]
[null,735,10368]
[null,736,868]
[null,737,10369]
[null,738,869]
[null,739,10370]
[null,740,870]
[null,741,10371]
[null,742,871]
[null,743,10372]
[null,744,872]
[null,745,10373]
[null,746,873]
[null,747,10374]
[null,748,874]
[null,749,10375]
[null,750,875]
[null,751,10376]
[null,752,876]
[null,753,10377]
[null,754,877]
[null,755,10378]
[null,756,878]
[null,757,10379]
[null,758,879]
[null,759,10380]
[null,760,880]
[null,761,10381]
[null,762,881]
[null,763,10382]
[null,764,882]
[null,765,10383]
[null,766,883]
[null,767,10384]
[null,768,884]
[null,769,10385]
[null,770,885]
[null,{"$f":"B785+1","v":771},10386]
[null,772,886]
[null,773,{"$f":"C786+1","v":10387}]
[null,774,887]
[null,775,10388]
[null,776,888]
[null,777,10389]
[null,778,889]
[null,779,10390]
[null,780,890]
[null,781,10391]
[null,782,891]
[null,783,10392]
[null,784,892]
[null,785,10393]
[null,786,893]
[null,787,10394]
[null,788,894]
[null,789,10395]
[null,790,895]
[null,791,10396]
[null,792,896]
[null,793,10397]
[null,794,897]
[null,795,10398]
[null,796,898]
[null,797,10399]
[null,798,899]
[null,799,10400]
[null,800,900]

{"sheet":"rn_01","index":1,"n_rows":37,"n_cols":15,"rows_kept":37,"cut":false,"hidden":false,"merged":[[10,1,10,4],[11,1,11,4],[7,1,7,4],[9,1,9,4],[8,1,8,2],[8,3,8,4],[5,1,5,4],[0,1,0,4],[1,1,1,4],[2,1,2,4],[3,1,3,4],[4,1,4,4]]}
[null,{"$f":"$J$1","v":"Class VIIITH Board Examination, 2025"},null,null,null,null,null,null,null,"Class VIIITH Board Examination, 2025",1,10,5,5,6]
[null,"परीक्षा केंद्र नाम एवं परीक्षा केंद्र क्रमांक",null,null,null,null,null,null,null,"GSSS Malutana",2,10,3,20,4]
[null,{"$f":"$J$2&\" (\"&$J$3&\")\"","v":"GSSS Malutana (12345)"},null,null,null,null,null,null,null,"12345",3,10,9,4,5]
[null,"परीक्षा कक्ष / हॉल क्रमांक",null,null,null,null,null,null,null,"XYZ",4,15,3,4,3]
[null,{"$f":"$K$1","v":1},null,null,null,null,null,null,null,"Principal",5,17,5,5,9]
[null,"परीक्षा दिनांक (दिवस) ... से ... तक",null,null,null,null,null,null,null,"ASD",6,10,3,3,3]
[null,{"$f":"TEXT($J$8,\"DD-MM-YYYY\")","v":"01-03-2025"},{"$f":"IF(B7=\"\",\"\",TEXT(B7,\"DDDD\"))","v":"Saturday"},{"$f":"TEXT($J$9,\"DD-MM-YYYY\")","v":"22-05-2025"},{"$f":"IF(D7=\"\",\"\",TEXT(D7,\"DDDD\"))","v":"Thursday"},null,null,null,null,"Lecturer",7,19,5,5,7]
[null,"परीक्षार्थी रोल नंबर ... से ... तक",null,null,null,null,null,null,null,"01-Mar-2025",8,20,3,3,20]
[null,{"$f":"IF(B14>0,B15,IF(C14>0,C15,IF(D14>0,D15,IF(E14>0,E15,0))))","v":10001},null,{"$f":"IF(E14>0,LOOKUP(2,1/(E15:E34<>\"\"),E15:E34),IF(D14>0,LOOKUP(2,1/(D15:D34<>\"\"),D15:D34),IF(C14>0,LOOKUP(2,1/(C15:C34<>\"\"),C15:C34),IF(B14>0,LOOKUP(2,1/(B15:B34<>\"\"),B15:B34),0))))","v":513},null,null,null,null,null,"22-May-2025",9,20,9,8,11]
[null,"कुल सम्मिलित परीक्षार्थी ",null,null,null,null,null,null,null,null,10,10,6,3,12]
[null,{"$f":"COUNTIF(B15:E34,\">0\")","v":26}]
[null,"परीक्षार्थी बैठक व्यवस्था"]
[null,"पंक्ति 1","पंक्ति 2","पंक्ति 3","पंक्ति 4"]
[null,{"$f":"L1","v":10},{"$f":"M1","v":5},5,6]
[null,{"$f":"IF(ROW(B1)-1>=$B$14,\"\",OFFSET(INDIRECT(MID(CELL(\"filename\",roll!$A$15),FIND(\"]\",CELL(\"filename\",roll!$A$15))+1,31)&\"!\"&ADDRESS(16,3,4)),ROW(B1)-1,0))","v":10001},{"$f":"IF(ROW(B1)-1>=$C$14,\"\",OFFSET(INDIRECT(MID(CELL(\"filename\",roll!$A$15),FIND(\"]\",CELL(\"filename\",roll!$A$15))+1,31)&\"!\"&ADDRESS(16,3,4)),ROW(B1)-1+SUM($B$14:$B$14),0))","v":10006},{"$f":"IF(ROW(B1)-1>=$D$14,\"\",OFFSET(INDIRECT(MID(CELL(\"filename\",roll!$A$15),FIND(\"]\",CELL(\"filename\",roll!$A$15))+1,31)&\"!\"&ADDRESS(16,3,4)),ROW(B1)-1+SUM($B$14:$C$14),0))","v":508},{"$f":"IF(ROW(B1)-1>=$E$14,\"\",OFFSET(INDIRECT(MID(CELL(\"filename\",roll!$A$15),FIND(\"]\",CELL(\"filename\",roll!$A$15))+1,31)&\"!\"&ADDRESS(16,3,4)),ROW(B1)-1+SUM($B$14:$D$14),0))","v":10011},{"$f":"IF(SUM(B15:E15)>0,1,\"\")","v":1}]
[null,{"$f":"IF(ROW(B2)-1>=$B$14,\"\",OFFSET(INDIRECT(MID(CELL(\"filename\",roll!$A$15),FIND(\"]\",CELL(\"filename\",roll!$A$15))+1,31)&\"!\"&ADDRESS(16,3,4)),ROW(B2)-1,0))","v":501},{"$f":"IF(ROW(B2)-1>=$C$14,\"\",OFFSET(INDIRECT(MID(CELL(\"filename\",roll!$A$15),FIND(\"]\",CELL(\"filename\",roll!$A$15))+1,31)&\"!\"&ADDRESS(16,3,4)),ROW(B2)-1+SUM($B$14:$B$14),0))","v":506},{"$f":"IF(ROW(B2)-1>=$D$14,\"\",OFFSET(INDIRECT(MID(CELL(\"filename\",roll!$A$15),FIND(\"]\",CELL(\"filename\",roll!$A$15))+1,31)&\"!\"&ADDRESS(16,3,4)),ROW(B2)-1+SUM($B$14:$C$14),0))","v":10009},{"$f":"IF(ROW(B2)-1>=$E$14,\"\",OFFSET(INDIRECT(MID(CELL(\"filename\",roll!$A$15),FIND(\"]\",CELL(\"filename\",roll!$A$15))+1,31)&\"!\"&ADDRESS(16,3,4)),ROW(B2)-1+SUM($B$14:$D$14),0))","v":511},{"$f":"IF(SUM(B16:E16)>0,1,\"\")","v":1}]
[null,{"$f":"IF(ROW(B3)-1>=$B$14,\"\",OFFSET(INDIRECT(MID(CELL(\"filename\",roll!$A$15),FIND(\"]\",CELL(\"filename\",roll!$A$15))+1,31)&\"!\"&ADDRESS(16,3,4)),ROW(B3)-1,0))","v":10002},{"$f":"IF(ROW(B3)-1>=$C$14,\"\",OFFSET(INDIRECT(MID(CELL(\"filename\",roll!$A$15),FIND(\"]\",CELL(\"filename\",roll!$A$15))+1,31)&\"!\"&ADDRESS(16,3,4)),ROW(B3)-1+SUM($B$14:$B$14),0))","v":10007},{"$f":"IF(ROW(B3)-1>=$D$14,\"\",OFFSET(INDIRECT(MID(CELL(\"filename\",roll!$A$15),FIND(\"]\",CELL(\"filename\",roll!$A$15))+1,31)&\"!\"&ADDRESS(16,3,4)),ROW(B3)-1+SUM($B$14:$C$14),0))","v":509},{"$f":"IF(ROW(B3)-1>=$E$14,\"\",OFFSET(INDIRECT(MID(CELL(\"filename\",roll!$A$15),FIND(\"]\",CELL(\"filename\",roll!$A$15))+1,31)&\"!\"&ADDRESS(16,3,4)),ROW(B3)-1+SUM($B$14:$D$14),0))","v":10012},1]
[null,{"$f":"IF(ROW(B4)-1>=$B$14,\"\",OFFSET(INDIRECT(MID(CELL(\"filename\",roll!$A$15),FIND(\"]\",CELL(\"filename\",roll!$A$15))+1,31)&\"!\"&ADDRESS(16,3,4)),ROW(B4)-1,0))","v":502},{"$f":"IF(ROW(B4)-1>=$C$14,\"\",OFFSET(INDIRECT(MID(CELL(\"filename\",roll!$A$15),FIND(\"]\",CELL(\"filename\",roll!$A$15))+1,31)&\"!\"&ADDRESS(16,3,4)),ROW(B4)-1+SUM($B$14:$B$14),0))","v":507},{"$f":"IF(ROW(B4)-1>=$D$14,\"\",OFFSET(INDIRECT(MID(CELL(\"filename\",roll!$A$15),FIND(\"]\",CELL(\"filename\",roll!$A$15))+1,31)&\"!\"&ADDRESS(16,3,4)),ROW(B4)-1+SUM($B$14:$C$14),0))","v":10010},{"$f":"IF(ROW(B4)-1>=$E$14,\"\",OFFSET(INDIRECT(MID(CELL(\"filename\",roll!$A$15),FIND(\"]\",CELL(\"filename\",roll!$A$15))+1,31)&\"!\"&ADDRESS(16,3,4)),ROW(B4)-1+SUM($B$14:$D$14),0))","v":512},1]
[null,{"$f":"IF(ROW(B5)-1>=$B$14,\"\",OFFSET(INDIRECT(MID(CELL(\"filename\",roll!$A$15),FIND(\"]\",CELL(\"filename\",roll!$A$15))+1,31)&\"!\"&ADDRESS(16,3,4)),ROW(B5)-1,0))","v":10003},{"$f":"IF(ROW(B5)-1>=$C$14,\"\",OFFSET(INDIRECT(MID(CELL(\"filename\",roll!$A$15),FIND(\"]\",CELL(\"filename\",roll!$A$15))+1,31)&\"!\"&ADDRESS(16,3,4)),ROW(B5)-1+SUM($B$14:$B$14),0))","v":10008},{"$f":"IF(ROW(B5)-1>=$D$14,\"\",OFFSET(INDIRECT(MID(CELL(\"filename\",roll!$A$15),FIND(\"]\",CELL(\"filename\",roll!$A$15))+1,31)&\"!\"&ADDRESS(16,3,4)),ROW(B5)-1+SUM($B$14:$C$14),0))","v":510},{"$f":"IF(ROW(B5)-1>=$E$14,\"\",OFFSET(INDIRECT(MID(CELL(\"filename\",roll!$A$15),FIND(\"]\",CELL(\"filename\",roll!$A$15))+1,31)&\"!\"&ADDRESS(16,3,4)),ROW(B5)-1+SUM($B$14:$D$14),0))","v":10013},1]
[null,{"$f":"IF(ROW(B6)-1>=$B$14,\"\",OFFSET(INDIRECT(MID(CELL(\"filename\",roll!$A$15),FIND(\"]\",CELL(\"filename\",roll!$A$15))+1,31)&\"!\"&ADDRESS(16,3,4)),ROW(B6)-1,0))","v":503},{"$f":"IF(ROW(B6)-1>=$C$14,\"\",OFFSET(INDIRECT(MID(CELL(\"filename\",roll!$A$15),FIND(\"]\",CELL(\"filename\",roll!$A$15))+1,31)&\"!\"&ADDRESS(16,3,4)),ROW(B6)-1+SUM($B$14:$B$14),0))","v":""},{"$f":"IF(ROW(B6)-1>=$D$14,\"\",OFFSET(INDIRECT(MID(CELL(\"filename\",roll!$A$15),FIND(\"]\",CELL(\"filename\",roll!$A$15))+1,31)&\"!\"&ADDRESS(16,3,4)),ROW(B6)-1+SUM($B$14:$C$14),0))","v":""},{"$f":"IF(ROW(B6)-1>=$E$14,\"\",OFFSET(INDIRECT(MID(CELL(\"filename\",roll!$A$15),FIND(\"]\",CELL(\"filename\",roll!$A$15))+1,31)&\"!\"&ADDRESS(16,3,4)),ROW(B6)-1+SUM($B$14:$D$14),0))","v":513},1]
[null,{"$f":"IF(ROW(B7)-1>=$B$14,\"\",OFFSET(INDIRECT(MID(CELL(\"filename\",roll!$A$15),FIND(\"]\",CELL(\"filename\",roll!$A$15))+1,31)&\"!\"&ADDRESS(16,3,4)),ROW(B7)-1,0))","v":10004},{"$f":"IF(ROW(B7)-1>=$C$14,\"\",OFFSET(INDIRECT(MID(CELL(\"filename\",roll!$A$15),FIND(\"]\",CELL(\"filename\",roll!$A$15))+1,31)&\"!\"&ADDRESS(16,3,4)),ROW(B7)-1+SUM($B$14:$B$14),0))","v":""},{"$f":"IF(ROW(B7)-1>=$D$14,\"\",OFFSET(INDIRECT(MID(CELL(\"filename\",roll!$A$15),FIND(\"]\",CELL(\"filename\",roll!$A$15))+1,31)&\"!\"&ADDRESS(16,3,4)),ROW(B7)-1+SUM($B$14:$C$14),0))","v":""},{"$f":"IF(ROW(B7)-1>=$E$14,\"\",OFFSET(INDIRECT(MID(CELL(\"filename\",roll!$A$15),FIND(\"]\",CELL(\"filename\",roll!$A$15))+1,31)&\"!\"&ADDRESS(16,3,4)),ROW(B7)-1+SUM($B$14:$D$14),0))","v":""},1]
[null,{"$f":"IF(ROW(B8)-1>=$B$14,\"\",OFFSET(INDIRECT(MID(CELL(\"filename\",roll!$A$15),FIND(\"]\",CELL(\"filename\",roll!$A$15))+1,31)&\"!\"&ADDRESS(16,3,4)),ROW(B8)-1,0))","v":504},{"$f":"IF(ROW(B8)-1>=$C$14,\"\",OFFSET(INDIRECT(MID(CELL(\"filename\",roll!$A$15),FIND(\"]\",CELL(\"filename\",roll!$A$15))+1,31)&\"!\"&ADDRESS(16,3,4)),ROW(B8)-1+SUM($B$14:$B$14),0))","v":""},{"$f":"IF(ROW(B8)-1>=$D$14,\"\",OFFSET(INDIRECT(MID(CELL(\"filename\",roll!$A$15),FIND(\"]\",CELL(\"filename\",roll!$A$15))+1,31)&\"!\"&ADDRESS(16,3,4)),ROW(B8)-1+SUM($B$14:$C$14),0))","v":""},{"$f":"IF(ROW(B8)-1>=$E$14,\"\",OFFSET(INDIRECT(MID(CELL(\"filename\",roll!$A$15),FIND(\"]\",CELL(\"filename\",roll!$A$15))+1,31)&\"!\"&ADDRESS(16,3,4)),ROW(B8)-1+SUM($B$14:$D$14),0))","v":""},1]
[null,{"$f":"IF(ROW(B9)-1>=$B$14,\"\",OFFSET(INDIRECT(MID(CELL(\"filename\",roll!$A$15),FIND(\"]\",CELL(\"filename\",roll!$A$15))+1,31)&\"!\"&ADDRESS(16,3,4)),ROW(B9)-1,0))","v":10005},{"$f":"IF(ROW(B9)-1>=$C$14,\"\",OFFSET(INDIRECT(MID(CELL(\"filename\",roll!$A$15),FIND(\"]\",CELL(\"filename\",roll!$A$15))+1,31)&\"!\"&ADDRESS(16,3,4)),ROW(B9)-1+SUM($B$14:$B$14),0))","v":""},{"$f":"IF(ROW(B9)-1>=$D$14,\"\",OFFSET(INDIRECT(MID(CELL(\"filename\",roll!$A$15),FIND(\"]\",CELL(\"filename\",roll!$A$15))+1,31)&\"!\"&ADDRESS(16,3,4)),ROW(B9)-1+SUM($B$14:$C$14),0))","v":""},{"$f":"IF(ROW(B9)-1>=$E$14,\"\",OFFSET(INDIRECT(MID(CELL(\"filename\",roll!$A$15),FIND(\"]\",CELL(\"filename\",roll!$A$15))+1,31)&\"!\"&ADDRESS(16,3,4)),ROW(B9)-1+SUM($B$14:$D$14),0))","v":""},1]
[null,{"$f":"IF(ROW(B10)-1>=$B$14,\"\",OFFSET(INDIRECT(MID(CELL(\"filename\",roll!$A$15),FIND(\"]\",CELL(\"filename\",roll!$A$15))+1,31)&\"!\"&ADDRESS(16,3,4)),ROW(B10)-1,0))","v":505},{"$f":"IF(ROW(B10)-1>=$C$14,\"\",OFFSET(INDIRECT(MID(CELL(\"filename\",roll!$A$15),FIND(\"]\",CELL(\"filename\",roll!$A$15))+1,31)&\"!\"&ADDRESS(16,3,4)),ROW(B10)-1+SUM($B$14:$B$14),0))","v":""},{"$f":"IF(ROW(B10)-1>=$D$14,\"\",OFFSET(INDIRECT(MID(CELL(\"filename\",roll!$A$15),FIND(\"]\",CELL(\"filename\",roll!$A$15))+1,31)&\"!\"&ADDRESS(16,3,4)),ROW(B10)-1+SUM($B$14:$C$14),0))","v":""},{"$f":"IF(ROW(B10)-1>=$E$14,\"\",OFFSET(INDIRECT(MID(CELL(\"filename\",roll!$A$15),FIND(\"]\",CELL(\"filename\",roll!$A$15))+1,31)&\"!\"&ADDRESS(16,3,4)),ROW(B10)-1+SUM($B$14:$D$14),0))","v":""},1]
[null,{"$f":"IF(ROW(B11)-1>=$B$14,\"\",OFFSET(INDIRECT(MID(CELL(\"filename\",roll!$A$15),FIND(\"]\",CELL(\"filename\",roll!$A$15))+1,31)&\"!\"&ADDRESS(16,3,4)),ROW(B11)-1,0))","v":""},{"$f":"IF(ROW(B11)-1>=$C$14,\"\",OFFSET(INDIRECT(MID(CELL(\"filename\",roll!$A$15),FIND(\"]\",CELL(\"filename\",roll!$A$15))+1,31)&\"!\"&ADDRESS(16,3,4)),ROW(B11)-1+SUM($B$14:$B$14),0))","v":""},{"$f":"IF(ROW(B11)-1>=$D$14,\"\",OFFSET(INDIRECT(MID(CELL(\"filename\",roll!$A$15),FIND(\"]\",CELL(\"filename\",roll!$A$15))+1,31)&\"!\"&ADDRESS(16,3,4)),ROW(B11)-1+SUM($B$14:$C$14),0))","v":""},{"$f":"IF(ROW(B11)-1>=$E$14,\"\",OFFSET(INDIRECT(MID(CELL(\"filename\",roll!$A$15),FIND(\"]\",CELL(\"filename\",roll!$A$15))+1,31)&\"!\"&ADDRESS(16,3,4)),ROW(B11)-1+SUM($B$14:$D$14),0))","v":""},""]
[null,{"$f":"IF(ROW(B12)-1>=$B$14,\"\",OFFSET(INDIRECT(MID(CELL(\"filename\",roll!$A$15),FIND(\"]\",CELL(\"filename\",roll!$A$15))+1,31)&\"!\"&ADDRESS(16,3,4)),ROW(B12)-1,0))","v":""},{"$f":"IF(ROW(B12)-1>=$C$14,\"\",OFFSET(INDIRECT(MID(CELL(\"filename\",roll!$A$15),FIND(\"]\",CELL(\"filename\",roll!$A$15))+1,31)&\"!\"&ADDRESS(16,3,4)),ROW(B12)-1+SUM($B$14:$B$14),0))","v":""},{"$f":"IF(ROW(B12)-1>=$D$14,\"\",OFFSET(INDIRECT(MID(CELL(\"filename\",roll!$A$15),FIND(\"]\",CELL(\"filename\",roll!$A$15))+1,31)&\"!\"&ADDRESS(16,3,4)),ROW(B12)-1+SUM($B$14:$C$14),0))","v":""},{"$f":"IF(ROW(B12)-1>=$E$14,\"\",OFFSET(INDIRECT(MID(CELL(\"filename\",roll!$A$15),FIND(\"]\",CELL(\"filename\",roll!$A$15))+1,31)&\"!\"&ADDRESS(16,3,4)),ROW(B12)-1+SUM($B$14:$D$14),0))","v":""},""]
[null,{"$f":"IF(ROW(B13)-1>=$B$14,\"\",OFFSET(INDIRECT(MID(CELL(\"filename\",roll!$A$15),FIND(\"]\",CELL(\"filename\",roll!$A$15))+1,31)&\"!\"&ADDRESS(16,3,4)),ROW(B13)-1,0))","v":""},{"$f":"IF(ROW(B13)-1>=$C$14,\"\",OFFSET(INDIRECT(MID(CELL(\"filename\",roll!$A$15),FIND(\"]\",CELL(\"filename\",roll!$A$15))+1,31)&\"!\"&ADDRESS(16,3,4)),ROW(B13)-1+SUM($B$14:$B$14),0))","v":""},{"$f":"IF(ROW(B13)-1>=$D$14,\"\",OFFSET(INDIRECT(MID(CELL(\"filename\",roll!$A$15),FIND(\"]\",CELL(\"filename\",roll!$A$15))+1,31)&\"!\"&ADDRESS(16,3,4)),ROW(B13)-1+SUM($B$14:$C$14),0))","v":""},{"$f":"IF(ROW(B13)-1>=$E$14,\"\",OFFSET(INDIRECT(MID(CELL(\"filename\",roll!$A$15),FIND(\"]\",CELL(\"filename\",roll!$A$15))+1,31)&\"!\"&ADDRESS(16,3,4)),ROW(B13)-1+SUM($B$14:$D$14),0))","v":""},""]
[null,{"$f":"IF(ROW(B14)-1>=$B$14,\"\",OFFSET(INDIRECT(MID(CELL(\"filename\",roll!$A$15),FIND(\"]\",CELL(\"filename\",roll!$A$15))+1,31)&\"!\"&ADDRESS(16,3,4)),ROW(B14)-1,0))","v":""},{"$f":"IF(ROW(B14)-1>=$C$14,\"\",OFFSET(INDIRECT(MID(CELL(\"filename\",roll!$A$15),FIND(\"]\",CELL(\"filename\",roll!$A$15))+1,31)&\"!\"&ADDRESS(16,3,4)),ROW(B14)-1+SUM($B$14:$B$14),0))","v":""},{"$f":"IF(ROW(B14)-1>=$D$14,\"\",OFFSET(INDIRECT(MID(CELL(\"filename\",roll!$A$15),FIND(\"]\",CELL(\"filename\",roll!$A$15))+1,31)&\"!\"&ADDRESS(16,3,4)),ROW(B14)-1+SUM($B$14:$C$14),0))","v":""},{"$f":"IF(ROW(B14)-1>=$E$14,\"\",OFFSET(INDIRECT(MID(CELL(\"filename\",roll!$A$15),FIND(\"]\",CELL(\"filename\",roll!$A$15))+1,31)&\"!\"&ADDRESS(16,3,4)),ROW(B14)-1+SUM($B$14:$D$14),0))","v":""},""]
[null,{"$f":"IF(ROW(B15)-1>=$B$14,\"\",OFFSET(INDIRECT(MID(CELL(\"filename\",roll!$A$15),FIND(\"]\",CELL(\"filename\",roll!$A$15))+1,31)&\"!\"&ADDRESS(16,3,4)),ROW(B15)-1,0))","v":""},{"$f":"IF(ROW(B15)-1>=$C$14,\"\",OFFSET(INDIRECT(MID(CELL(\"filename\",roll!$A$15),FIND(\"]\",CELL(\"filename\",roll!$A$15))+1,31)&\"!\"&ADDRESS(16,3,4)),ROW(B15)-1+SUM($B$14:$B$14),0))","v":""},{"$f":"IF(ROW(B15)-1>=$D$14,\"\",OFFSET(INDIRECT(MID(CELL(\"filename\",roll!$A$15),FIND(\"]\",CELL(\"filename\",roll!$A$15))+1,31)&\"!\"&ADDRESS(16,3,4)),ROW(B15)-1+SUM($B$14:$C$14),0))","v":""},{"$f":"IF(ROW(B15)-1>=$E$14,\"\",OFFSET(INDIRECT(MID(CELL(\"filename\",roll!$A$15),FIND(\"]\",CELL(\"filename\",roll!$A$15))+1,31)&\"!\"&ADDRESS(16,3,4)),ROW(B15)-1+SUM($B$14:$D$14),0))","v":""},""]
[null,{"$f":"IF(ROW(B16)-1>=$B$14,\"\",OFFSET(INDIRECT(MID(CELL(\"filename\",roll!$A$15),FIND(\"]\",CELL(\"filename\",roll!$A$15))+1,31)&\"!\"&ADDRESS(16,3,4)),ROW(B16)-1,0))","v":""},{"$f":"IF(ROW(B16)-1>=$C$14,\"\",OFFSET(INDIRECT(MID(CELL(\"filename\",roll!$A$15),FIND(\"]\",CELL(\"filename\",roll!$A$15))+1,31)&\"!\"&ADDRESS(16,3,4)),ROW(B16)-1+SUM($B$14:$B$14),0))","v":""},{"$f":"IF(ROW(B16)-1>=$D$14,\"\",OFFSET(INDIRECT(MID(CELL(\"filename\",roll!$A$15),FIND(\"]\",CELL(\"filename\",roll!$A$15))+1,31)&\"!\"&ADDRESS(16,3,4)),ROW(B16)-1+SUM($B$14:$C$14),0))","v":""},{"$f":"IF(ROW(B16)-1>=$E$14,\"\",OFFSET(INDIRECT(MID(CELL(\"filename\",roll!$A$15),FIND(\"]\",CELL(\"filename\",roll!$A$15))+1,31)&\"!\"&ADDRESS(16,3,4)),ROW(B16)-1+SUM($B$14:$D$14),0))","v":""},""]
[null,{"$f":"IF(ROW(B17)-1>=$B$14,\"\",OFFSET(INDIRECT(MID(CELL(\"filename\",roll!$A$15),FIND(\"]\",CELL(\"filename\",roll!$A$15))+1,31)&\"!\"&ADDRESS(16,3,4)),ROW(B17)-1,0))","v":""},{"$f":"IF(ROW(B17)-1>=$C$14,\"\",OFFSET(INDIRECT(MID(CELL(\"filename\",roll!$A$15),FIND(\"]\",CELL(\"filename\",roll!$A$15))+1,31)&\"!\"&ADDRESS(16,3,4)),ROW(B17)-1+SUM($B$14:$B$14),0))","v":""},{"$f":"IF(ROW(B17)-1>=$D$14,\"\",OFFSET(INDIRECT(MID(CELL(\"filename\",roll!$A$15),FIND(\"]\",CELL(\"filename\",roll!$A$15))+1,31)&\"!\"&ADDRESS(16,3,4)),ROW(B17)-1+SUM($B$14:$C$14),0))","v":""},{"$f":"IF(ROW(B17)-1>=$E$14,\"\",OFFSET(INDIRECT(MID(CELL(\"filename\",roll!$A$15),FIND(\"]\",CELL(\"filename\",roll!$A$15))+1,31)&\"!\"&ADDRESS(16,3,4)),ROW(B17)-1+SUM($B$14:$D$14),0))","v":""},""]
[null,{"$f":"IF(ROW(B18)-1>=$B$14,\"\",OFFSET(INDIRECT(MID(CELL(\"filename\",roll!$A$15),FIND(\"]\",CELL(\"filename\",roll!$A$15))+1,31)&\"!\"&ADDRESS(16,3,4)),ROW(B18)-1,0))","v":""},{"$f":"IF(ROW(B18)-1>=$C$14,\"\",OFFSET(INDIRECT(MID(CELL(\"filename\",roll!$A$15),FIND(\"]\",CELL(\"filename\",roll!$A$15))+1,31)&\"!\"&ADDRESS(16,3,4)),ROW(B18)-1+SUM($B$14:$B$14),0))","v":""},{"$f":"IF(ROW(B18)-1>=$D$14,\"\",OFFSET(INDIRECT(MID(CELL(\"filename\",roll!$A$15),FIND(\"]\",CELL(\"filename\",roll!$A$15))+1,31)&\"!\"&ADDRESS(16,3,4)),ROW(B18)-1+SUM($B$14:$C$14),0))","v":""},{"$f":"IF(ROW(B18)-1>=$E$14,\"\",OFFSET(INDIRECT(MID(CELL(\"filename\",roll!$A$15),FIND(\"]\",CELL(\"filename\",roll!$A$15))+1,31)&\"!\"&ADDRESS(16,3,4)),ROW(B18)-1+SUM($B$14:$D$14),0))","v":""},""]
[null,{"$f":"IF(ROW(B19)-1>=$B$14,\"\",OFFSET(INDIRECT(MID(CELL(\"filename\",roll!$A$15),FIND(\"]\",CELL(\"filename\",roll!$A$15))+1,31)&\"!\"&ADDRESS(16,3,4)),ROW(B19)-1,0))","v":""},{"$f":"IF(ROW(B19)-1>=$C$14,\"\",OFFSET(INDIRECT(MID(CELL(\"filename\",roll!$A$15),FIND(\"]\",CELL(\"filename\",roll!$A$15))+1,31)&\"!\"&ADDRESS(16,3,4)),ROW(B19)-1+SUM($B$14:$B$14),0))","v":""},{"$f":"IF(ROW(B19)-1>=$D$14,\"\",OFFSET(INDIRECT(MID(CELL(\"filename\",roll!$A$15),FIND(\"]\",CELL(\"filename\",roll!$A$15))+1,31)&\"!\"&ADDRESS(16,3,4)),ROW(B19)-1+SUM($B$14:$C$14),0))","v":""},{"$f":"IF(ROW(B19)-1>=$E$14,\"\",OFFSET(INDIRECT(MID(CELL(\"filename\",roll!$A$15),FIND(\"]\",CELL(\"filename\",roll!$A$15))+1,31)&\"!\"&ADDRESS(16,3,4)),ROW(B19)-1+SUM($B$14:$D$14),0))","v":""},""]
[null,{"$f":"IF(ROW(B20)-1>=$B$14,\"\",OFFSET(INDIRECT(MID(CELL(\"filename\",roll!$A$15),FIND(\"]\",CELL(\"filename\",roll!$A$15))+1,31)&\"!\"&ADDRESS(16,3,4)),ROW(B20)-1,0))","v":""},{"$f":"IF(ROW(B20)-1>=$C$14,\"\",OFFSET(INDIRECT(MID(CELL(\"filename\",roll!$A$15),FIND(\"]\",CELL(\"filename\",roll!$A$15))+1,31)&\"!\"&ADDRESS(16,3,4)),ROW(B20)-1+SUM($B$14:$B$14),0))","v":""},{"$f":"IF(ROW(B20)-1>=$D$14,\"\",OFFSET(INDIRECT(MID(CELL(\"filename\",roll!$A$15),FIND(\"]\",CELL(\"filename\",roll!$A$15))+1,31)&\"!\"&ADDRESS(16,3,4)),ROW(B20)-1+SUM($B$14:$C$14),0))","v":""},{"$f":"IF(ROW(B20)-1>=$E$14,\"\",OFFSET(INDIRECT(MID(CELL(\"filename\",roll!$A$15),FIND(\"]\",CELL(\"filename\",roll!$A$15))+1,31)&\"!\"&ADDRESS(16,3,4)),ROW(B20)-1+SUM($B$14:$D$14),0))","v":""},""]
[]
[null,"परीक्षा प्रभारी",null,null,"केन्द्राधीक्षक "]
[null,{"$f":"$J$6&\" (\"&$J$7&\")\"","v":"ASD (Lecturer)"},null,null,{"$f":"$J$4&\" (\"&$J$5&\")\"","v":"XYZ (Principal)"}]

{"sheet":"rn_02","index":2,"n_rows":37,"n_cols":6,"rows_kept":37,"cut":false,"hidden":false,"merged":[[11,1,11,4],[0,1,0,4],[1,1,1,4],[2,1,2,4],[3,1,3,4],[4,1,4,4],[5,1,5,4],[7,1,7,4],[8,1,8,2],[8,3,8,4],[9,1,9,4],[10,1,10,4]]}
[null,{"$f":"rn_01!$B$1","v":"Class VIIITH Board Examination, 2025"}]
[null,"परीक्षा केंद्र नाम एवं परीक्षा केंद्र क्रमांक"]
[null,{"$f":"rn_01!$B$3","v":"GSSS Malutana (12345)"}]
[null,"परीक्षा कक्ष / हॉल क्रमांक"]
[null,{"$f":"rn_01!$K$2","v":2}]
[null,"परीक्षा दिनांक (दिवस) ... से ... तक"]
[null,{"$f":"rn_01!$B$7","v":"01-03-2025"},{"$f":"IF(B7=\"\",\"\",TEXT(B7,\"DDDD\"))","v":"Saturday"},{"$f":"rn_01!$D$7","v":"22-05-2025"},{"$f":"IF(D7=\"\",\"\",TEXT(D7,\"DDDD\"))","v":"Thursday"}]
[null,"परीक्षार्थी रोल नंबर ... से ... तक"]
[null,{"$f":"IF(B14>0,B15,IF(C14>0,C15,IF(D14>0,D15,IF(E14>0,E15,0))))","v":10014},null,{"$f":"IF(E14>0,LOOKUP(2,1/(E15:E34<>\"\"),E15:E34),IF(D14>0,LOOKUP(2,1/(D15:D34<>\"\"),D15:D34),IF(C14>0,LOOKUP(2,1/(C15:C34<>\"\"),C15:C34),IF(B14>0,LOOKUP(2,1/(B15:B34<>\"\"),B15:B34),0))))","v":10032}]
[null,"कुल सम्मिलित परीक्षार्थी "]
[null,{"$f":"COUNTIF($B$15:$E$34,\">0\")","v":37}]
[null,"परीक्षार्थी बैठक व्यवस्था"]
[null,"पंक्ति 1","पंक्ति 2","पंक्ति 3","पंक्ति 4"]
[null,{"$f":"rn_01!L2","v":10},{"$f":"rn_01!M2","v":3},{"$f":"rn_01!N2","v":20},{"$f":"rn_01!O2","v":4}]
[null,{"$f":"IF(ROW(B1)-1>=$B$14,\"\",OFFSET(INDIRECT(MID(CELL(\"filename\",roll!$A$15),FIND(\"]\",CELL(\"filename\",roll!$A$15))+1,31)&\"!\"&ADDRESS(MATCH(rn_01!$D$9,roll!C:C,0)+1,3,4)),ROW(B1)-1,0))","v":10014},{"$f":"IF(ROW(B1)-1>=$C$14,\"\",OFFSET(INDIRECT(MID(CELL(\"filename\",roll!$A$15),FIND(\"]\",CELL(\"filename\",roll!$A$15))+1,31)&\"!\"&ADDRESS(MATCH(rn_01!$D$9,roll!C:C,0)+1,3,4)),ROW(B1)-1+SUM($B$14:$B$14),0))","v":10019},{"$f":"IF(ROW(B1)-1>=$D$14,\"\",OFFSET(INDIRECT(MID(CELL(\"filename\",roll!$A$15),FIND(\"]\",CELL(\"filename\",roll!$A$15))+1,31)&\"!\"&ADDRESS(MATCH(rn_01!$D$9,roll!C:C,0)+1,3,4)),ROW(B1)-1+SUM($B$14:$C$14),0))","v":520},{"$f":"IF(ROW(B1)-1>=$E$14,\"\",OFFSET(INDIRECT(MID(CELL(\"filename\",roll!$A$15),FIND(\"]\",CELL(\"filename\",roll!$A$15))+1,31)&\"!\"&ADDRESS(MATCH(rn_01!$D$9,roll!C:C,0)+1,3,4)),ROW(B1)-1+SUM($B$14:$D$14),0))","v":530},{"$f":"IF(SUM(B15:E15)>0,1,\"\")","v":1}]
[null,{"$f":"IF(ROW(B2)-1>=$B$14,\"\",OFFSET(INDIRECT(MID(CELL(\"filename\",roll!$A$15),FIND(\"]\",CELL(\"filename\",roll!$A$15))+1,31)&\"!\"&ADDRESS(MATCH(rn_01!$D$9,roll!C:C,0)+1,3,4)),ROW(B2)-1,0))","v":514},{"$f":"IF(ROW(B2)-1>=$C$14,\"\",OFFSET(INDIRECT(MID(CELL(\"filename\",roll!$A$15),FIND(\"]\",CELL(\"filename\",roll!$A$15))+1,31)&\"!\"&ADDRESS(MATCH(rn_01!$D$9,roll!C:C,0)+1,3,4)),ROW(B2)-1+SUM($B$14:$B$14),0))","v":519},{"$f":"IF(ROW(B2)-1>=$D$14,\"\",OFFSET(INDIRECT(MID(CELL(\"filename\",roll!$A$15),FIND(\"]\",CELL(\"filename\",roll!$A$15))+1,31)&\"!\"&ADDRESS(MATCH(rn_01!$D$9,roll!C:C,0)+1,3,4)),ROW(B2)-1+SUM($B$14:$C$14),0))","v":10021},{"$f":"IF(ROW(B2)-1>=$E$14,\"\",OFFSET(INDIRECT(MID(CELL(\"filename\",roll!$A$15),FIND(\"]\",CELL(\"filename\",roll!$A$15))+1,31)&\"!\"&ADDRESS(MATCH(rn_01!$D$9,roll!C:C,0)+1,3,4)),ROW(B2)-1+SUM($B$14:$D$14),0))","v":10031},{"$f":"IF(SUM(B16:E16)>0,1,\"\")","v":1}]
[null,{"$f":"IF(ROW(B3)-1>=$B$14,\"\",OFFSET(INDIRECT(MID(CELL(\"filename\",roll!$A$15),FIND(\"]\",CELL(\"filename\",roll!$A$15))+1,31)&\"!\"&ADDRESS(MATCH(rn_01!$D$9,roll!C:C,0)+1,3,4)),ROW(B3)-1,0))","v":10015},{"$f":"IF(ROW(B3)-1>=$C$14,\"\",OFFSET(INDIRECT(MID(CELL(\"filename\",roll!$A$15),FIND(\"]\",CELL(\"filename\",roll!$A$15))+1,31)&\"!\"&ADDRESS(MATCH(rn_01!$D$9,roll!C:C,0)+1,3,4)),ROW(B3)-1+SUM($B$14:$B$14),0))","v":10020},{"$f":"IF(ROW(B3)-1>=$D$14,\"\",OFFSET(INDIRECT(MID(CELL(\"filename\",roll!$A$15),FIND(\"]\",CELL(\"filename\",roll!$A$15))+1,31)&\"!\"&ADDRESS(MATCH(rn_01!$D$9,roll!C:C,0)+1,3,4)),ROW(B3)-1+SUM($B$14:$C$14),0))","v":521},{"$f":"IF(ROW(B3)-1>=$E$14,\"\",OFFSET(INDIRECT(MID(CELL(\"filename\",roll!$A$15),FIND(\"]\",CELL(\"filename\",roll!$A$15))+1,31)&\"!\"&ADDRESS(MATCH(rn_01!$D$9,roll!C:C,0)+1,3,4)),ROW(B3)-1+SUM($B$14:$D$14),0))","v":531},1]
[null,{"$f":"IF(ROW(B4)-1>=$B$14,\"\",OFFSET(INDIRECT(MID(CELL(\"filename\",roll!$A$15),FIND(\"]\",CELL(\"filename\",roll!$A$15))+1,31)&\"!\"&ADDRESS(MATCH(rn_01!$D$9,roll!C:C,0)+1,3,4)),ROW(B4)-1,0))","v":515},{"$f":"IF(ROW(B4)-1>=$C$14,\"\",OFFSET(INDIRECT(MID(CELL(\"filename\",roll!$A$15),FIND(\"]\",CELL(\"filename\",roll!$A$15))+1,31)&\"!\"&ADDRESS(MATCH(rn_01!$D$9,roll!C:C,0)+1,3,4)),ROW(B4)-1+SUM($B$14:$B$14),0))","v":""},{"$f":"IF(ROW(B4)-1>=$D$14,\"\",OFFSET(INDIRECT(MID(CELL(\"filename\",roll!$A$15),FIND(\"]\",CELL(\"filename\",roll!$A$15))+1,31)&\"!\"&ADDRESS(MATCH(rn_01!$D$9,roll!C:C,0)+1,3,4)),ROW(B4)-1+SUM($B$14:$C$14),0))","v":10022},{"$f":"IF(ROW(B4)-1>=$E$14,\"\",OFFSET(INDIRECT(MID(CELL(\"filename\",roll!$A$15),FIND(\"]\",CELL(\"filename\",roll!$A$15))+1,31)&\"!\"&ADDRESS(MATCH(rn_01!$D$9,roll!C:C,0)+1,3,4)),ROW(B4)-1+SUM($B$14:$D$14),0))","v":10032},1]
[null,{"$f":"IF(ROW(B5)-1>=$B$14,\"\",OFFSET(INDIRECT(MID(CELL(\"filename\",roll!$A$15),FIND(\"]\",CELL(\"filename\",roll!$A$15))+1,31)&\"!\"&ADDRESS(MATCH(rn_01!$D$9,roll!C:C,0)+1,3,4)),ROW(B5)-1,0))","v":10016},{"$f":"IF(ROW(B5)-1>=$C$14,\"\",OFFSET(INDIRECT(MID(CELL(\"filename\",roll!$A$15),FIND(\"]\",CELL(\"filename\",roll!$A$15))+1,31)&\"!\"&ADDRESS(MATCH(rn_01!$D$9,roll!C:C,0)+1,3,4)),ROW(B5)-1+SUM($B$14:$B$14),0))","v":""},{"$f":"IF(ROW(B5)-1>=$D$14,\"\",OFFSET(INDIRECT(MID(CELL(\"filename\",roll!$A$15),FIND(\"]\",CELL(\"filename\",roll!$A$15))+1,31)&\"!\"&ADDRESS(MATCH(rn_01!$D$9,roll!C:C,0)+1,3,4)),ROW(B5)-1+SUM($B$14:$C$14),0))","v":522},{"$f":"IF(ROW(B5)-1>=$E$14,\"\",OFFSET(INDIRECT(MID(CELL(\"filename\",roll!$A$15),FIND(\"]\",CELL(\"filename\",roll!$A$15))+1,31)&\"!\"&ADDRESS(MATCH(rn_01!$D$9,roll!C:C,0)+1,3,4)),ROW(B5)-1+SUM($B$14:$D$14),0))","v":""},1]
[null,{"$f":"IF(ROW(B6)-1>=$B$14,\"\",OFFSET(INDIRECT(MID(CELL(\"filename\",roll!$A$15),FIND(\"]\",CELL(\"filename\",roll!$A$15))+1,31)&\"!\"&ADDRESS(MATCH(rn_01!$D$9,roll!C:C,0)+1,3,4)),ROW(B6)-1,0))","v":516},{"$f":"IF(ROW(B6)-1>=$C$14,\"\",OFFSET(INDIRECT(MID(CELL(\"filename\",roll!$A$15),FIND(\"]\",CELL(\"filename\",roll!$A$15))+1,31)&\"!\"&ADDRESS(MATCH(rn_01!$D$9,roll!C:C,0)+1,3,4)),ROW(B6)-1+SUM($B$14:$B$14),0))","v":""},{"$f":"IF(ROW(B6)-1>=$D$14,\"\",OFFSET(INDIRECT(MID(CELL(\"filename\",roll!$A$15),FIND(\"]\",CELL(\"filename\",roll!$A$15))+1,31)&\"!\"&ADDRESS(MATCH(rn_01!$D$9,roll!C:C,0)+1,3,4)),ROW(B6)-1+SUM($B$14:$C$14),0))","v":10023},{"$f":"IF(ROW(B6)-1>=$E$14,\"\",OFFSET(INDIRECT(MID(CELL(\"filename\",roll!$A$15),FIND(\"]\",CELL(\"filename\",roll!$A$15))+1,31)&\"!\"&ADDRESS(MATCH(rn_01!$D$9,roll!C:C,0)+1,3,4)),ROW(B6)-1+SUM($B$14:$D$14),0))","v":""},1]
[null,{"$f":"IF(ROW(B7)-1>=$B$14,\"\",OFFSET(INDIRECT(MID(CELL(\"filename\",roll!$A$15),FIND(\"]\",CELL(\"filename\",roll!$A$15))+1,31)&\"!\"&ADDRESS(MATCH(rn_01!$D$9,roll!C:C,0)+1,3,4)),ROW(B7)-1,0))","v":10017},{"$f":"IF(ROW(B7)-1>=$C$14,\"\",OFFSET(INDIRECT(MID(CELL(\"filename\",roll!$A$15),FIND(\"]\",CELL(\"filename\",roll!$A$15))+1,31)&\"!\"&ADDRESS(MATCH(rn_01!$D$9,roll!C:C,0)+1,3,4)),ROW(B7)-1+SUM($B$14:$B$14),0))","v":""},{"$f":"IF(ROW(B7)-1>=$D$14,\"\",OFFSET(INDIRECT(MID(CELL(\"filename\",roll!$A$15),FIND(\"]\",CELL(\"filename\",roll!$A$15))+1,31)&\"!\"&ADDRESS(MATCH(rn_01!$D$9,roll!C:C,0)+1,3,4)),ROW(B7)-1+SUM($B$14:$C$14),0))","v":523},{"$f":"IF(ROW(B7)-1>=$E$14,\"\",OFFSET(INDIRECT(MID(CELL(\"filename\",roll!$A$15),FIND(\"]\",CELL(\"filename\",roll!$A$15))+1,31)&\"!\"&ADDRESS(MATCH(rn_01!$D$9,roll!C:C,0)+1,3,4)),ROW(B7)-1+SUM($B$14:$D$14),0))","v":""},1]
[null,{"$f":"IF(ROW(B8)-1>=$B$14,\"\",OFFSET(INDIRECT(MID(CELL(\"filename\",roll!$A$15),FIND(\"]\",CELL(\"filename\",roll!$A$15))+1,31)&\"!\"&ADDRESS(MATCH(rn_01!$D$9,roll!C:C,0)+1,3,4)),ROW(B8)-1,0))","v":517},{"$f":"IF(ROW(B8)-1>=$C$14,\"\",OFFSET(INDIRECT(MID(CELL(\"filename\",roll!$A$15),FIND(\"]\",CELL(\"filename\",roll!$A$15))+1,31)&\"!\"&ADDRESS(MATCH(rn_01!$D$9,roll!C:C,0)+1,3,4)),ROW(B8)-1+SUM($B$14:$B$14),0))","v":""},{"$f":"IF(ROW(B8)-1>=$D$14,\"\",OFFSET(INDIRECT(MID(CELL(\"filename\",roll!$A$15),FIND(\"]\",CELL(\"filename\",roll!$A$15))+1,31)&\"!\"&ADDRESS(MATCH(rn_01!$D$9,roll!C:C,0)+1,3,4)),ROW(B8)-1+SUM($B$14:$C$14),0))","v":10024},{"$f":"IF(ROW(B8)-1>=$E$14,\"\",OFFSET(INDIRECT(MID(CELL(\"filename\",roll!$A$15),FIND(\"]\",CELL(\"filename\",roll!$A$15))+1,31)&\"!\"&ADDRESS(MATCH(rn_01!$D$9,roll!C:C,0)+1,3,4)),ROW(B8)-1+SUM($B$14:$D$14),0))","v":""},1]
[null,{"$f":"IF(ROW(B9)-1>=$B$14,\"\",OFFSET(INDIRECT(MID(CELL(\"filename\",roll!$A$15),FIND(\"]\",CELL(\"filename\",roll!$A$15))+1,31)&\"!\"&ADDRESS(MATCH(rn_01!$D$9,roll!C:C,0)+1,3,4)),ROW(B9)-1,0))","v":10018},{"$f":"IF(ROW(B9)-1>=$C$14,\"\",OFFSET(INDIRECT(MID(CELL(\"filename\",roll!$A$15),FIND(\"]\",CELL(\"filename\",roll!$A$15))+1,31)&\"!\"&ADDRESS(MATCH(rn_01!$D$9,roll!C:C,0)+1,3,4)),ROW(B9)-1+SUM($B$14:$B$14),0))","v":""},{"$f":"IF(ROW(B9)-1>=$D$14,\"\",OFFSET(INDIRECT(MID(CELL(\"filename\",roll!$A$15),FIND(\"]\",CELL(\"filename\",roll!$A$15))+1,31)&\"!\"&ADDRESS(MATCH(rn_01!$D$9,roll!C:C,0)+1,3,4)),ROW(B9)-1+SUM($B$14:$C$14),0))","v":524},{"$f":"IF(ROW(B9)-1>=$E$14,\"\",OFFSET(INDIRECT(MID(CELL(\"filename\",roll!$A$15),FIND(\"]\",CELL(\"filename\",roll!$A$15))+1,31)&\"!\"&ADDRESS(MATCH(rn_01!$D$9,roll!C:C,0)+1,3,4)),ROW(B9)-1+SUM($B$14:$D$14),0))","v":""},1]
[null,{"$f":"IF(ROW(B10)-1>=$B$14,\"\",OFFSET(INDIRECT(MID(CELL(\"filename\",roll!$A$15),FIND(\"]\",CELL(\"filename\",roll!$A$15))+1,31)&\"!\"&ADDRESS(MATCH(rn_01!$D$9,roll!C:C,0)+1,3,4)),ROW(B10)-1,0))","v":518},{"$f":"IF(ROW(B10)-1>=$C$14,\"\",OFFSET(INDIRECT(MID(CELL(\"filename\",roll!$A$15),FIND(\"]\",CELL(\"filename\",roll!$A$15))+1,31)&\"!\"&ADDRESS(MATCH(rn_01!$D$9,roll!C:C,0)+1,3,4)),ROW(B10)-1+SUM($B$14:$B$14),0))","v":""},{"$f":"IF(ROW(B10)-1>=$D$14,\"\",OFFSET(INDIRECT(MID(CELL(\"filename\",roll!$A$15),FIND(\"]\",CELL(\"filename\",roll!$A$15))+1,31)&\"!\"&ADDRESS(MATCH(rn_01!$D$9,roll!C:C,0)+1,3,4)),ROW(B10)-1+SUM($B$14:$C$14),0))","v":10025},{"$f":"IF(ROW(B10)-1>=$E$14,\"\",OFFSET(INDIRECT(MID(CELL(\"filename\",roll!$A$15),FIND(\"]\",CELL(\"filename\",roll!$A$15))+1,31)&\"!\"&ADDRESS(MATCH(rn_01!$D$9,roll!C:C,0)+1,3,4)),ROW(B10)-1+SUM($B$14:$D$14),0))","v":""},1]
[null,{"$f":"IF(ROW(B11)-1>=$B$14,\"\",OFFSET(INDIRECT(MID(CELL(\"filename\",roll!$A$15),FIND(\"]\",CELL(\"filename\",roll!$A$15))+1,31)&\"!\"&ADDRESS(MATCH(rn_01!$D$9,roll!C:C,0)+1,3,4)),ROW(B11)-1,0))","v":""},{"$f":"IF(ROW(B11)-1>=$C$14,\"\",OFFSET(INDIRECT(MID(CELL(\"filename\",roll!$A$15),FIND(\"]\",CELL(\"filename\",roll!$A$15))+1,31)&\"!\"&ADDRESS(MATCH(rn_01!$D$9,roll!C:C,0)+1,3,4)),ROW(B11)-1+SUM($B$14:$B$14),0))","v":""},{"$f":"IF(ROW(B11)-1>=$D$14,\"\",OFFSET(INDIRECT(MID(CELL(\"filename\",roll!$A$15),FIND(\"]\",CELL(\"filename\",roll!$A$15))+1,31)&\"!\"&ADDRESS(MATCH(rn_01!$D$9,roll!C:C,0)+1,3,4)),ROW(B11)-1+SUM($B$14:$C$14),0))","v":525},{"$f":"IF(ROW(B11)-1>=$E$14,\"\",OFFSET(INDIRECT(MID(CELL(\"filename\",roll!$A$15),FIND(\"]\",CELL(\"filename\",roll!$A$15))+1,31)&\"!\"&ADDRESS(MATCH(rn_01!$D$9,roll!C:C,0)+1,3,4)),ROW(B11)-1+SUM($B$14:$D$14),0))","v":""},1]
[null,{"$f":"IF(ROW(B12)-1>=$B$14,\"\",OFFSET(INDIRECT(MID(CELL(\"filename\",roll!$A$15),FIND(\"]\",CELL(\"filename\",roll!$A$15))+1,31)&\"!\"&ADDRESS(MATCH(rn_01!$D$9,roll!C:C,0)+1,3,4)),ROW(B12)-1,0))","v":""},{"$f":"IF(ROW(B12)-1>=$C$14,\"\",OFFSET(INDIRECT(MID(CELL(\"filename\",roll!$A$15),FIND(\"]\",CELL(\"filename\",roll!$A$15))+1,31)&\"!\"&ADDRESS(MATCH(rn_01!$D$9,roll!C:C,0)+1,3,4)),ROW(B12)-1+SUM($B$14:$B$14),0))","v":""},{"$f":"IF(ROW(B12)-1>=$D$14,\"\",OFFSET(INDIRECT(MID(CELL(\"filename\",roll!$A$15),FIND(\"]\",CELL(\"filename\",roll!$A$15))+1,31)&\"!\"&ADDRESS(MATCH(rn_01!$D$9,roll!C:C,0)+1,3,4)),ROW(B12)-1+SUM($B$14:$C$14),0))","v":10026},{"$f":"IF(ROW(B12)-1>=$E$14,\"\",OFFSET(INDIRECT(MID(CELL(\"filename\",roll!$A$15),FIND(\"]\",CELL(\"filename\",roll!$A$15))+1,31)&\"!\"&ADDRESS(MATCH(rn_01!$D$9,roll!C:C,0)+1,3,4)),ROW(B12)-1+SUM($B$14:$D$14),0))","v":""},1]
[null,{"$f":"IF(ROW(B13)-1>=$B$14,\"\",OFFSET(INDIRECT(MID(CELL(\"filename\",roll!$A$15),FIND(\"]\",CELL(\"filename\",roll!$A$15))+1,31)&\"!\"&ADDRESS(MATCH(rn_01!$D$9,roll!C:C,0)+1,3,4)),ROW(B13)-1,0))","v":""},{"$f":"IF(ROW(B13)-1>=$C$14,\"\",OFFSET(INDIRECT(MID(CELL(\"filename\",roll!$A$15),FIND(\"]\",CELL(\"filename\",roll!$A$15))+1,31)&\"!\"&ADDRESS(MATCH(rn_01!$D$9,roll!C:C,0)+1,3,4)),ROW(B13)-1+SUM($B$14:$B$14),0))","v":""},{"$f":"IF(ROW(B13)-1>=$D$14,\"\",OFFSET(INDIRECT(MID(CELL(\"filename\",roll!$A$15),FIND(\"]\",CELL(\"filename\",roll!$A$15))+1,31)&\"!\"&ADDRESS(MATCH(rn_01!$D$9,roll!C:C,0)+1,3,4)),ROW(B13)-1+SUM($B$14:$C$14),0))","v":526},{"$f":"IF(ROW(B13)-1>=$E$14,\"\",OFFSET(INDIRECT(MID(CELL(\"filename\",roll!$A$15),FIND(\"]\",CELL(\"filename\",roll!$A$15))+1,31)&\"!\"&ADDRESS(MATCH(rn_01!$D$9,roll!C:C,0)+1,3,4)),ROW(B13)-1+SUM($B$14:$D$14),0))","v":""},1]
[null,{"$f":"IF(ROW(B14)-1>=$B$14,\"\",OFFSET(INDIRECT(MID(CELL(\"filename\",roll!$A$15),FIND(\"]\",CELL(\"filename\",roll!$A$15))+1,31)&\"!\"&ADDRESS(MATCH(rn_01!$D$9,roll!C:C,0)+1,3,4)),ROW(B14)-1,0))","v":""},{"$f":"IF(ROW(B14)-1>=$C$14,\"\",OFFSET(INDIRECT(MID(CELL(\"filename\",roll!$A$15),FIND(\"]\",CELL(\"filename\",roll!$A$15))+1,31)&\"!\"&ADDRESS(MATCH(rn_01!$D$9,roll!C:C,0)+1,3,4)),ROW(B14)-1+SUM($B$14:$B$14),0))","v":""},{"$f":"IF(ROW(B14)-1>=$D$14,\"\",OFFSET(INDIRECT(MID(CELL(\"filename\",roll!$A$15),FIND(\"]\",CELL(\"filename\",roll!$A$15))+1,31)&\"!\"&ADDRESS(MATCH(rn_01!$D$9,roll!C:C,0)+1,3,4)),ROW(B14)-1+SUM($B$14:$C$14),0))","v":10027},{"$f":"IF(ROW(B14)-1>=$E$14,\"\",OFFSET(INDIRECT(MID(CELL(\"filename\",roll!$A$15),FIND(\"]\",CELL(\"filename\",roll!$A$15))+1,31)&\"!\"&ADDRESS(MATCH(rn_01!$D$9,roll!C:C,0)+1,3,4)),ROW(B14)-1+SUM($B$14:$D$14),0))","v":""},1]
[null,{"$f":"IF(ROW(B15)-1>=$B$14,\"\",OFFSET(INDIRECT(MID(CELL(\"filename\",roll!$A$15),FIND(\"]\",CELL(\"filename\",roll!$A$15))+1,31)&\"!\"&ADDRESS(MATCH(rn_01!$D$9,roll!C:C,0)+1,3,4)),ROW(B15)-1,0))","v":""},{"$f":"IF(ROW(B15)-1>=$C$14,\"\",OFFSET(INDIRECT(MID(CELL(\"filename\",roll!$A$15),FIND(\"]\",CELL(\"filename\",roll!$A$15))+1,31)&\"!\"&ADDRESS(MATCH(rn_01!$D$9,roll!C:C,0)+1,3,4)),ROW(B15)-1+SUM($B$14:$B$14),0))","v":""},{"$f":"IF(ROW(B15)-1>=$D$14,\"\",OFFSET(INDIRECT(MID(CELL(\"filename\",roll!$A$15),FIND(\"]\",CELL(\"filename\",roll!$A$15))+1,31)&\"!\"&ADDRESS(MATCH(rn_01!$D$9,roll!C:C,0)+1,3,4)),ROW(B15)-1+SUM($B$14:$C$14),0))","v":527},{"$f":"IF(ROW(B15)-1>=$E$14,\"\",OFFSET(INDIRECT(MID(CELL(\"filename\",roll!$A$15),FIND(\"]\",CELL(\"filename\",roll!$A$15))+1,31)&\"!\"&ADDRESS(MATCH(rn_01!$D$9,roll!C:C,0)+1,3,4)),ROW(B15)-1+SUM($B$14:$D$14),0))","v":""},1]
[null,{"$f":"IF(ROW(B16)-1>=$B$14,\"\",OFFSET(INDIRECT(MID(CELL(\"filename\",roll!$A$15),FIND(\"]\",CELL(\"filename\",roll!$A$15))+1,31)&\"!\"&ADDRESS(MATCH(rn_01!$D$9,roll!C:C,0)+1,3,4)),ROW(B16)-1,0))","v":""},{"$f":"IF(ROW(B16)-1>=$C$14,\"\",OFFSET(INDIRECT(MID(CELL(\"filename\",roll!$A$15),FIND(\"]\",CELL(\"filename\",roll!$A$15))+1,31)&\"!\"&ADDRESS(MATCH(rn_01!$D$9,roll!C:C,0)+1,3,4)),ROW(B16)-1+SUM($B$14:$B$14),0))","v":""},{"$f":"IF(ROW(B16)-1>=$D$14,\"\",OFFSET(INDIRECT(MID(CELL(\"filename\",roll!$A$15),FIND(\"]\",CELL(\"filename\",roll!$A$15))+1,31)&\"!\"&ADDRESS(MATCH(rn_01!$D$9,roll!C:C,0)+1,3,4)),ROW(B16)-1+SUM($B$14:$C$14),0))","v":10028},{"$f":"IF(ROW(B16)-1>=$E$14,\"\",OFFSET(INDIRECT(MID(CELL(\"filename\",roll!$A$15),FIND(\"]\",CELL(\"filename\",roll!$A$15))+1,31)&\"!\"&ADDRESS(MATCH(rn_01!$D$9,roll!C:C,0)+1,3,4)),ROW(B16)-1+SUM($B$14:$D$14),0))","v":""},1]
[null,{"$f":"IF(ROW(B17)-1>=$B$14,\"\",OFFSET(INDIRECT(MID(CELL(\"filename\",roll!$A$15),FIND(\"]\",CELL(\"filename\",roll!$A$15))+1,31)&\"!\"&ADDRESS(MATCH(rn_01!$D$9,roll!C:C,0)+1,3,4)),ROW(B17)-1,0))","v":""},{"$f":"IF(ROW(B17)-1>=$C$14,\"\",OFFSET(INDIRECT(MID(CELL(\"filename\",roll!$A$15),FIND(\"]\",CELL(\"filename\",roll!$A$15))+1,31)&\"!\"&ADDRESS(MATCH(rn_01!$D$9,roll!C:C,0)+1,3,4)),ROW(B17)-1+SUM($B$14:$B$14),0))","v":""},{"$f":"IF(ROW(B17)-1>=$D$14,\"\",OFFSET(INDIRECT(MID(CELL(\"filename\",roll!$A$15),FIND(\"]\",CELL(\"filename\",roll!$A$15))+1,31)&\"!\"&ADDRESS(MATCH(rn_01!$D$9,roll!C:C,0)+1,3,4)),ROW(B17)-1+SUM($B$14:$C$14),0))","v":528},{"$f":"IF(ROW(B17)-1>=$E$14,\"\",OFFSET(INDIRECT(MID(CELL(\"filename\",roll!$A$15),FIND(\"]\",CELL(\"filename\",roll!$A$15))+1,31)&\"!\"&ADDRESS(MATCH(rn_01!$D$9,roll!C:C,0)+1,3,4)),ROW(B17)-1+SUM($B$14:$D$14),0))","v":""},1]
[null,{"$f":"IF(ROW(B18)-1>=$B$14,\"\",OFFSET(INDIRECT(MID(CELL(\"filename\",roll!$A$15),FIND(\"]\",CELL(\"filename\",roll!$A$15))+1,31)&\"!\"&ADDRESS(MATCH(rn_01!$D$9,roll!C:C,0)+1,3,4)),ROW(B18)-1,0))","v":""},{"$f":"IF(ROW(B18)-1>=$C$14,\"\",OFFSET(INDIRECT(MID(CELL(\"filename\",roll!$A$15),FIND(\"]\",CELL(\"filename\",roll!$A$15))+1,31)&\"!\"&ADDRESS(MATCH(rn_01!$D$9,roll!C:C,0)+1,3,4)),ROW(B18)-1+SUM($B$14:$B$14),0))","v":""},{"$f":"IF(ROW(B18)-1>=$D$14,\"\",OFFSET(INDIRECT(MID(CELL(\"filename\",roll!$A$15),FIND(\"]\",CELL(\"filename\",roll!$A$15))+1,31)&\"!\"&ADDRESS(MATCH(rn_01!$D$9,roll!C:C,0)+1,3,4)),ROW(B18)-1+SUM($B$14:$C$14),0))","v":10029},{"$f":"IF(ROW(B18)-1>=$E$14,\"\",OFFSET(INDIRECT(MID(CELL(\"filename\",roll!$A$15),FIND(\"]\",CELL(\"filename\",roll!$A$15))+1,31)&\"!\"&ADDRESS(MATCH(rn_01!$D$9,roll!C:C,0)+1,3,4)),ROW(B18)-1+SUM($B$14:$D$14),0))","v":""},1]
[null,{"$f":"IF(ROW(B19)-1>=$B$14,\"\",OFFSET(INDIRECT(MID(CELL(\"filename\",roll!$A$15),FIND(\"]\",CELL(\"filename\",roll!$A$15))+1,31)&\"!\"&ADDRESS(MATCH(rn_01!$D$9,roll!C:C,0)+1,3,4)),ROW(B19)-1,0))","v":""},{"$f":"IF(ROW(B19)-1>=$C$14,\"\",OFFSET(INDIRECT(MID(CELL(\"filename\",roll!$A$15),FIND(\"]\",CELL(\"filename\",roll!$A$15))+1,31)&\"!\"&ADDRESS(MATCH(rn_01!$D$9,roll!C:C,0)+1,3,4)),ROW(B19)-1+SUM($B$14:$B$14),0))","v":""},{"$f":"IF(ROW(B19)-1>=$D$14,\"\",OFFSET(INDIRECT(MID(CELL(\"filename\",roll!$A$15),FIND(\"]\",CELL(\"filename\",roll!$A$15))+1,31)&\"!\"&ADDRESS(MATCH(rn_01!$D$9,roll!C:C,0)+1,3,4)),ROW(B19)-1+SUM($B$14:$C$14),0))","v":529},{"$f":"IF(ROW(B19)-1>=$E$14,\"\",OFFSET(INDIRECT(MID(CELL(\"filename\",roll!$A$15),FIND(\"]\",CELL(\"filename\",roll!$A$15))+1,31)&\"!\"&ADDRESS(MATCH(rn_01!$D$9,roll!C:C,0)+1,3,4)),ROW(B19)-1+SUM($B$14:$D$14),0))","v":""},1]
[null,{"$f":"IF(ROW(B20)-1>=$B$14,\"\",OFFSET(INDIRECT(MID(CELL(\"filename\",roll!$A$15),FIND(\"]\",CELL(\"filename\",roll!$A$15))+1,31)&\"!\"&ADDRESS(MATCH(rn_01!$D$9,roll!C:C,0)+1,3,4)),ROW(B20)-1,0))","v":""},{"$f":"IF(ROW(B20)-1>=$C$14,\"\",OFFSET(INDIRECT(MID(CELL(\"filename\",roll!$A$15),FIND(\"]\",CELL(\"filename\",roll!$A$15))+1,31)&\"!\"&ADDRESS(MATCH(rn_01!$D$9,roll!C:C,0)+1,3,4)),ROW(B20)-1+SUM($B$14:$B$14),0))","v":""},{"$f":"IF(ROW(B20)-1>=$D$14,\"\",OFFSET(INDIRECT(MID(CELL(\"filename\",roll!$A$15),FIND(\"]\",CELL(\"filename\",roll!$A$15))+1,31)&\"!\"&ADDRESS(MATCH(rn_01!$D$9,roll!C:C,0)+1,3,4)),ROW(B20)-1+SUM($B$14:$C$14),0))","v":10030},{"$f":"IF(ROW(B20)-1>=$E$14,\"\",OFFSET(INDIRECT(MID(CELL(\"filename\",roll!$A$15),FIND(\"]\",CELL(\"filename\",roll!$A$15))+1,31)&\"!\"&ADDRESS(MATCH(rn_01!$D$9,roll!C:C,0)+1,3,4)),ROW(B20)-1+SUM($B$14:$D$14),0))","v":""},1]
[]
[null,"परीक्षा प्रभारी",null,null,"केन्द्राधीक्षक "]
[null,{"$f":"rn_01!$B$37","v":"ASD (Lecturer)"},null,null,{"$f":"rn_01!$E$37","v":"XYZ (Principal)"}]

{"sheet":"rn_03","index":3,"n_rows":37,"n_cols":6,"rows_kept":37,"cut":false,"hidden":false,"merged":[[11,1,11,4],[0,1,0,4],[1,1,1,4],[2,1,2,4],[3,1,3,4],[4,1,4,4],[5,1,5,4],[7,1,7,4],[8,1,8,2],[8,3,8,4],[9,1,9,4],[10,1,10,4]]}
[null,{"$f":"rn_01!$B$1","v":"Class VIIITH Board Examination, 2025"}]
[null,"परीक्षा केंद्र नाम एवं परीक्षा केंद्र क्रमांक"]
[null,{"$f":"rn_01!$B$3","v":"GSSS Malutana (12345)"}]
[null,"परीक्षा कक्ष / हॉल क्रमांक"]
[null,{"$f":"rn_01!$K$3","v":3}]
[null,"परीक्षा दिनांक (दिवस) ... से ... तक"]
[null,{"$f":"rn_01!$B$7","v":"01-03-2025"},{"$f":"IF(B7=\"\",\"\",TEXT(B7,\"DDDD\"))","v":"Saturday"},{"$f":"rn_01!$D$7","v":"22-05-2025"},{"$f":"IF(D7=\"\",\"\",TEXT(D7,\"DDDD\"))","v":"Thursday"}]
[null,"परीक्षार्थी रोल नंबर ... से ... तक"]
[null,{"$f":"IF(B14>0,B15,IF(C14>0,C15,IF(D14>0,D15,IF(E14>0,E15,0))))","v":532},null,{"$f":"IF(E14>0,LOOKUP(2,1/(E15:E34<>\"\"),E15:E34),IF(D14>0,LOOKUP(2,1/(D15:D34<>\"\"),D15:D34),IF(C14>0,LOOKUP(2,1/(C15:C34<>\"\"),C15:C34),IF(B14>0,LOOKUP(2,1/(B15:B34<>\"\"),B15:B34),0))))","v":10046}]
[null,"कुल सम्मिलित परीक्षार्थी "]
[null,{"$f":"COUNTIF($B$15:$E$34,\">0\")","v":28}]
[null,"परीक्षार्थी बैठक व्यवस्था"]
[null,"पंक्ति 1","पंक्ति 2","पंक्ति 3","पंक्ति 4"]
[null,{"$f":"rn_01!L3","v":10},{"$f":"rn_01!M3","v":9},{"$f":"rn_01!N3","v":4},{"$f":"rn_01!O3","v":5}]
[null,{"$f":"IF(ROW(B1)-1>=$B$14,\"\",OFFSET(INDIRECT(MID(CELL(\"filename\",roll!$A$15),FIND(\"]\",CELL(\"filename\",roll!$A$15))+1,31)&\"!\"&ADDRESS(MATCH(rn_02!$D$9,roll!C:C,0)+1,3,4)),ROW(B1)-1,0))","v":532},{"$f":"IF(ROW(B1)-1>=$C$14,\"\",OFFSET(INDIRECT(MID(CELL(\"filename\",roll!$A$15),FIND(\"]\",CELL(\"filename\",roll!$A$15))+1,31)&\"!\"&ADDRESS(MATCH(rn_02!$D$9,roll!C:C,0)+1,3,4)),ROW(B1)-1+SUM($B$14:$B$14),0))","v":537},{"$f":"IF(ROW(B1)-1>=$D$14,\"\",OFFSET(INDIRECT(MID(CELL(\"filename\",roll!$A$15),FIND(\"]\",CELL(\"filename\",roll!$A$15))+1,31)&\"!\"&ADDRESS(MATCH(rn_02!$D$9,roll!C:C,0)+1,3,4)),ROW(B1)-1+SUM($B$14:$C$14),0))","v":10042},{"$f":"IF(ROW(B1)-1>=$E$14,\"\",OFFSET(INDIRECT(MID(CELL(\"filename\",roll!$A$15),FIND(\"]\",CELL(\"filename\",roll!$A$15))+1,31)&\"!\"&ADDRESS(MATCH(rn_02!$D$9,roll!C:C,0)+1,3,4)),ROW(B1)-1+SUM($B$14:$D$14),0))","v":10044},{"$f":"IF(SUM(B15:E15)>0,1,\"\")","v":1}]
[null,{"$f":"IF(ROW(B2)-1>=$B$14,\"\",OFFSET(INDIRECT(MID(CELL(\"filename\",roll!$A$15),FIND(\"]\",CELL(\"filename\",roll!$A$15))+1,31)&\"!\"&ADDRESS(MATCH(rn_02!$D$9,roll!C:C,0)+1,3,4)),ROW(B2)-1,0))","v":10033},{"$f":"IF(ROW(B2)-1>=$C$14,\"\",OFFSET(INDIRECT(MID(CELL(\"filename\",roll!$A$15),FIND(\"]\",CELL(\"filename\",roll!$A$15))+1,31)&\"!\"&ADDRESS(MATCH(rn_02!$D$9,roll!C:C,0)+1,3,4)),ROW(B2)-1+SUM($B$14:$B$14),0))","v":10038},{"$f":"IF(ROW(B2)-1>=$D$14,\"\",OFFSET(INDIRECT(MID(CELL(\"filename\",roll!$A$15),FIND(\"]\",CELL(\"filename\",roll!$A$15))+1,31)&\"!\"&ADDRESS(MATCH(rn_02!$D$9,roll!C:C,0)+1,3,4)),ROW(B2)-1+SUM($B$14:$C$14),0))","v":542},{"$f":"IF(ROW(B2)-1>=$E$14,\"\",OFFSET(INDIRECT(MID(CELL(\"filename\",roll!$A$15),FIND(\"]\",CELL(\"filename\",roll!$A$15))+1,31)&\"!\"&ADDRESS(MATCH(rn_02!$D$9,roll!C:C,0)+1,3,4)),ROW(B2)-1+SUM($B$14:$D$14),0))","v":544},{"$f":"IF(SUM(B16:E16)>0,1,\"\")","v":1}]
[null,{"$f":"IF(ROW(B3)-1>=$B$14,\"\",OFFSET(INDIRECT(MID(CELL(\"filename\",roll!$A$15),FIND(\"]\",CELL(\"filename\",roll!$A$15))+1,31)&\"!\"&ADDRESS(MATCH(rn_02!$D$9,roll!C:C,0)+1,3,4)),ROW(B3)-1,0))","v":533},{"$f":"IF(ROW(B3)-1>=$C$14,\"\",OFFSET(INDIRECT(MID(CELL(\"filename\",roll!$A$15),FIND(\"]\",CELL(\"filename\",roll!$A$15))+1,31)&\"!\"&ADDRESS(MATCH(rn_02!$D$9,roll!C:C,0)+1,3,4)),ROW(B3)-1+SUM($B$14:$B$14),0))","v":538},{"$f":"IF(ROW(B3)-1>=$D$14,\"\",OFFSET(INDIRECT(MID(CELL(\"filename\",roll!$A$15),FIND(\"]\",CELL(\"filename\",roll!$A$15))+1,31)&\"!\"&ADDRESS(MATCH(rn_02!$D$9,roll!C:C,0)+1,3,4)),ROW(B3)-1+SUM($B$14:$C$14),0))","v":10043},{"$f":"IF(ROW(B3)-1>=$E$14,\"\",OFFSET(INDIRECT(MID(CELL(\"filename\",roll!$A$15),FIND(\"]\",CELL(\"filename\",roll!$A$15))+1,31)&\"!\"&ADDRESS(MATCH(rn_02!$D$9,roll!C:C,0)+1,3,4)),ROW(B3)-1+SUM($B$14:$D$14),0))","v":10045},1]
[null,{"$f":"IF(ROW(B4)-1>=$B$14,\"\",OFFSET(INDIRECT(MID(CELL(\"filename\",roll!$A$15),FIND(\"]\",CELL(\"filename\",roll!$A$15))+1,31)&\"!\"&ADDRESS(MATCH(rn_02!$D$9,roll!C:C,0)+1,3,4)),ROW(B4)-1,0))","v":10034},{"$f":"IF(ROW(B4)-1>=$C$14,\"\",OFFSET(INDIRECT(MID(CELL(\"filename\",roll!$A$15),FIND(\"]\",CELL(\"filename\",roll!$A$15))+1,31)&\"!\"&ADDRESS(MATCH(rn_02!$D$9,roll!C:C,0)+1,3,4)),ROW(B4)-1+SUM($B$14:$B$14),0))","v":10039},{"$f":"IF(ROW(B4)-1>=$D$14,\"\",OFFSET(INDIRECT(MID(CELL(\"filename\",roll!$A$15),FIND(\"]\",CELL(\"filename\",roll!$A$15))+1,31)&\"!\"&ADDRESS(MATCH(rn_02!$D$9,roll!C:C,0)+1,3,4)),ROW(B4)-1+SUM($B$14:$C$14),0))","v":543},{"$f":"IF(ROW(B4)-1>=$E$14,\"\",OFFSET(INDIRECT(MID(CELL(\"filename\",roll!$A$15),FIND(\"]\",CELL(\"filename\",roll!$A$15))+1,31)&\"!\"&ADDRESS(MATCH(rn_02!$D$9,roll!C:C,0)+1,3,4)),ROW(B4)-1+SUM($B$14:$D$14),0))","v":545},1]
[null,{"$f":"IF(ROW(B5)-1>=$B$14,\"\",OFFSET(INDIRECT(MID(CELL(\"filename\",roll!$A$15),FIND(\"]\",CELL(\"filename\",roll!$A$15))+1,31)&\"!\"&ADDRESS(MATCH(rn_02!$D$9,roll!C:C,0)+1,3,4)),ROW(B5)-1,0))","v":534},{"$f":"IF(ROW(B5)-1>=$C$14,\"\",OFFSET(INDIRECT(MID(CELL(\"filename\",roll!$A$15),FIND(\"]\",CELL(\"filename\",roll!$A$15))+1,31)&\"!\"&ADDRESS(MATCH(rn_02!$D$9,roll!C:C,0)+1,3,4)),ROW(B5)-1+SUM($B$14:$B$14),0))","v":539},{"$f":"IF(ROW(B5)-1>=$D$14,\"\",OFFSET(INDIRECT(MID(CELL(\"filename\",roll!$A$15),FIND(\"]\",CELL(\"filename\",roll!$A$15))+1,31)&\"!\"&ADDRESS(MATCH(rn_02!$D$9,roll!C:C,0)+1,3,4)),ROW(B5)-1+SUM($B$14:$C$14),0))","v":""},{"$f":"IF(ROW(B5)-1>=$E$14,\"\",OFFSET(INDIRECT(MID(CELL(\"filename\",roll!$A$15),FIND(\"]\",CELL(\"filename\",roll!$A$15))+1,31)&\"!\"&ADDRESS(MATCH(rn_02!$D$9,roll!C:C,0)+1,3,4)),ROW(B5)-1+SUM($B$14:$D$14),0))","v":10046},1]
[null,{"$f":"IF(ROW(B6)-1>=$B$14,\"\",OFFSET(INDIRECT(MID(CELL(\"filename\",roll!$A$15),FIND(\"]\",CELL(\"filename\",roll!$A$15))+1,31)&\"!\"&ADDRESS(MATCH(rn_02!$D$9,roll!C:C,0)+1,3,4)),ROW(B6)-1,0))","v":10035},{"$f":"IF(ROW(B6)-1>=$C$14,\"\",OFFSET(INDIRECT(MID(CELL(\"filename\",roll!$A$15),FIND(\"]\",CELL(\"filename\",roll!$A$15))+1,31)&\"!\"&ADDRESS(MATCH(rn_02!$D$9,roll!C:C,0)+1,3,4)),ROW(B6)-1+SUM($B$14:$B$14),0))","v":10040},{"$f":"IF(ROW(B6)-1>=$D$14,\"\",OFFSET(INDIRECT(MID(CELL(\"filename\",roll!$A$15),FIND(\"]\",CELL(\"filename\",roll!$A$15))+1,31)&\"!\"&ADDRESS(MATCH(rn_02!$D$9,roll!C:C,0)+1,3,4)),ROW(B6)-1+SUM($B$14:$C$14),0))","v":""},{"$f":"IF(ROW(B6)-1>=$E$14,\"\",OFFSET(INDIRECT(MID(CELL(\"filename\",roll!$A$15),FIND(\"]\",CELL(\"filename\",roll!$A$15))+1,31)&\"!\"&ADDRESS(MATCH(rn_02!$D$9,roll!C:C,0)+1,3,4)),ROW(B6)-1+SUM($B$14:$D$14),0))","v":""},1]
[null,{"$f":"IF(ROW(B7)-1>=$B$14,\"\",OFFSET(INDIRECT(MID(CELL(\"filename\",roll!$A$15),FIND(\"]\",CELL(\"filename\",roll!$A$15))+1,31)&\"!\"&ADDRESS(MATCH(rn_02!$D$9,roll!C:C,0)+1,3,4)),ROW(B7)-1,0))","v":535},{"$f":"IF(ROW(B7)-1>=$C$14,\"\",OFFSET(INDIRECT(MID(CELL(\"filename\",roll!$A$15),FIND(\"]\",CELL(\"filename\",roll!$A$15))+1,31)&\"!\"&ADDRESS(MATCH(rn_02!$D$9,roll!C:C,0)+1,3,4)),ROW(B7)-1+SUM($B$14:$B$14),0))","v":540},{"$f":"IF(ROW(B7)-1>=$D$14,\"\",OFFSET(INDIRECT(MID(CELL(\"filename\",roll!$A$15),FIND(\"]\",CELL(\"filename\",roll!$A$15))+1,31)&\"!\"&ADDRESS(MATCH(rn_02!$D$9,roll!C:C,0)+1,3,4)),ROW(B7)-1+SUM($B$14:$C$14),0))","v":""},{"$f":"IF(ROW(B7)-1>=$E$14,\"\",OFFSET(INDIRECT(MID(CELL(\"filename\",roll!$A$15),FIND(\"]\",CELL(\"filename\",roll!$A$15))+1,31)&\"!\"&ADDRESS(MATCH(rn_02!$D$9,roll!C:C,0)+1,3,4)),ROW(B7)-1+SUM($B$14:$D$14),0))","v":""},1]
[null,{"$f":"IF(ROW(B8)-1>=$B$14,\"\",OFFSET(INDIRECT(MID(CELL(\"filename\",roll!$A$15),FIND(\"]\",CELL(\"filename\",roll!$A$15))+1,31)&\"!\"&ADDRESS(MATCH(rn_02!$D$9,roll!C:C,0)+1,3,4)),ROW(B8)-1,0))","v":10036},{"$f":"IF(ROW(B8)-1>=$C$14,\"\",OFFSET(INDIRECT(MID(CELL(\"filename\",roll!$A$15),FIND(\"]\",CELL(\"filename\",roll!$A$15))+1,31)&\"!\"&ADDRESS(MATCH(rn_02!$D$9,roll!C:C,0)+1,3,4)),ROW(B8)-1+SUM($B$14:$B$14),0))","v":10041},{"$f":"IF(ROW(B8)-1>=$D$14,\"\",OFFSET(INDIRECT(MID(CELL(\"filename\",roll!$A$15),FIND(\"]\",CELL(\"filename\",roll!$A$15))+1,31)&\"!\"&ADDRESS(MATCH(rn_02!$D$9,roll!C:C,0)+1,3,4)),ROW(B8)-1+SUM($B$14:$C$14),0))","v":""},{"$f":"IF(ROW(B8)-1>=$E$14,\"\",OFFSET(INDIRECT(MID(CELL(\"filename\",roll!$A$15),FIND(\"]\",CELL(\"filename\",roll!$A$15))+1,31)&\"!\"&ADDRESS(MATCH(rn_02!$D$9,roll!C:C,0)+1,3,4)),ROW(B8)-1+SUM($B$14:$D$14),0))","v":""},1]
[null,{"$f":"IF(ROW(B9)-1>=$B$14,\"\",OFFSET(INDIRECT(MID(CELL(\"filename\",roll!$A$15),FIND(\"]\",CELL(\"filename\",roll!$A$15))+1,31)&\"!\"&ADDRESS(MATCH(rn_02!$D$9,roll!C:C,0)+1,3,4)),ROW(B9)-1,0))","v":536},{"$f":"IF(ROW(B9)-1>=$C$14,\"\",OFFSET(INDIRECT(MID(CELL(\"filename\",roll!$A$15),FIND(\"]\",CELL(\"filename\",roll!$A$15))+1,31)&\"!\"&ADDRESS(MATCH(rn_02!$D$9,roll!C:C,0)+1,3,4)),ROW(B9)-1+SUM($B$14:$B$14),0))","v":541},{"$f":"IF(ROW(B9)-1>=$D$14,\"\",OFFSET(INDIRECT(MID(CELL(\"filename\",roll!$A$15),FIND(\"]\",CELL(\"filename\",roll!$A$15))+1,31)&\"!\"&ADDRESS(MATCH(rn_02!$D$9,roll!C:C,0)+1,3,4)),ROW(B9)-1+SUM($B$14:$C$14),0))","v":""},{"$f":"IF(ROW(B9)-1>=$E$14,\"\",OFFSET(INDIRECT(MID(CELL(\"filename\",roll!$A$15),FIND(\"]\",CELL(\"filename\",roll!$A$15))+1,31)&\"!\"&ADDRESS(MATCH(rn_02!$D$9,roll!C:C,0)+1,3,4)),ROW(B9)-1+SUM($B$14:$D$14),0))","v":""},1]
[null,{"$f":"IF(ROW(B10)-1>=$B$14,\"\",OFFSET(INDIRECT(MID(CELL(\"filename\",roll!$A$15),FIND(\"]\",CELL(\"filename\",roll!$A$15))+1,31)&\"!\"&ADDRESS(MATCH(rn_02!$D$9,roll!C:C,0)+1,3,4)),ROW(B10)-1,0))","v":10037},{"$f":"IF(ROW(B10)-1>=$C$14,\"\",OFFSET(INDIRECT(MID(CELL(\"filename\",roll!$A$15),FIND(\"]\",CELL(\"filename\",roll!$A$15))+1,31)&\"!\"&ADDRESS(MATCH(rn_02!$D$9,roll!C:C,0)+1,3,4)),ROW(B10)-1+SUM($B$14:$B$14),0))","v":""},{"$f":"IF(ROW(B10)-1>=$D$14,\"\",OFFSET(INDIRECT(MID(CELL(\"filename\",roll!$A$15),FIND(\"]\",CELL(\"filename\",roll!$A$15))+1,31)&\"!\"&ADDRESS(MATCH(rn_02!$D$9,roll!C:C,0)+1,3,4)),ROW(B10)-1+SUM($B$14:$C$14),0))","v":""},{"$f":"IF(ROW(B10)-1>=$E$14,\"\",OFFSET(INDIRECT(MID(CELL(\"filename\",roll!$A$15),FIND(\"]\",CELL(\"filename\",roll!$A$15))+1,31)&\"!\"&ADDRESS(MATCH(rn_02!$D$9,roll!C:C,0)+1,3,4)),ROW(B10)-1+SUM($B$14:$D$14),0))","v":""},1]
[null,{"$f":"IF(ROW(B11)-1>=$B$14,\"\",OFFSET(INDIRECT(MID(CELL(\"filename\",roll!$A$15),FIND(\"]\",CELL(\"filename\",roll!$A$15))+1,31)&\"!\"&ADDRESS(MATCH(rn_02!$D$9,roll!C:C,0)+1,3,4)),ROW(B11)-1,0))","v":""},{"$f":"IF(ROW(B11)-1>=$C$14,\"\",OFFSET(INDIRECT(MID(CELL(\"filename\",roll!$A$15),FIND(\"]\",CELL(\"filename\",roll!$A$15))+1,31)&\"!\"&ADDRESS(MATCH(rn_02!$D$9,roll!C:C,0)+1,3,4)),ROW(B11)-1+SUM($B$14:$B$14),0))","v":""},{"$f":"IF(ROW(B11)-1>=$D$14,\"\",OFFSET(INDIRECT(MID(CELL(\"filename\",roll!$A$15),FIND(\"]\",CELL(\"filename\",roll!$A$15))+1,31)&\"!\"&ADDRESS(MATCH(rn_02!$D$9,roll!C:C,0)+1,3,4)),ROW(B11)-1+SUM($B$14:$C$14),0))","v":""},{"$f":"IF(ROW(B11)-1>=$E$14,\"\",OFFSET(INDIRECT(MID(CELL(\"filename\",roll!$A$15),FIND(\"]\",CELL(\"filename\",roll!$A$15))+1,31)&\"!\"&ADDRESS(MATCH(rn_02!$D$9,roll!C:C,0)+1,3,4)),ROW(B11)-1+SUM($B$14:$D$14),0))","v":""},""]
[null,{"$f":"IF(ROW(B12)-1>=$B$14,\"\",OFFSET(INDIRECT(MID(CELL(\"filename\",roll!$A$15),FIND(\"]\",CELL(\"filename\",roll!$A$15))+1,31)&\"!\"&ADDRESS(MATCH(rn_02!$D$9,roll!C:C,0)+1,3,4)),ROW(B12)-1,0))","v":""},{"$f":"IF(ROW(B12)-1>=$C$14,\"\",OFFSET(INDIRECT(MID(CELL(\"filename\",roll!$A$15),FIND(\"]\",CELL(\"filename\",roll!$A$15))+1,31)&\"!\"&ADDRESS(MATCH(rn_02!$D$9,roll!C:C,0)+1,3,4)),ROW(B12)-1+SUM($B$14:$B$14),0))","v":""},{"$f":"IF(ROW(B12)-1>=$D$14,\"\",OFFSET(INDIRECT(MID(CELL(\"filename\",roll!$A$15),FIND(\"]\",CELL(\"filename\",roll!$A$15))+1,31)&\"!\"&ADDRESS(MATCH(rn_02!$D$9,roll!C:C,0)+1,3,4)),ROW(B12)-1+SUM($B$14:$C$14),0))","v":""},{"$f":"IF(ROW(B12)-1>=$E$14,\"\",OFFSET(INDIRECT(MID(CELL(\"filename\",roll!$A$15),FIND(\"]\",CELL(\"filename\",roll!$A$15))+1,31)&\"!\"&ADDRESS(MATCH(rn_02!$D$9,roll!C:C,0)+1,3,4)),ROW(B12)-1+SUM($B$14:$D$14),0))","v":""},""]
[null,{"$f":"IF(ROW(B13)-1>=$B$14,\"\",OFFSET(INDIRECT(MID(CELL(\"filename\",roll!$A$15),FIND(\"]\",CELL(\"filename\",roll!$A$15))+1,31)&\"!\"&ADDRESS(MATCH(rn_02!$D$9,roll!C:C,0)+1,3,4)),ROW(B13)-1,0))","v":""},{"$f":"IF(ROW(B13)-1>=$C$14,\"\",OFFSET(INDIRECT(MID(CELL(\"filename\",roll!$A$15),FIND(\"]\",CELL(\"filename\",roll!$A$15))+1,31)&\"!\"&ADDRESS(MATCH(rn_02!$D$9,roll!C:C,0)+1,3,4)),ROW(B13)-1+SUM($B$14:$B$14),0))","v":""},{"$f":"IF(ROW(B13)-1>=$D$14,\"\",OFFSET(INDIRECT(MID(CELL(\"filename\",roll!$A$15),FIND(\"]\",CELL(\"filename\",roll!$A$15))+1,31)&\"!\"&ADDRESS(MATCH(rn_02!$D$9,roll!C:C,0)+1,3,4)),ROW(B13)-1+SUM($B$14:$C$14),0))","v":""},{"$f":"IF(ROW(B13)-1>=$E$14,\"\",OFFSET(INDIRECT(MID(CELL(\"filename\",roll!$A$15),FIND(\"]\",CELL(\"filename\",roll!$A$15))+1,31)&\"!\"&ADDRESS(MATCH(rn_02!$D$9,roll!C:C,0)+1,3,4)),ROW(B13)-1+SUM($B$14:$D$14),0))","v":""},""]
[null,{"$f":"IF(ROW(B14)-1>=$B$14,\"\",OFFSET(INDIRECT(MID(CELL(\"filename\",roll!$A$15),FIND(\"]\",CELL(\"filename\",roll!$A$15))+1,31)&\"!\"&ADDRESS(MATCH(rn_02!$D$9,roll!C:C,0)+1,3,4)),ROW(B14)-1,0))","v":""},{"$f":"IF(ROW(B14)-1>=$C$14,\"\",OFFSET(INDIRECT(MID(CELL(\"filename\",roll!$A$15),FIND(\"]\",CELL(\"filename\",roll!$A$15))+1,31)&\"!\"&ADDRESS(MATCH(rn_02!$D$9,roll!C:C,0)+1,3,4)),ROW(B14)-1+SUM($B$14:$B$14),0))","v":""},{"$f":"IF(ROW(B14)-1>=$D$14,\"\",OFFSET(INDIRECT(MID(CELL(\"filename\",roll!$A$15),FIND(\"]\",CELL(\"filename\",roll!$A$15))+1,31)&\"!\"&ADDRESS(MATCH(rn_02!$D$9,roll!C:C,0)+1,3,4)),ROW(B14)-1+SUM($B$14:$C$14),0))","v":""},{"$f":"IF(ROW(B14)-1>=$E$14,\"\",OFFSET(INDIRECT(MID(CELL(\"filename\",roll!$A$15),FIND(\"]\",CELL(\"filename\",roll!$A$15))+1,31)&\"!\"&ADDRESS(MATCH(rn_02!$D$9,roll!C:C,0)+1,3,4)),ROW(B14)-1+SUM($B$14:$D$14),0))","v":""},""]
[null,{"$f":"IF(ROW(B15)-1>=$B$14,\"\",OFFSET(INDIRECT(MID(CELL(\"filename\",roll!$A$15),FIND(\"]\",CELL(\"filename\",roll!$A$15))+1,31)&\"!\"&ADDRESS(MATCH(rn_02!$D$9,roll!C:C,0)+1,3,4)),ROW(B15)-1,0))","v":""},{"$f":"IF(ROW(B15)-1>=$C$14,\"\",OFFSET(INDIRECT(MID(CELL(\"filename\",roll!$A$15),FIND(\"]\",CELL(\"filename\",roll!$A$15))+1,31)&\"!\"&ADDRESS(MATCH(rn_02!$D$9,roll!C:C,0)+1,3,4)),ROW(B15)-1+SUM($B$14:$B$14),0))","v":""},{"$f":"IF(ROW(B15)-1>=$D$14,\"\",OFFSET(INDIRECT(MID(CELL(\"filename\",roll!$A$15),FIND(\"]\",CELL(\"filename\",roll!$A$15))+1,31)&\"!\"&ADDRESS(MATCH(rn_02!$D$9,roll!C:C,0)+1,3,4)),ROW(B15)-1+SUM($B$14:$C$14),0))","v":""},{"$f":"IF(ROW(B15)-1>=$E$14,\"\",OFFSET(INDIRECT(MID(CELL(\"filename\",roll!$A$15),FIND(\"]\",CELL(\"filename\",roll!$A$15))+1,31)&\"!\"&ADDRESS(MATCH(rn_02!$D$9,roll!C:C,0)+1,3,4)),ROW(B15)-1+SUM($B$14:$D$14),0))","v":""},""]
[null,{"$f":"IF(ROW(B16)-1>=$B$14,\"\",OFFSET(INDIRECT(MID(CELL(\"filename\",roll!$A$15),FIND(\"]\",CELL(\"filename\",roll!$A$15))+1,31)&\"!\"&ADDRESS(MATCH(rn_02!$D$9,roll!C:C,0)+1,3,4)),ROW(B16)-1,0))","v":""},{"$f":"IF(ROW(B16)-1>=$C$14,\"\",OFFSET(INDIRECT(MID(CELL(\"filename\",roll!$A$15),FIND(\"]\",CELL(\"filename\",roll!$A$15))+1,31)&\"!\"&ADDRESS(MATCH(rn_02!$D$9,roll!C:C,0)+1,3,4)),ROW(B16)-1+SUM($B$14:$B$14),0))","v":""},{"$f":"IF(ROW(B16)-1>=$D$14,\"\",OFFSET(INDIRECT(MID(CELL(\"filename\",roll!$A$15),FIND(\"]\",CELL(\"filename\",roll!$A$15))+1,31)&\"!\"&ADDRESS(MATCH(rn_02!$D$9,roll!C:C,0)+1,3,4)),ROW(B16)-1+SUM($B$14:$C$14),0))","v":""},{"$f":"IF(ROW(B16)-1>=$E$14,\"\",OFFSET(INDIRECT(MID(CELL(\"filename\",roll!$A$15),FIND(\"]\",CELL(\"filename\",roll!$A$15))+1,31)&\"!\"&ADDRESS(MATCH(rn_02!$D$9,roll!C:C,0)+1,3,4)),ROW(B16)-1+SUM($B$14:$D$14),0))","v":""},""]
[null,{"$f":"IF(ROW(B17)-1>=$B$14,\"\",OFFSET(INDIRECT(MID(CELL(\"filename\",roll!$A$15),FIND(\"]\",CELL(\"filename\",roll!$A$15))+1,31)&\"!\"&ADDRESS(MATCH(rn_02!$D$9,roll!C:C,0)+1,3,4)),ROW(B17)-1,0))","v":""},{"$f":"IF(ROW(B17)-1>=$C$14,\"\",OFFSET(INDIRECT(MID(CELL(\"filename\",roll!$A$15),FIND(\"]\",CELL(\"filename\",roll!$A$15))+1,31)&\"!\"&ADDRESS(MATCH(rn_02!$D$9,roll!C:C,0)+1,3,4)),ROW(B17)-1+SUM($B$14:$B$14),0))","v":""},{"$f":"IF(ROW(B17)-1>=$D$14,\"\",OFFSET(INDIRECT(MID(CELL(\"filename\",roll!$A$15),FIND(\"]\",CELL(\"filename\",roll!$A$15))+1,31)&\"!\"&ADDRESS(MATCH(rn_02!$D$9,roll!C:C,0)+1,3,4)),ROW(B17)-1+SUM($B$14:$C$14),0))","v":""},{"$f":"IF(ROW(B17)-1>=$E$14,\"\",OFFSET(INDIRECT(MID(CELL(\"filename\",roll!$A$15),FIND(\"]\",CELL(\"filename\",roll!$A$15))+1,31)&\"!\"&ADDRESS(MATCH(rn_02!$D$9,roll!C:C,0)+1,3,4)),ROW(B17)-1+SUM($B$14:$D$14),0))","v":""},""]
[null,{"$f":"IF(ROW(B18)-1>=$B$14,\"\",OFFSET(INDIRECT(MID(CELL(\"filename\",roll!$A$15),FIND(\"]\",CELL(\"filename\",roll!$A$15))+1,31)&\"!\"&ADDRESS(MATCH(rn_02!$D$9,roll!C:C,0)+1,3,4)),ROW(B18)-1,0))","v":""},{"$f":"IF(ROW(B18)-1>=$C$14,\"\",OFFSET(INDIRECT(MID(CELL(\"filename\",roll!$A$15),FIND(\"]\",CELL(\"filename\",roll!$A$15))+1,31)&\"!\"&ADDRESS(MATCH(rn_02!$D$9,roll!C:C,0)+1,3,4)),ROW(B18)-1+SUM($B$14:$B$14),0))","v":""},{"$f":"IF(ROW(B18)-1>=$D$14,\"\",OFFSET(INDIRECT(MID(CELL(\"filename\",roll!$A$15),FIND(\"]\",CELL(\"filename\",roll!$A$15))+1,31)&\"!\"&ADDRESS(MATCH(rn_02!$D$9,roll!C:C,0)+1,3,4)),ROW(B18)-1+SUM($B$14:$C$14),0))","v":""},{"$f":"IF(ROW(B18)-1>=$E$14,\"\",OFFSET(INDIRECT(MID(CELL(\"filename\",roll!$A$15),FIND(\"]\",CELL(\"filename\",roll!$A$15))+1,31)&\"!\"&ADDRESS(MATCH(rn_02!$D$9,roll!C:C,0)+1,3,4)),ROW(B18)-1+SUM($B$14:$D$14),0))","v":""},""]
[null,{"$f":"IF(ROW(B19)-1>=$B$14,\"\",OFFSET(INDIRECT(MID(CELL(\"filename\",roll!$A$15),FIND(\"]\",CELL(\"filename\",roll!$A$15))+1,31)&\"!\"&ADDRESS(MATCH(rn_02!$D$9,roll!C:C,0)+1,3,4)),ROW(B19)-1,0))","v":""},{"$f":"IF(ROW(B19)-1>=$C$14,\"\",OFFSET(INDIRECT(MID(CELL(\"filename\",roll!$A$15),FIND(\"]\",CELL(\"filename\",roll!$A$15))+1,31)&\"!\"&ADDRESS(MATCH(rn_02!$D$9,roll!C:C,0)+1,3,4)),ROW(B19)-1+SUM($B$14:$B$14),0))","v":""},{"$f":"IF(ROW(B19)-1>=$D$14,\"\",OFFSET(INDIRECT(MID(CELL(\"filename\",roll!$A$15),FIND(\"]\",CELL(\"filename\",roll!$A$15))+1,31)&\"!\"&ADDRESS(MATCH(rn_02!$D$9,roll!C:C,0)+1,3,4)),ROW(B19)-1+SUM($B$14:$C$14),0))","v":""},{"$f":"IF(ROW(B19)-1>=$E$14,\"\",OFFSET(INDIRECT(MID(CELL(\"filename\",roll!$A$15),FIND(\"]\",CELL(\"filename\",roll!$A$15))+1,31)&\"!\"&ADDRESS(MATCH(rn_02!$D$9,roll!C:C,0)+1,3,4)),ROW(B19)-1+SUM($B$14:$D$14),0))","v":""},""]
[null,{"$f":"IF(ROW(B20)-1>=$B$14,\"\",OFFSET(INDIRECT(MID(CELL(\"filename\",roll!$A$15),FIND(\"]\",CELL(\"filename\",roll!$A$15))+1,31)&\"!\"&ADDRESS(MATCH(rn_02!$D$9,roll!C:C,0)+1,3,4)),ROW(B20)-1,0))","v":""},{"$f":"IF(ROW(B20)-1>=$C$14,\"\",OFFSET(INDIRECT(MID(CELL(\"filename\",roll!$A$15),FIND(\"]\",CELL(\"filename\",roll!$A$15))+1,31)&\"!\"&ADDRESS(MATCH(rn_02!$D$9,roll!C:C,0)+1,3,4)),ROW(B20)-1+SUM($B$14:$B$14),0))","v":""},{"$f":"IF(ROW(B20)-1>=$D$14,\"\",OFFSET(INDIRECT(MID(CELL(\"filename\",roll!$A$15),FIND(\"]\",CELL(\"filename\",roll!$A$15))+1,31)&\"!\"&ADDRESS(MATCH(rn_02!$D$9,roll!C:C,0)+1,3,4)),ROW(B20)-1+SUM($B$14:$C$14),0))","v":""},{"$f":"IF(ROW(B20)-1>=$E$14,\"\",OFFSET(INDIRECT(MID(CELL(\"filename\",roll!$A$15),FIND(\"]\",CELL(\"filename\",roll!$A$15))+1,31)&\"!\"&ADDRESS(MATCH(rn_02!$D$9,roll!C:C,0)+1,3,4)),ROW(B20)-1+SUM($B$14:$D$14),0))","v":""},""]
[]
[null,"परीक्षा प्रभारी",null,null,"केन्द्राधीक्षक "]
[null,{"$f":"rn_01!$B$37","v":"ASD (Lecturer)"},null,null,{"$f":"rn_01!$E$37","v":"XYZ (Principal)"}]

{"sheet":"rn_04","index":4,"n_rows":37,"n_cols":6,"rows_kept":37,"cut":false,"hidden":false,"merged":[[11,1,11,4],[0,1,0,4],[1,1,1,4],[2,1,2,4],[3,1,3,4],[4,1,4,4],[5,1,5,4],[7,1,7,4],[8,1,8,2],[8,3,8,4],[9,1,9,4],[10,1,10,4]]}
[null,{"$f":"rn_01!$B$1","v":"Class VIIITH Board Examination, 2025"}]
[null,"परीक्षा केंद्र नाम एवं परीक्षा केंद्र क्रमांक"]
[null,{"$f":"rn_01!$B$3","v":"GSSS Malutana (12345)"}]
[null,"परीक्षा कक्ष / हॉल क्रमांक"]
[null,{"$f":"rn_01!$K$4","v":4}]
[null,"परीक्षा दिनांक (दिवस) ... से ... तक"]
[null,{"$f":"rn_01!$B$7","v":"01-03-2025"},{"$f":"IF(B7=\"\",\"\",TEXT(B7,\"DDDD\"))","v":"Saturday"},{"$f":"rn_01!$D$7","v":"22-05-2025"},{"$f":"IF(D7=\"\",\"\",TEXT(D7,\"DDDD\"))","v":"Thursday"}]
[null,"परीक्षार्थी रोल नंबर ... से ... तक"]
[null,{"$f":"IF(B14>0,B15,IF(C14>0,C15,IF(D14>0,D15,IF(E14>0,E15,0))))","v":546},null,{"$f":"IF(E14>0,LOOKUP(2,1/(E15:E34<>\"\"),E15:E34),IF(D14>0,LOOKUP(2,1/(D15:D34<>\"\"),D15:D34),IF(C14>0,LOOKUP(2,1/(C15:C34<>\"\"),C15:C34),IF(B14>0,LOOKUP(2,1/(B15:B34<>\"\"),B15:B34),0))))","v":558}]
[null,"कुल सम्मिलित परीक्षार्थी "]
[null,{"$f":"COUNTIF($B$15:$E$34,\">0\")","v":25}]
[null,"परीक्षार्थी बैठक व्यवस्था"]
[null,"पंक्ति 1","पंक्ति 2","पंक्ति 3","पंक्ति 4"]
[null,{"$f":"rn_01!L4","v":15},{"$f":"rn_01!M4","v":3},{"$f":"rn_01!N4","v":4},{"$f":"rn_01!O4","v":3}]
[null,{"$f":"IF(ROW(B1)-1>=$B$14,\"\",OFFSET(INDIRECT(MID(CELL(\"filename\",roll!$A$15),FIND(\"]\",CELL(\"filename\",roll!$A$15))+1,31)&\"!\"&ADDRESS(MATCH(rn_03!$D$9,roll!C:C,0)+1,3,4)),ROW(B1)-1,0))","v":546},{"$f":"IF(ROW(B1)-1>=$C$14,\"\",OFFSET(INDIRECT(MID(CELL(\"filename\",roll!$A$15),FIND(\"]\",CELL(\"filename\",roll!$A$15))+1,31)&\"!\"&ADDRESS(MATCH(rn_03!$D$9,roll!C:C,0)+1,3,4)),ROW(B1)-1+SUM($B$14:$B$14),0))","v":10054},{"$f":"IF(ROW(B1)-1>=$D$14,\"\",OFFSET(INDIRECT(MID(CELL(\"filename\",roll!$A$15),FIND(\"]\",CELL(\"filename\",roll!$A$15))+1,31)&\"!\"&ADDRESS(MATCH(rn_03!$D$9,roll!C:C,0)+1,3,4)),ROW(B1)-1+SUM($B$14:$C$14),0))","v":555},{"$f":"IF(ROW(B1)-1>=$E$14,\"\",OFFSET(INDIRECT(MID(CELL(\"filename\",roll!$A$15),FIND(\"]\",CELL(\"filename\",roll!$A$15))+1,31)&\"!\"&ADDRESS(MATCH(rn_03!$D$9,roll!C:C,0)+1,3,4)),ROW(B1)-1+SUM($B$14:$D$14),0))","v":557},{"$f":"IF(SUM(B15:E15)>0,1,\"\")","v":1}]
[null,{"$f":"IF(ROW(B2)-1>=$B$14,\"\",OFFSET(INDIRECT(MID(CELL(\"filename\",roll!$A$15),FIND(\"]\",CELL(\"filename\",roll!$A$15))+1,31)&\"!\"&ADDRESS(MATCH(rn_03!$D$9,roll!C:C,0)+1,3,4)),ROW(B2)-1,0))","v":10047},{"$f":"IF(ROW(B2)-1>=$C$14,\"\",OFFSET(INDIRECT(MID(CELL(\"filename\",roll!$A$15),FIND(\"]\",CELL(\"filename\",roll!$A$15))+1,31)&\"!\"&ADDRESS(MATCH(rn_03!$D$9,roll!C:C,0)+1,3,4)),ROW(B2)-1+SUM($B$14:$B$14),0))","v":554},{"$f":"IF(ROW(B2)-1>=$D$14,\"\",OFFSET(INDIRECT(MID(CELL(\"filename\",roll!$A$15),FIND(\"]\",CELL(\"filename\",roll!$A$15))+1,31)&\"!\"&ADDRESS(MATCH(rn_03!$D$9,roll!C:C,0)+1,3,4)),ROW(B2)-1+SUM($B$14:$C$14),0))","v":10056},{"$f":"IF(ROW(B2)-1>=$E$14,\"\",OFFSET(INDIRECT(MID(CELL(\"filename\",roll!$A$15),FIND(\"]\",CELL(\"filename\",roll!$A$15))+1,31)&\"!\"&ADDRESS(MATCH(rn_03!$D$9,roll!C:C,0)+1,3,4)),ROW(B2)-1+SUM($B$14:$D$14),0))","v":10058},{"$f":"IF(SUM(B16:E16)>0,1,\"\")","v":1}]
[null,{"$f":"IF(ROW(B3)-1>=$B$14,\"\",OFFSET(INDIRECT(MID(CELL(\"filename\",roll!$A$15),FIND(\"]\",CELL(\"filename\",roll!$A$15))+1,31)&\"!\"&ADDRESS(MATCH(rn_03!$D$9,roll!C:C,0)+1,3,4)),ROW(B3)-1,0))","v":547},{"$f":"IF(ROW(B3)-1>=$C$14,\"\",OFFSET(INDIRECT(MID(CELL(\"filename\",roll!$A$15),FIND(\"]\",CELL(\"filename\",roll!$A$15))+1,31)&\"!\"&ADDRESS(MATCH(rn_03!$D$9,roll!C:C,0)+1,3,4)),ROW(B3)-1+SUM($B$14:$B$14),0))","v":10055},{"$f":"IF(ROW(B3)-1>=$D$14,\"\",OFFSET(INDIRECT(MID(CELL(\"filename\",roll!$A$15),FIND(\"]\",CELL(\"filename\",roll!$A$15))+1,31)&\"!\"&ADDRESS(MATCH(rn_03!$D$9,roll!C:C,0)+1,3,4)),ROW(B3)-1+SUM($B$14:$C$14),0))","v":556},{"$f":"IF(ROW(B3)-1>=$E$14,\"\",OFFSET(INDIRECT(MID(CELL(\"filename\",roll!$A$15),FIND(\"]\",CELL(\"filename\",roll!$A$15))+1,31)&\"!\"&ADDRESS(MATCH(rn_03!$D$9,roll!C:C,0)+1,3,4)),ROW(B3)-1+SUM($B$14:$D$14),0))","v":558},1]
[null,{"$f":"IF(ROW(B4)-1>=$B$14,\"\",OFFSET(INDIRECT(MID(CELL(\"filename\",roll!$A$15),FIND(\"]\",CELL(\"filename\",roll!$A$15))+1,31)&\"!\"&ADDRESS(MATCH(rn_03!$D$9,roll!C:C,0)+1,3,4)),ROW(B4)-1,0))","v":10048},{"$f":"IF(ROW(B4)-1>=$C$14,\"\",OFFSET(INDIRECT(MID(CELL(\"filename\",roll!$A$15),FIND(\"]\",CELL(\"filename\",roll!$A$15))+1,31)&\"!\"&ADDRESS(MATCH(rn_03!$D$9,roll!C:C,0)+1,3,4)),ROW(B4)-1+SUM($B$14:$B$14),0))","v":""},{"$f":"IF(ROW(B4)-1>=$D$14,\"\",OFFSET(INDIRECT(MID(CELL(\"filename\",roll!$A$15),FIND(\"]\",CELL(\"filename\",roll!$A$15))+1,31)&\"!\"&ADDRESS(MATCH(rn_03!$D$9,roll!C:C,0)+1,3,4)),ROW(B4)-1+SUM($B$14:$C$14),0))","v":10057},{"$f":"IF(ROW(B4)-1>=$E$14,\"\",OFFSET(INDIRECT(MID(CELL(\"filename\",roll!$A$15),FIND(\"]\",CELL(\"filename\",roll!$A$15))+1,31)&\"!\"&ADDRESS(MATCH(rn_03!$D$9,roll!C:C,0)+1,3,4)),ROW(B4)-1+SUM($B$14:$D$14),0))","v":""},1]
[null,{"$f":"IF(ROW(B5)-1>=$B$14,\"\",OFFSET(INDIRECT(MID(CELL(\"filename\",roll!$A$15),FIND(\"]\",CELL(\"filename\",roll!$A$15))+1,31)&\"!\"&ADDRESS(MATCH(rn_03!$D$9,roll!C:C,0)+1,3,4)),ROW(B5)-1,0))","v":548},{"$f":"IF(ROW(B5)-1>=$C$14,\"\",OFFSET(INDIRECT(MID(CELL(\"filename\",roll!$A$15),FIND(\"]\",CELL(\"filename\",roll!$A$15))+1,31)&\"!\"&ADDRESS(MATCH(rn_03!$D$9,roll!C:C,0)+1,3,4)),ROW(B5)-1+SUM($B$14:$B$14),0))","v":""},{"$f":"IF(ROW(B5)-1>=$D$14,\"\",OFFSET(INDIRECT(MID(CELL(\"filename\",roll!$A$15),FIND(\"]\",CELL(\"filename\",roll!$A$15))+1,31)&\"!\"&ADDRESS(MATCH(rn_03!$D$9,roll!C:C,0)+1,3,4)),ROW(B5)-1+SUM($B$14:$C$14),0))","v":""},{"$f":"IF(ROW(B5)-1>=$E$14,\"\",OFFSET(INDIRECT(MID(CELL(\"filename\",roll!$A$15),FIND(\"]\",CELL(\"filename\",roll!$A$15))+1,31)&\"!\"&ADDRESS(MATCH(rn_03!$D$9,roll!C:C,0)+1,3,4)),ROW(B5)-1+SUM($B$14:$D$14),0))","v":""},1]
[null,{"$f":"IF(ROW(B6)-1>=$B$14,\"\",OFFSET(INDIRECT(MID(CELL(\"filename\",roll!$A$15),FIND(\"]\",CELL(\"filename\",roll!$A$15))+1,31)&\"!\"&ADDRESS(MATCH(rn_03!$D$9,roll!C:C,0)+1,3,4)),ROW(B6)-1,0))","v":10049},{"$f":"IF(ROW(B6)-1>=$C$14,\"\",OFFSET(INDIRECT(MID(CELL(\"filename\",roll!$A$15),FIND(\"]\",CELL(\"filename\",roll!$A$15))+1,31)&\"!\"&ADDRESS(MATCH(rn_03!$D$9,roll!C:C,0)+1,3,4)),ROW(B6)-1+SUM($B$14:$B$14),0))","v":""},{"$f":"IF(ROW(B6)-1>=$D$14,\"\",OFFSET(INDIRECT(MID(CELL(\"filename\",roll!$A$15),FIND(\"]\",CELL(\"filename\",roll!$A$15))+1,31)&\"!\"&ADDRESS(MATCH(rn_03!$D$9,roll!C:C,0)+1,3,4)),ROW(B6)-1+SUM($B$14:$C$14),0))","v":""},{"$f":"IF(ROW(B6)-1>=$E$14,\"\",OFFSET(INDIRECT(MID(CELL(\"filename\",roll!$A$15),FIND(\"]\",CELL(\"filename\",roll!$A$15))+1,31)&\"!\"&ADDRESS(MATCH(rn_03!$D$9,roll!C:C,0)+1,3,4)),ROW(B6)-1+SUM($B$14:$D$14),0))","v":""},1]
[null,{"$f":"IF(ROW(B7)-1>=$B$14,\"\",OFFSET(INDIRECT(MID(CELL(\"filename\",roll!$A$15),FIND(\"]\",CELL(\"filename\",roll!$A$15))+1,31)&\"!\"&ADDRESS(MATCH(rn_03!$D$9,roll!C:C,0)+1,3,4)),ROW(B7)-1,0))","v":549},{"$f":"IF(ROW(B7)-1>=$C$14,\"\",OFFSET(INDIRECT(MID(CELL(\"filename\",roll!$A$15),FIND(\"]\",CELL(\"filename\",roll!$A$15))+1,31)&\"!\"&ADDRESS(MATCH(rn_03!$D$9,roll!C:C,0)+1,3,4)),ROW(B7)-1+SUM($B$14:$B$14),0))","v":""},{"$f":"IF(ROW(B7)-1>=$D$14,\"\",OFFSET(INDIRECT(MID(CELL(\"filename\",roll!$A$15),FIND(\"]\",CELL(\"filename\",roll!$A$15))+1,31)&\"!\"&ADDRESS(MATCH(rn_03!$D$9,roll!C:C,0)+1,3,4)),ROW(B7)-1+SUM($B$14:$C$14),0))","v":""},{"$f":"IF(ROW(B7)-1>=$E$14,\"\",OFFSET(INDIRECT(MID(CELL(\"filename\",roll!$A$15),FIND(\"]\",CELL(\"filename\",roll!$A$15))+1,31)&\"!\"&ADDRESS(MATCH(rn_03!$D$9,roll!C:C,0)+1,3,4)),ROW(B7)-1+SUM($B$14:$D$14),0))","v":""},1]
[null,{"$f":"IF(ROW(B8)-1>=$B$14,\"\",OFFSET(INDIRECT(MID(CELL(\"filename\",roll!$A$15),FIND(\"]\",CELL(\"filename\",roll!$A$15))+1,31)&\"!\"&ADDRESS(MATCH(rn_03!$D$9,roll!C:C,0)+1,3,4)),ROW(B8)-1,0))","v":10050},{"$f":"IF(ROW(B8)-1>=$C$14,\"\",OFFSET(INDIRECT(MID(CELL(\"filename\",roll!$A$15),FIND(\"]\",CELL(\"filename\",roll!$A$15))+1,31)&\"!\"&ADDRESS(MATCH(rn_03!$D$9,roll!C:C,0)+1,3,4)),ROW(B8)-1+SUM($B$14:$B$14),0))","v":""},{"$f":"IF(ROW(B8)-1>=$D$14,\"\",OFFSET(INDIRECT(MID(CELL(\"filename\",roll!$A$15),FIND(\"]\",CELL(\"filename\",roll!$A$15))+1,31)&\"!\"&ADDRESS(MATCH(rn_03!$D$9,roll!C:C,0)+1,3,4)),ROW(B8)-1+SUM($B$14:$C$14),0))","v":""},{"$f":"IF(ROW(B8)-1>=$E$14,\"\",OFFSET(INDIRECT(MID(CELL(\"filename\",roll!$A$15),FIND(\"]\",CELL(\"filename\",roll!$A$15))+1,31)&\"!\"&ADDRESS(MATCH(rn_03!$D$9,roll!C:C,0)+1,3,4)),ROW(B8)-1+SUM($B$14:$D$14),0))","v":""},1]
[null,{"$f":"IF(ROW(B9)-1>=$B$14,\"\",OFFSET(INDIRECT(MID(CELL(\"filename\",roll!$A$15),FIND(\"]\",CELL(\"filename\",roll!$A$15))+1,31)&\"!\"&ADDRESS(MATCH(rn_03!$D$9,roll!C:C,0)+1,3,4)),ROW(B9)-1,0))","v":550},{"$f":"IF(ROW(B9)-1>=$C$14,\"\",OFFSET(INDIRECT(MID(CELL(\"filename\",roll!$A$15),FIND(\"]\",CELL(\"filename\",roll!$A$15))+1,31)&\"!\"&ADDRESS(MATCH(rn_03!$D$9,roll!C:C,0)+1,3,4)),ROW(B9)-1+SUM($B$14:$B$14),0))","v":""},{"$f":"IF(ROW(B9)-1>=$D$14,\"\",OFFSET(INDIRECT(MID(CELL(\"filename\",roll!$A$15),FIND(\"]\",CELL(\"filename\",roll!$A$15))+1,31)&\"!\"&ADDRESS(MATCH(rn_03!$D$9,roll!C:C,0)+1,3,4)),ROW(B9)-1+SUM($B$14:$C$14),0))","v":""},{"$f":"IF(ROW(B9)-1>=$E$14,\"\",OFFSET(INDIRECT(MID(CELL(\"filename\",roll!$A$15),FIND(\"]\",CELL(\"filename\",roll!$A$15))+1,31)&\"!\"&ADDRESS(MATCH(rn_03!$D$9,roll!C:C,0)+1,3,4)),ROW(B9)-1+SUM($B$14:$D$14),0))","v":""},1]
[null,{"$f":"IF(ROW(B10)-1>=$B$14,\"\",OFFSET(INDIRECT(MID(CELL(\"filename\",roll!$A$15),FIND(\"]\",CELL(\"filename\",roll!$A$15))+1,31)&\"!\"&ADDRESS(MATCH(rn_03!$D$9,roll!C:C,0)+1,3,4)),ROW(B10)-1,0))","v":10051},{"$f":"IF(ROW(B10)-1>=$C$14,\"\",OFFSET(INDIRECT(MID(CELL(\"filename\",roll!$A$15),FIND(\"]\",CELL(\"filename\",roll!$A$15))+1,31)&\"!\"&ADDRESS(MATCH(rn_03!$D$9,roll!C:C,0)+1,3,4)),ROW(B10)-1+SUM($B$14:$B$14),0))","v":""},{"$f":"IF(ROW(B10)-1>=$D$14,\"\",OFFSET(INDIRECT(MID(CELL(\"filename\",roll!$A$15),FIND(\"]\",CELL(\"filename\",roll!$A$15))+1,31)&\"!\"&ADDRESS(MATCH(rn_03!$D$9,roll!C:C,0)+1,3,4)),ROW(B10)-1+SUM($B$14:$C$14),0))","v":""},{"$f":"IF(ROW(B10)-1>=$E$14,\"\",OFFSET(INDIRECT(MID(CELL(\"filename\",roll!$A$15),FIND(\"]\",CELL(\"filename\",roll!$A$15))+1,31)&\"!\"&ADDRESS(MATCH(rn_03!$D$9,roll!C:C,0)+1,3,4)),ROW(B10)-1+SUM($B$14:$D$14),0))","v":""},1]
[null,{"$f":"IF(ROW(B11)-1>=$B$14,\"\",OFFSET(INDIRECT(MID(CELL(\"filename\",roll!$A$15),FIND(\"]\",CELL(\"filename\",roll!$A$15))+1,31)&\"!\"&ADDRESS(MATCH(rn_03!$D$9,roll!C:C,0)+1,3,4)),ROW(B11)-1,0))","v":551},{"$f":"IF(ROW(B11)-1>=$C$14,\"\",OFFSET(INDIRECT(MID(CELL(\"filename\",roll!$A$15),FIND(\"]\",CELL(\"filename\",roll!$A$15))+1,31)&\"!\"&ADDRESS(MATCH(rn_03!$D$9,roll!C:C,0)+1,3,4)),ROW(B11)-1+SUM($B$14:$B$14),0))","v":""},{"$f":"IF(ROW(B11)-1>=$D$14,\"\",OFFSET(INDIRECT(MID(CELL(\"filename\",roll!$A$15),FIND(\"]\",CELL(\"filename\",roll!$A$15))+1,31)&\"!\"&ADDRESS(MATCH(rn_03!$D$9,roll!C:C,0)+1,3,4)),ROW(B11)-1+SUM($B$14:$C$14),0))","v":""},{"$f":"IF(ROW(B11)-1>=$E$14,\"\",OFFSET(INDIRECT(MID(CELL(\"filename\",roll!$A$15),FIND(\"]\",CELL(\"filename\",roll!$A$15))+1,31)&\"!\"&ADDRESS(MATCH(rn_03!$D$9,roll!C:C,0)+1,3,4)),ROW(B11)-1+SUM($B$14:$D$14),0))","v":""},1]
[null,{"$f":"IF(ROW(B12)-1>=$B$14,\"\",OFFSET(INDIRECT(MID(CELL(\"filename\",roll!$A$15),FIND(\"]\",CELL(\"filename\",roll!$A$15))+1,31)&\"!\"&ADDRESS(MATCH(rn_03!$D$9,roll!C:C,0)+1,3,4)),ROW(B12)-1,0))","v":10052},{"$f":"IF(ROW(B12)-1>=$C$14,\"\",OFFSET(INDIRECT(MID(CELL(\"filename\",roll!$A$15),FIND(\"]\",CELL(\"filename\",roll!$A$15))+1,31)&\"!\"&ADDRESS(MATCH(rn_03!$D$9,roll!C:C,0)+1,3,4)),ROW(B12)-1+SUM($B$14:$B$14),0))","v":""},{"$f":"IF(ROW(B12)-1>=$D$14,\"\",OFFSET(INDIRECT(MID(CELL(\"filename\",roll!$A$15),FIND(\"]\",CELL(\"filename\",roll!$A$15))+1,31)&\"!\"&ADDRESS(MATCH(rn_03!$D$9,roll!C:C,0)+1,3,4)),ROW(B12)-1+SUM($B$14:$C$14),0))","v":""},{"$f":"IF(ROW(B12)-1>=$E$14,\"\",OFFSET(INDIRECT(MID(CELL(\"filename\",roll!$A$15),FIND(\"]\",CELL(\"filename\",roll!$A$15))+1,31)&\"!\"&ADDRESS(MATCH(rn_03!$D$9,roll!C:C,0)+1,3,4)),ROW(B12)-1+SUM($B$14:$D$14),0))","v":""},1]
[null,{"$f":"IF(ROW(B13)-1>=$B$14,\"\",OFFSET(INDIRECT(MID(CELL(\"filename\",roll!$A$15),FIND(\"]\",CELL(\"filename\",roll!$A$15))+1,31)&\"!\"&ADDRESS(MATCH(rn_03!$D$9,roll!C:C,0)+1,3,4)),ROW(B13)-1,0))","v":552},{"$f":"IF(ROW(B13)-1>=$C$14,\"\",OFFSET(INDIRECT(MID(CELL(\"filename\",roll!$A$15),FIND(\"]\",CELL(\"filename\",roll!$A$15))+1,31)&\"!\"&ADDRESS(MATCH(rn_03!$D$9,roll!C:C,0)+1,3,4)),ROW(B13)-1+SUM($B$14:$B$14),0))","v":""},{"$f":"IF(ROW(B13)-1>=$D$14,\"\",OFFSET(INDIRECT(MID(CELL(\"filename\",roll!$A$15),FIND(\"]\",CELL(\"filename\",roll!$A$15))+1,31)&\"!\"&ADDRESS(MATCH(rn_03!$D$9,roll!C:C,0)+1,3,4)),ROW(B13)-1+SUM($B$14:$C$14),0))","v":""},{"$f":"IF(ROW(B13)-1>=$E$14,\"\",OFFSET(INDIRECT(MID(CELL(\"filename\",roll!$A$15),FIND(\"]\",CELL(\"filename\",roll!$A$15))+1,31)&\"!\"&ADDRESS(MATCH(rn_03!$D$9,roll!C:C,0)+1,3,4)),ROW(B13)-1+SUM($B$14:$D$14),0))","v":""},1]
[null,{"$f":"IF(ROW(B14)-1>=$B$14,\"\",OFFSET(INDIRECT(MID(CELL(\"filename\",roll!$A$15),FIND(\"]\",CELL(\"filename\",roll!$A$15))+1,31)&\"!\"&ADDRESS(MATCH(rn_03!$D$9,roll!C:C,0)+1,3,4)),ROW(B14)-1,0))","v":10053},{"$f":"IF(ROW(B14)-1>=$C$14,\"\",OFFSET(INDIRECT(MID(CELL(\"filename\",roll!$A$15),FIND(\"]\",CELL(\"filename\",roll!$A$15))+1,31)&\"!\"&ADDRESS(MATCH(rn_03!$D$9,roll!C:C,0)+1,3,4)),ROW(B14)-1+SUM($B$14:$B$14),0))","v":""},{"$f":"IF(ROW(B14)-1>=$D$14,\"\",OFFSET(INDIRECT(MID(CELL(\"filename\",roll!$A$15),FIND(\"]\",CELL(\"filename\",roll!$A$15))+1,31)&\"!\"&ADDRESS(MATCH(rn_03!$D$9,roll!C:C,0)+1,3,4)),ROW(B14)-1+SUM($B$14:$C$14),0))","v":""},{"$f":"IF(ROW(B14)-1>=$E$14,\"\",OFFSET(INDIRECT(MID(CELL(\"filename\",roll!$A$15),FIND(\"]\",CELL(\"filename\",roll!$A$15))+1,31)&\"!\"&ADDRESS(MATCH(rn_03!$D$9,roll!C:C,0)+1,3,4)),ROW(B14)-1+SUM($B$14:$D$14),0))","v":""},1]
[null,{"$f":"IF(ROW(B15)-1>=$B$14,\"\",OFFSET(INDIRECT(MID(CELL(\"filename\",roll!$A$15),FIND(\"]\",CELL(\"filename\",roll!$A$15))+1,31)&\"!\"&ADDRESS(MATCH(rn_03!$D$9,roll!C:C,0)+1,3,4)),ROW(B15)-1,0))","v":553},{"$f":"IF(ROW(B15)-1>=$C$14,\"\",OFFSET(INDIRECT(MID(CELL(\"filename\",roll!$A$15),FIND(\"]\",CELL(\"filename\",roll!$A$15))+1,31)&\"!\"&ADDRESS(MATCH(rn_03!$D$9,roll!C:C,0)+1,3,4)),ROW(B15)-1+SUM($B$14:$B$14),0))","v":""},{"$f":"IF(ROW(B15)-1>=$D$14,\"\",OFFSET(INDIRECT(MID(CELL(\"filename\",roll!$A$15),FIND(\"]\",CELL(\"filename\",roll!$A$15))+1,31)&\"!\"&ADDRESS(MATCH(rn_03!$D$9,roll!C:C,0)+1,3,4)),ROW(B15)-1+SUM($B$14:$C$14),0))","v":""},{"$f":"IF(ROW(B15)-1>=$E$14,\"\",OFFSET(INDIRECT(MID(CELL(\"filename\",roll!$A$15),FIND(\"]\",CELL(\"filename\",roll!$A$15))+1,31)&\"!\"&ADDRESS(MATCH(rn_03!$D$9,roll!C:C,0)+1,3,4)),ROW(B15)-1+SUM($B$14:$D$14),0))","v":""},1]
[null,{"$f":"IF(ROW(B16)-1>=$B$14,\"\",OFFSET(INDIRECT(MID(CELL(\"filename\",roll!$A$15),FIND(\"]\",CELL(\"filename\",roll!$A$15))+1,31)&\"!\"&ADDRESS(MATCH(rn_03!$D$9,roll!C:C,0)+1,3,4)),ROW(B16)-1,0))","v":""},{"$f":"IF(ROW(B16)-1>=$C$14,\"\",OFFSET(INDIRECT(MID(CELL(\"filename\",roll!$A$15),FIND(\"]\",CELL(\"filename\",roll!$A$15))+1,31)&\"!\"&ADDRESS(MATCH(rn_03!$D$9,roll!C:C,0)+1,3,4)),ROW(B16)-1+SUM($B$14:$B$14),0))","v":""},{"$f":"IF(ROW(B16)-1>=$D$14,\"\",OFFSET(INDIRECT(MID(CELL(\"filename\",roll!$A$15),FIND(\"]\",CELL(\"filename\",roll!$A$15))+1,31)&\"!\"&ADDRESS(MATCH(rn_03!$D$9,roll!C:C,0)+1,3,4)),ROW(B16)-1+SUM($B$14:$C$14),0))","v":""},{"$f":"IF(ROW(B16)-1>=$E$14,\"\",OFFSET(INDIRECT(MID(CELL(\"filename\",roll!$A$15),FIND(\"]\",CELL(\"filename\",roll!$A$15))+1,31)&\"!\"&ADDRESS(MATCH(rn_03!$D$9,roll!C:C,0)+1,3,4)),ROW(B16)-1+SUM($B$14:$D$14),0))","v":""},""]
[null,{"$f":"IF(ROW(B17)-1>=$B$14,\"\",OFFSET(INDIRECT(MID(CELL(\"filename\",roll!$A$15),FIND(\"]\",CELL(\"filename\",roll!$A$15))+1,31)&\"!\"&ADDRESS(MATCH(rn_03!$D$9,roll!C:C,0)+1,3,4)),ROW(B17)-1,0))","v":""},{"$f":"IF(ROW(B17)-1>=$C$14,\"\",OFFSET(INDIRECT(MID(CELL(\"filename\",roll!$A$15),FIND(\"]\",CELL(\"filename\",roll!$A$15))+1,31)&\"!\"&ADDRESS(MATCH(rn_03!$D$9,roll!C:C,0)+1,3,4)),ROW(B17)-1+SUM($B$14:$B$14),0))","v":""},{"$f":"IF(ROW(B17)-1>=$D$14,\"\",OFFSET(INDIRECT(MID(CELL(\"filename\",roll!$A$15),FIND(\"]\",CELL(\"filename\",roll!$A$15))+1,31)&\"!\"&ADDRESS(MATCH(rn_03!$D$9,roll!C:C,0)+1,3,4)),ROW(B17)-1+SUM($B$14:$C$14),0))","v":""},{"$f":"IF(ROW(B17)-1>=$E$14,\"\",OFFSET(INDIRECT(MID(CELL(\"filename\",roll!$A$15),FIND(\"]\",CELL(\"filename\",roll!$A$15))+1,31)&\"!\"&ADDRESS(MATCH(rn_03!$D$9,roll!C:C,0)+1,3,4)),ROW(B17)-1+SUM($B$14:$D$14),0))","v":""},""]
[null,{"$f":"IF(ROW(B18)-1>=$B$14,\"\",OFFSET(INDIRECT(MID(CELL(\"filename\",roll!$A$15),FIND(\"]\",CELL(\"filename\",roll!$A$15))+1,31)&\"!\"&ADDRESS(MATCH(rn_03!$D$9,roll!C:C,0)+1,3,4)),ROW(B18)-1,0))","v":""},{"$f":"IF(ROW(B18)-1>=$C$14,\"\",OFFSET(INDIRECT(MID(CELL(\"filename\",roll!$A$15),FIND(\"]\",CELL(\"filename\",roll!$A$15))+1,31)&\"!\"&ADDRESS(MATCH(rn_03!$D$9,roll!C:C,0)+1,3,4)),ROW(B18)-1+SUM($B$14:$B$14),0))","v":""},{"$f":"IF(ROW(B18)-1>=$D$14,\"\",OFFSET(INDIRECT(MID(CELL(\"filename\",roll!$A$15),FIND(\"]\",CELL(\"filename\",roll!$A$15))+1,31)&\"!\"&ADDRESS(MATCH(rn_03!$D$9,roll!C:C,0)+1,3,4)),ROW(B18)-1+SUM($B$14:$C$14),0))","v":""},{"$f":"IF(ROW(B18)-1>=$E$14,\"\",OFFSET(INDIRECT(MID(CELL(\"filename\",roll!$A$15),FIND(\"]\",CELL(\"filename\",roll!$A$15))+1,31)&\"!\"&ADDRESS(MATCH(rn_03!$D$9,roll!C:C,0)+1,3,4)),ROW(B18)-1+SUM($B$14:$D$14),0))","v":""},""]
[null,{"$f":"IF(ROW(B19)-1>=$B$14,\"\",OFFSET(INDIRECT(MID(CELL(\"filename\",roll!$A$15),FIND(\"]\",CELL(\"filename\",roll!$A$15))+1,31)&\"!\"&ADDRESS(MATCH(rn_03!$D$9,roll!C:C,0)+1,3,4)),ROW(B19)-1,0))","v":""},{"$f":"IF(ROW(B19)-1>=$C$14,\"\",OFFSET(INDIRECT(MID(CELL(\"filename\",roll!$A$15),FIND(\"]\",CELL(\"filename\",roll!$A$15))+1,31)&\"!\"&ADDRESS(MATCH(rn_03!$D$9,roll!C:C,0)+1,3,4)),ROW(B19)-1+SUM($B$14:$B$14),0))","v":""},{"$f":"IF(ROW(B19)-1>=$D$14,\"\",OFFSET(INDIRECT(MID(CELL(\"filename\",roll!$A$15),FIND(\"]\",CELL(\"filename\",roll!$A$15))+1,31)&\"!\"&ADDRESS(MATCH(rn_03!$D$9,roll!C:C,0)+1,3,4)),ROW(B19)-1+SUM($B$14:$C$14),0))","v":""},{"$f":"IF(ROW(B19)-1>=$E$14,\"\",OFFSET(INDIRECT(MID(CELL(\"filename\",roll!$A$15),FIND(\"]\",CELL(\"filename\",roll!$A$15))+1,31)&\"!\"&ADDRESS(MATCH(rn_03!$D$9,roll!C:C,0)+1,3,4)),ROW(B19)-1+SUM($B$14:$D$14),0))","v":""},""]
[null,{"$f":"IF(ROW(B20)-1>=$B$14,\"\",OFFSET(INDIRECT(MID(CELL(\"filename\",roll!$A$15),FIND(\"]\",CELL(\"filename\",roll!$A$15))+1,31)&\"!\"&ADDRESS(MATCH(rn_03!$D$9,roll!C:C,0)+1,3,4)),ROW(B20)-1,0))","v":""},{"$f":"IF(ROW(B20)-1>=$C$14,\"\",OFFSET(INDIRECT(MID(CELL(\"filename\",roll!$A$15),FIND(\"]\",CELL(\"filename\",roll!$A$15))+1,31)&\"!\"&ADDRESS(MATCH(rn_03!$D$9,roll!C:C,0)+1,3,4)),ROW(B20)-1+SUM($B$14:$B$14),0))","v":""},{"$f":"IF(ROW(B20)-1>=$D$14,\"\",OFFSET(INDIRECT(MID(CELL(\"filename\",roll!$A$15),FIND(\"]\",CELL(\"filename\",roll!$A$15))+1,31)&\"!\"&ADDRESS(MATCH(rn_03!$D$9,roll!C:C,0)+1,3,4)),ROW(B20)-1+SUM($B$14:$C$14),0))","v":""},{"$f":"IF(ROW(B20)-1>=$E$14,\"\",OFFSET(INDIRECT(MID(CELL(\"filename\",roll!$A$15),FIND(\"]\",CELL(\"filename\",roll!$A$15))+1,31)&\"!\"&ADDRESS(MATCH(rn_03!$D$9,roll!C:C,0)+1,3,4)),ROW(B20)-1+SUM($B$14:$D$14),0))","v":""},""]
[]
[null,"परीक्षा प्रभारी",null,null,"केन्द्राधीक्षक "]
[null,{"$f":"rn_01!$B$37","v":"ASD (Lecturer)"},null,null,{"$f":"rn_01!$E$37","v":"XYZ (Principal)"}]

{"sheet":"rn_05","index":5,"n_rows":37,"n_cols":6,"rows_kept":37,"cut":false,"hidden":false,"merged":[[11,1,11,4],[0,1,0,4],[1,1,1,4],[2,1,2,4],[3,1,3,4],[4,1,4,4],[5,1,5,4],[7,1,7,4],[8,1,8,2],[8,3,8,4],[9,1,9,4],[10,1,10,4]]}
[null,{"$f":"rn_01!$B$1","v":"Class VIIITH Board Examination, 2025"}]
[null,"परीक्षा केंद्र नाम एवं परीक्षा केंद्र क्रमांक"]
[null,{"$f":"rn_01!$B$3","v":"GSSS Malutana (12345)"}]
[null,"परीक्षा कक्ष / हॉल क्रमांक"]
[null,{"$f":"rn_01!$K$5","v":5}]
[null,"परीक्षा दिनांक (दिवस) ... से ... तक"]
[null,{"$f":"rn_01!$B$7","v":"01-03-2025"},{"$f":"IF(B7=\"\",\"\",TEXT(B7,\"DDDD\"))","v":"Saturday"},{"$f":"rn_01!$D$7","v":"22-05-2025"},{"$f":"IF(D7=\"\",\"\",TEXT(D7,\"DDDD\"))","v":"Thursday"}]
[null,"परीक्षार्थी रोल नंबर ... से ... तक"]
[null,{"$f":"IF(B14>0,B15,IF(C14>0,C15,IF(D14>0,D15,IF(E14>0,E15,0))))","v":10059},null,{"$f":"IF(E14>0,LOOKUP(2,1/(E15:E34<>\"\"),E15:E34),IF(D14>0,LOOKUP(2,1/(D15:D34<>\"\"),D15:D34),IF(C14>0,LOOKUP(2,1/(C15:C34<>\"\"),C15:C34),IF(B14>0,LOOKUP(2,1/(B15:B34<>\"\"),B15:B34),0))))","v":576}]
[null,"कुल सम्मिलित परीक्षार्थी "]
[null,{"$f":"COUNTIF($B$15:$E$34,\">0\")","v":36}]
[null,"परीक्षार्थी बैठक व्यवस्था"]
[null,"पंक्ति 1","पंक्ति 2","पंक्ति 3","पंक्ति 4"]
[null,{"$f":"rn_01!L5","v":17},{"$f":"rn_01!M5","v":5},{"$f":"rn_01!N5","v":5},{"$f":"rn_01!O5","v":9}]
[null,{"$f":"IF(ROW(B1)-1>=$B$14,\"\",OFFSET(INDIRECT(MID(CELL(\"filename\",roll!$A$15),FIND(\"]\",CELL(\"filename\",roll!$A$15))+1,31)&\"!\"&ADDRESS(MATCH(rn_04!$D$9,roll!C:C,0)+1,3,4)),ROW(B1)-1,0))","v":10059},{"$f":"IF(ROW(B1)-1>=$C$14,\"\",OFFSET(INDIRECT(MID(CELL(\"filename\",roll!$A$15),FIND(\"]\",CELL(\"filename\",roll!$A$15))+1,31)&\"!\"&ADDRESS(MATCH(rn_04!$D$9,roll!C:C,0)+1,3,4)),ROW(B1)-1+SUM($B$14:$B$14),0))","v":567},{"$f":"IF(ROW(B1)-1>=$D$14,\"\",OFFSET(INDIRECT(MID(CELL(\"filename\",roll!$A$15),FIND(\"]\",CELL(\"filename\",roll!$A$15))+1,31)&\"!\"&ADDRESS(MATCH(rn_04!$D$9,roll!C:C,0)+1,3,4)),ROW(B1)-1+SUM($B$14:$C$14),0))","v":10070},{"$f":"IF(ROW(B1)-1>=$E$14,\"\",OFFSET(INDIRECT(MID(CELL(\"filename\",roll!$A$15),FIND(\"]\",CELL(\"filename\",roll!$A$15))+1,31)&\"!\"&ADDRESS(MATCH(rn_04!$D$9,roll!C:C,0)+1,3,4)),ROW(B1)-1+SUM($B$14:$D$14),0))","v":572},{"$f":"IF(SUM(B15:E15)>0,1,\"\")","v":1}]
[null,{"$f":"IF(ROW(B2)-1>=$B$14,\"\",OFFSET(INDIRECT(MID(CELL(\"filename\",roll!$A$15),FIND(\"]\",CELL(\"filename\",roll!$A$15))+1,31)&\"!\"&ADDRESS(MATCH(rn_04!$D$9,roll!C:C,0)+1,3,4)),ROW(B2)-1,0))","v":559},{"$f":"IF(ROW(B2)-1>=$C$14,\"\",OFFSET(INDIRECT(MID(CELL(\"filename\",roll!$A$15),FIND(\"]\",CELL(\"filename\",roll!$A$15))+1,31)&\"!\"&ADDRESS(MATCH(rn_04!$D$9,roll!C:C,0)+1,3,4)),ROW(B2)-1+SUM($B$14:$B$14),0))","v":10068},{"$f":"IF(ROW(B2)-1>=$D$14,\"\",OFFSET(INDIRECT(MID(CELL(\"filename\",roll!$A$15),FIND(\"]\",CELL(\"filename\",roll!$A$15))+1,31)&\"!\"&ADDRESS(MATCH(rn_04!$D$9,roll!C:C,0)+1,3,4)),ROW(B2)-1+SUM($B$14:$C$14),0))","v":570},{"$f":"IF(ROW(B2)-1>=$E$14,\"\",OFFSET(INDIRECT(MID(CELL(\"filename\",roll!$A$15),FIND(\"]\",CELL(\"filename\",roll!$A$15))+1,31)&\"!\"&ADDRESS(MATCH(rn_04!$D$9,roll!C:C,0)+1,3,4)),ROW(B2)-1+SUM($B$14:$D$14),0))","v":10073},{"$f":"IF(SUM(B16:E16)>0,1,\"\")","v":1}]
[null,{"$f":"IF(ROW(B3)-1>=$B$14,\"\",OFFSET(INDIRECT(MID(CELL(\"filename\",roll!$A$15),FIND(\"]\",CELL(\"filename\",roll!$A$15))+1,31)&\"!\"&ADDRESS(MATCH(rn_04!$D$9,roll!C:C,0)+1,3,4)),ROW(B3)-1,0))","v":10060},{"$f":"IF(ROW(B3)-1>=$C$14,\"\",OFFSET(INDIRECT(MID(CELL(\"filename\",roll!$A$15),FIND(\"]\",CELL(\"filename\",roll!$A$15))+1,31)&\"!\"&ADDRESS(MATCH(rn_04!$D$9,roll!C:C,0)+1,3,4)),ROW(B3)-1+SUM($B$14:$B$14),0))","v":568},{"$f":"IF(ROW(B3)-1>=$D$14,\"\",OFFSET(INDIRECT(MID(CELL(\"filename\",roll!$A$15),FIND(\"]\",CELL(\"filename\",roll!$A$15))+1,31)&\"!\"&ADDRESS(MATCH(rn_04!$D$9,roll!C:C,0)+1,3,4)),ROW(B3)-1+SUM($B$14:$C$14),0))","v":10071},{"$f":"IF(ROW(B3)-1>=$E$14,\"\",OFFSET(INDIRECT(MID(CELL(\"filename\",roll!$A$15),FIND(\"]\",CELL(\"filename\",roll!$A$15))+1,31)&\"!\"&ADDRESS(MATCH(rn_04!$D$9,roll!C:C,0)+1,3,4)),ROW(B3)-1+SUM($B$14:$D$14),0))","v":573},1]
[null,{"$f":"IF(ROW(B4)-1>=$B$14,\"\",OFFSET(INDIRECT(MID(CELL(\"filename\",roll!$A$15),FIND(\"]\",CELL(\"filename\",roll!$A$15))+1,31)&\"!\"&ADDRESS(MATCH(rn_04!$D$9,roll!C:C,0)+1,3,4)),ROW(B4)-1,0))","v":560},{"$f":"IF(ROW(B4)-1>=$C$14,\"\",OFFSET(INDIRECT(MID(CELL(\"filename\",roll!$A$15),FIND(\"]\",CELL(\"filename\",roll!$A$15))+1,31)&\"!\"&ADDRESS(MATCH(rn_04!$D$9,roll!C:C,0)+1,3,4)),ROW(B4)-1+SUM($B$14:$B$14),0))","v":10069},{"$f":"IF(ROW(B4)-1>=$D$14,\"\",OFFSET(INDIRECT(MID(CELL(\"filename\",roll!$A$15),FIND(\"]\",CELL(\"filename\",roll!$A$15))+1,31)&\"!\"&ADDRESS(MATCH(rn_04!$D$9,roll!C:C,0)+1,3,4)),ROW(B4)-1+SUM($B$14:$C$14),0))","v":571},{"$f":"IF(ROW(B4)-1>=$E$14,\"\",OFFSET(INDIRECT(MID(CELL(\"filename\",roll!$A$15),FIND(\"]\",CELL(\"filename\",roll!$A$15))+1,31)&\"!\"&ADDRESS(MATCH(rn_04!$D$9,roll!C:C,0)+1,3,4)),ROW(B4)-1+SUM($B$14:$D$14),0))","v":10074},1]
[null,{"$f":"IF(ROW(B5)-1>=$B$14,\"\",OFFSET(INDIRECT(MID(CELL(\"filename\",roll!$A$15),FIND(\"]\",CELL(\"filename\",roll!$A$15))+1,31)&\"!\"&ADDRESS(MATCH(rn_04!$D$9,roll!C:C,0)+1,3,4)),ROW(B5)-1,0))","v":10061},{"$f":"IF(ROW(B5)-1>=$C$14,\"\",OFFSET(INDIRECT(MID(CELL(\"filename\",roll!$A$15),FIND(\"]\",CELL(\"filename\",roll!$A$15))+1,31)&\"!\"&ADDRESS(MATCH(rn_04!$D$9,roll!C:C,0)+1,3,4)),ROW(B5)-1+SUM($B$14:$B$14),0))","v":569},{"$f":"IF(ROW(B5)-1>=$D$14,\"\",OFFSET(INDIRECT(MID(CELL(\"filename\",roll!$A$15),FIND(\"]\",CELL(\"filename\",roll!$A$15))+1,31)&\"!\"&ADDRESS(MATCH(rn_04!$D$9,roll!C:C,0)+1,3,4)),ROW(B5)-1+SUM($B$14:$C$14),0))","v":10072},{"$f":"IF(ROW(B5)-1>=$E$14,\"\",OFFSET(INDIRECT(MID(CELL(\"filename\",roll!$A$15),FIND(\"]\",CELL(\"filename\",roll!$A$15))+1,31)&\"!\"&ADDRESS(MATCH(rn_04!$D$9,roll!C:C,0)+1,3,4)),ROW(B5)-1+SUM($B$14:$D$14),0))","v":574},1]
[null,{"$f":"IF(ROW(B6)-1>=$B$14,\"\",OFFSET(INDIRECT(MID(CELL(\"filename\",roll!$A$15),FIND(\"]\",CELL(\"filename\",roll!$A$15))+1,31)&\"!\"&ADDRESS(MATCH(rn_04!$D$9,roll!C:C,0)+1,3,4)),ROW(B6)-1,0))","v":561},{"$f":"IF(ROW(B6)-1>=$C$14,\"\",OFFSET(INDIRECT(MID(CELL(\"filename\",roll!$A$15),FIND(\"]\",CELL(\"filename\",roll!$A$15))+1,31)&\"!\"&ADDRESS(MATCH(rn_04!$D$9,roll!C:C,0)+1,3,4)),ROW(B6)-1+SUM($B$14:$B$14),0))","v":""},{"$f":"IF(ROW(B6)-1>=$D$14,\"\",OFFSET(INDIRECT(MID(CELL(\"filename\",roll!$A$15),FIND(\"]\",CELL(\"filename\",roll!$A$15))+1,31)&\"!\"&ADDRESS(MATCH(rn_04!$D$9,roll!C:C,0)+1,3,4)),ROW(B6)-1+SUM($B$14:$C$14),0))","v":""},{"$f":"IF(ROW(B6)-1>=$E$14,\"\",OFFSET(INDIRECT(MID(CELL(\"filename\",roll!$A$15),FIND(\"]\",CELL(\"filename\",roll!$A$15))+1,31)&\"!\"&ADDRESS(MATCH(rn_04!$D$9,roll!C:C,0)+1,3,4)),ROW(B6)-1+SUM($B$14:$D$14),0))","v":10075},1]
[null,{"$f":"IF(ROW(B7)-1>=$B$14,\"\",OFFSET(INDIRECT(MID(CELL(\"filename\",roll!$A$15),FIND(\"]\",CELL(\"filename\",roll!$A$15))+1,31)&\"!\"&ADDRESS(MATCH(rn_04!$D$9,roll!C:C,0)+1,3,4)),ROW(B7)-1,0))","v":10062},{"$f":"IF(ROW(B7)-1>=$C$14,\"\",OFFSET(INDIRECT(MID(CELL(\"filename\",roll!$A$15),FIND(\"]\",CELL(\"filename\",roll!$A$15))+1,31)&\"!\"&ADDRESS(MATCH(rn_04!$D$9,roll!C:C,0)+1,3,4)),ROW(B7)-1+SUM($B$14:$B$14),0))","v":""},{"$f":"IF(ROW(B7)-1>=$D$14,\"\",OFFSET(INDIRECT(MID(CELL(\"filename\",roll!$A$15),FIND(\"]\",CELL(\"filename\",roll!$A$15))+1,31)&\"!\"&ADDRESS(MATCH(rn_04!$D$9,roll!C:C,0)+1,3,4)),ROW(B7)-1+SUM($B$14:$C$14),0))","v":""},{"$f":"IF(ROW(B7)-1>=$E$14,\"\",OFFSET(INDIRECT(MID(CELL(\"filename\",roll!$A$15),FIND(\"]\",CELL(\"filename\",roll!$A$15))+1,31)&\"!\"&ADDRESS(MATCH(rn_04!$D$9,roll!C:C,0)+1,3,4)),ROW(B7)-1+SUM($B$14:$D$14),0))","v":575},1]
[null,{"$f":"IF(ROW(B8)-1>=$B$14,\"\",OFFSET(INDIRECT(MID(CELL(\"filename\",roll!$A$15),FIND(\"]\",CELL(\"filename\",roll!$A$15))+1,31)&\"!\"&ADDRESS(MATCH(rn_04!$D$9,roll!C:C,0)+1,3,4)),ROW(B8)-1,0))","v":562},{"$f":"IF(ROW(B8)-1>=$C$14,\"\",OFFSET(INDIRECT(MID(CELL(\"filename\",roll!$A$15),FIND(\"]\",CELL(\"filename\",roll!$A$15))+1,31)&\"!\"&ADDRESS(MATCH(rn_04!$D$9,roll!C:C,0)+1,3,4)),ROW(B8)-1+SUM($B$14:$B$14),0))","v":""},{"$f":"IF(ROW(B8)-1>=$D$14,\"\",OFFSET(INDIRECT(MID(CELL(\"filename\",roll!$A$15),FIND(\"]\",CELL(\"filename\",roll!$A$15))+1,31)&\"!\"&ADDRESS(MATCH(rn_04!$D$9,roll!C:C,0)+1,3,4)),ROW(B8)-1+SUM($B$14:$C$14),0))","v":""},{"$f":"IF(ROW(B8)-1>=$E$14,\"\",OFFSET(INDIRECT(MID(CELL(\"filename\",roll!$A$15),FIND(\"]\",CELL(\"filename\",roll!$A$15))+1,31)&\"!\"&ADDRESS(MATCH(rn_04!$D$9,roll!C:C,0)+1,3,4)),ROW(B8)-1+SUM($B$14:$D$14),0))","v":10076},1]
[null,{"$f":"IF(ROW(B9)-1>=$B$14,\"\",OFFSET(INDIRECT(MID(CELL(\"filename\",roll!$A$15),FIND(\"]\",CELL(\"filename\",roll!$A$15))+1,31)&\"!\"&ADDRESS(MATCH(rn_04!$D$9,roll!C:C,0)+1,3,4)),ROW(B9)-1,0))","v":10063},{"$f":"IF(ROW(B9)-1>=$C$14,\"\",OFFSET(INDIRECT(MID(CELL(\"filename\",roll!$A$15),FIND(\"]\",CELL(\"filename\",roll!$A$15))+1,31)&\"!\"&ADDRESS(MATCH(rn_04!$D$9,roll!C:C,0)+1,3,4)),ROW(B9)-1+SUM($B$14:$B$14),0))","v":""},{"$f":"IF(ROW(B9)-1>=$D$14,\"\",OFFSET(INDIRECT(MID(CELL(\"filename\",roll!$A$15),FIND(\"]\",CELL(\"filename\",roll!$A$15))+1,31)&\"!\"&ADDRESS(MATCH(rn_04!$D$9,roll!C:C,0)+1,3,4)),ROW(B9)-1+SUM($B$14:$C$14),0))","v":""},{"$f":"IF(ROW(B9)-1>=$E$14,\"\",OFFSET(INDIRECT(MID(CELL(\"filename\",roll!$A$15),FIND(\"]\",CELL(\"filename\",roll!$A$15))+1,31)&\"!\"&ADDRESS(MATCH(rn_04!$D$9,roll!C:C,0)+1,3,4)),ROW(B9)-1+SUM($B$14:$D$14),0))","v":576},1]
[null,{"$f":"IF(ROW(B10)-1>=$B$14,\"\",OFFSET(INDIRECT(MID(CELL(\"filename\",roll!$A$15),FIND(\"]\",CELL(\"filename\",roll!$A$15))+1,31)&\"!\"&ADDRESS(MATCH(rn_04!$D$9,roll!C:C,0)+1,3,4)),ROW(B10)-1,0))","v":563},{"$f":"IF(ROW(B10)-1>=$C$14,\"\",OFFSET(INDIRECT(MID(CELL(\"filename\",roll!$A$15),FIND(\"]\",CELL(\"filename\",roll!$A$15))+1,31)&\"!\"&ADDRESS(MATCH(rn_04!$D$9,roll!C:C,0)+1,3,4)),ROW(B10)-1+SUM($B$14:$B$14),0))","v":""},{"$f":"IF(ROW(B10)-1>=$D$14,\"\",OFFSET(INDIRECT(MID(CELL(\"filename\",roll!$A$15),FIND(\"]\",CELL(\"filename\",roll!$A$15))+1,31)&\"!\"&ADDRESS(MATCH(rn_04!$D$9,roll!C:C,0)+1,3,4)),ROW(B10)-1+SUM($B$14:$C$14),0))","v":""},{"$f":"IF(ROW(B10)-1>=$E$14,\"\",OFFSET(INDIRECT(MID(CELL(\"filename\",roll!$A$15),FIND(\"]\",CELL(\"filename\",roll!$A$15))+1,31)&\"!\"&ADDRESS(MATCH(rn_04!$D$9,roll!C:C,0)+1,3,4)),ROW(B10)-1+SUM($B$14:$D$14),0))","v":""},1]
[null,{"$f":"IF(ROW(B11)-1>=$B$14,\"\",OFFSET(INDIRECT(MID(CELL(\"filename\",roll!$A$15),FIND(\"]\",CELL(\"filename\",roll!$A$15))+1,31)&\"!\"&ADDRESS(MATCH(rn_04!$D$9,roll!C:C,0)+1,3,4)),ROW(B11)-1,0))","v":10064},{"$f":"IF(ROW(B11)-1>=$C$14,\"\",OFFSET(INDIRECT(MID(CELL(\"filename\",roll!$A$15),FIND(\"]\",CELL(\"filename\",roll!$A$15))+1,31)&\"!\"&ADDRESS(MATCH(rn_04!$D$9,roll!C:C,0)+1,3,4)),ROW(B11)-1+SUM($B$14:$B$14),0))","v":""},{"$f":"IF(ROW(B11)-1>=$D$14,\"\",OFFSET(INDIRECT(MID(CELL(\"filename\",roll!$A$15),FIND(\"]\",CELL(\"filename\",roll!$A$15))+1,31)&\"!\"&ADDRESS(MATCH(rn_04!$D$9,roll!C:C,0)+1,3,4)),ROW(B11)-1+SUM($B$14:$C$14),0))","v":""},{"$f":"IF(ROW(B11)-1>=$E$14,\"\",OFFSET(INDIRECT(MID(CELL(\"filename\",roll!$A$15),FIND(\"]\",CELL(\"filename\",roll!$A$15))+1,31)&\"!\"&ADDRESS(MATCH(rn_04!$D$9,roll!C:C,0)+1,3,4)),ROW(B11)-1+SUM($B$14:$D$14),0))","v":""},1]
[null,{"$f":"IF(ROW(B12)-1>=$B$14,\"\",OFFSET(INDIRECT(MID(CELL(\"filename\",roll!$A$15),FIND(\"]\",CELL(\"filename\",roll!$A$15))+1,31)&\"!\"&ADDRESS(MATCH(rn_04!$D$9,roll!C:C,0)+1,3,4)),ROW(B12)-1,0))","v":564},{"$f":"IF(ROW(B12)-1>=$C$14,\"\",OFFSET(INDIRECT(MID(CELL(\"filename\",roll!$A$15),FIND(\"]\",CELL(\"filename\",roll!$A$15))+1,31)&\"!\"&ADDRESS(MATCH(rn_04!$D$9,roll!C:C,0)+1,3,4)),ROW(B12)-1+SUM($B$14:$B$14),0))","v":""},{"$f":"IF(ROW(B12)-1>=$D$14,\"\",OFFSET(INDIRECT(MID(CELL(\"filename\",roll!$A$15),FIND(\"]\",CELL(\"filename\",roll!$A$15))+1,31)&\"!\"&ADDRESS(MATCH(rn_04!$D$9,roll!C:C,0)+1,3,4)),ROW(B12)-1+SUM($B$14:$C$14),0))","v":""},{"$f":"IF(ROW(B12)-1>=$E$14,\"\",OFFSET(INDIRECT(MID(CELL(\"filename\",roll!$A$15),FIND(\"]\",CELL(\"filename\",roll!$A$15))+1,31)&\"!\"&ADDRESS(MATCH(rn_04!$D$9,roll!C:C,0)+1,3,4)),ROW(B12)-1+SUM($B$14:$D$14),0))","v":""},1]
[null,{"$f":"IF(ROW(B13)-1>=$B$14,\"\",OFFSET(INDIRECT(MID(CELL(\"filename\",roll!$A$15),FIND(\"]\",CELL(\"filename\",roll!$A$15))+1,31)&\"!\"&ADDRESS(MATCH(rn_04!$D$9,roll!C:C,0)+1,3,4)),ROW(B13)-1,0))","v":10065},{"$f":"IF(ROW(B13)-1>=$C$14,\"\",OFFSET(INDIRECT(MID(CELL(\"filename\",roll!$A$15),FIND(\"]\",CELL(\"filename\",roll!$A$15))+1,31)&\"!\"&ADDRESS(MATCH(rn_04!$D$9,roll!C:C,0)+1,3,4)),ROW(B13)-1+SUM($B$14:$B$14),0))","v":""},{"$f":"IF(ROW(B13)-1>=$D$14,\"\",OFFSET(INDIRECT(MID(CELL(\"filename\",roll!$A$15),FIND(\"]\",CELL(\"filename\",roll!$A$15))+1,31)&\"!\"&ADDRESS(MATCH(rn_04!$D$9,roll!C:C,0)+1,3,4)),ROW(B13)-1+SUM($B$14:$C$14),0))","v":""},{"$f":"IF(ROW(B13)-1>=$E$14,\"\",OFFSET(INDIRECT(MID(CELL(\"filename\",roll!$A$15),FIND(\"]\",CELL(\"filename\",roll!$A$15))+1,31)&\"!\"&ADDRESS(MATCH(rn_04!$D$9,roll!C:C,0)+1,3,4)),ROW(B13)-1+SUM($B$14:$D$14),0))","v":""},1]
[null,{"$f":"IF(ROW(B14)-1>=$B$14,\"\",OFFSET(INDIRECT(MID(CELL(\"filename\",roll!$A$15),FIND(\"]\",CELL(\"filename\",roll!$A$15))+1,31)&\"!\"&ADDRESS(MATCH(rn_04!$D$9,roll!C:C,0)+1,3,4)),ROW(B14)-1,0))","v":565},{"$f":"IF(ROW(B14)-1>=$C$14,\"\",OFFSET(INDIRECT(MID(CELL(\"filename\",roll!$A$15),FIND(\"]\",CELL(\"filename\",roll!$A$15))+1,31)&\"!\"&ADDRESS(MATCH(rn_04!$D$9,roll!C:C,0)+1,3,4)),ROW(B14)-1+SUM($B$14:$B$14),0))","v":""},{"$f":"IF(ROW(B14)-1>=$D$14,\"\",OFFSET(INDIRECT(MID(CELL(\"filename\",roll!$A$15),FIND(\"]\",CELL(\"filename\",roll!$A$15))+1,31)&\"!\"&ADDRESS(MATCH(rn_04!$D$9,roll!C:C,0)+1,3,4)),ROW(B14)-1+SUM($B$14:$C$14),0))","v":""},{"$f":"IF(ROW(B14)-1>=$E$14,\"\",OFFSET(INDIRECT(MID(CELL(\"filename\",roll!$A$15),FIND(\"]\",CELL(\"filename\",roll!$A$15))+1,31)&\"!\"&ADDRESS(MATCH(rn_04!$D$9,roll!C:C,0)+1,3,4)),ROW(B14)-1+SUM($B$14:$D$14),0))","v":""},1]
[null,{"$f":"IF(ROW(B15)-1>=$B$14,\"\",OFFSET(INDIRECT(MID(CELL(\"filename\",roll!$A$15),FIND(\"]\",CELL(\"filename\",roll!$A$15))+1,31)&\"!\"&ADDRESS(MATCH(rn_04!$D$9,roll!C:C,0)+1,3,4)),ROW(B15)-1,0))","v":10066},{"$f":"IF(ROW(B15)-1>=$C$14,\"\",OFFSET(INDIRECT(MID(CELL(\"filename\",roll!$A$15),FIND(\"]\",CELL(\"filename\",roll!$A$15))+1,31)&\"!\"&ADDRESS(MATCH(rn_04!$D$9,roll!C:C,0)+1,3,4)),ROW(B15)-1+SUM($B$14:$B$14),0))","v":""},{"$f":"IF(ROW(B15)-1>=$D$14,\"\",OFFSET(INDIRECT(MID(CELL(\"filename\",roll!$A$15),FIND(\"]\",CELL(\"filename\",roll!$A$15))+1,31)&\"!\"&ADDRESS(MATCH(rn_04!$D$9,roll!C:C,0)+1,3,4)),ROW(B15)-1+SUM($B$14:$C$14),0))","v":""},{"$f":"IF(ROW(B15)-1>=$E$14,\"\",OFFSET(INDIRECT(MID(CELL(\"filename\",roll!$A$15),FIND(\"]\",CELL(\"filename\",roll!$A$15))+1,31)&\"!\"&ADDRESS(MATCH(rn_04!$D$9,roll!C:C,0)+1,3,4)),ROW(B15)-1+SUM($B$14:$D$14),0))","v":""},1]
[null,{"$f":"IF(ROW(B16)-1>=$B$14,\"\",OFFSET(INDIRECT(MID(CELL(\"filename\",roll!$A$15),FIND(\"]\",CELL(\"filename\",roll!$A$15))+1,31)&\"!\"&ADDRESS(MATCH(rn_04!$D$9,roll!C:C,0)+1,3,4)),ROW(B16)-1,0))","v":566},{"$f":"IF(ROW(B16)-1>=$C$14,\"\",OFFSET(INDIRECT(MID(CELL(\"filename\",roll!$A$15),FIND(\"]\",CELL(\"filename\",roll!$A$15))+1,31)&\"!\"&ADDRESS(MATCH(rn_04!$D$9,roll!C:C,0)+1,3,4)),ROW(B16)-1+SUM($B$14:$B$14),0))","v":""},{"$f":"IF(ROW(B16)-1>=$D$14,\"\",OFFSET(INDIRECT(MID(CELL(\"filename\",roll!$A$15),FIND(\"]\",CELL(\"filename\",roll!$A$15))+1,31)&\"!\"&ADDRESS(MATCH(rn_04!$D$9,roll!C:C,0)+1,3,4)),ROW(B16)-1+SUM($B$14:$C$14),0))","v":""},{"$f":"IF(ROW(B16)-1>=$E$14,\"\",OFFSET(INDIRECT(MID(CELL(\"filename\",roll!$A$15),FIND(\"]\",CELL(\"filename\",roll!$A$15))+1,31)&\"!\"&ADDRESS(MATCH(rn_04!$D$9,roll!C:C,0)+1,3,4)),ROW(B16)-1+SUM($B$14:$D$14),0))","v":""},1]
[null,{"$f":"IF(ROW(B17)-1>=$B$14,\"\",OFFSET(INDIRECT(MID(CELL(\"filename\",roll!$A$15),FIND(\"]\",CELL(\"filename\",roll!$A$15))+1,31)&\"!\"&ADDRESS(MATCH(rn_04!$D$9,roll!C:C,0)+1,3,4)),ROW(B17)-1,0))","v":10067},{"$f":"IF(ROW(B17)-1>=$C$14,\"\",OFFSET(INDIRECT(MID(CELL(\"filename\",roll!$A$15),FIND(\"]\",CELL(\"filename\",roll!$A$15))+1,31)&\"!\"&ADDRESS(MATCH(rn_04!$D$9,roll!C:C,0)+1,3,4)),ROW(B17)-1+SUM($B$14:$B$14),0))","v":""},{"$f":"IF(ROW(B17)-1>=$D$14,\"\",OFFSET(INDIRECT(MID(CELL(\"filename\",roll!$A$15),FIND(\"]\",CELL(\"filename\",roll!$A$15))+1,31)&\"!\"&ADDRESS(MATCH(rn_04!$D$9,roll!C:C,0)+1,3,4)),ROW(B17)-1+SUM($B$14:$C$14),0))","v":""},{"$f":"IF(ROW(B17)-1>=$E$14,\"\",OFFSET(INDIRECT(MID(CELL(\"filename\",roll!$A$15),FIND(\"]\",CELL(\"filename\",roll!$A$15))+1,31)&\"!\"&ADDRESS(MATCH(rn_04!$D$9,roll!C:C,0)+1,3,4)),ROW(B17)-1+SUM($B$14:$D$14),0))","v":""},1]
[null,{"$f":"IF(ROW(B18)-1>=$B$14,\"\",OFFSET(INDIRECT(MID(CELL(\"filename\",roll!$A$15),FIND(\"]\",CELL(\"filename\",roll!$A$15))+1,31)&\"!\"&ADDRESS(MATCH(rn_04!$D$9,roll!C:C,0)+1,3,4)),ROW(B18)-1,0))","v":""},{"$f":"IF(ROW(B18)-1>=$C$14,\"\",OFFSET(INDIRECT(MID(CELL(\"filename\",roll!$A$15),FIND(\"]\",CELL(\"filename\",roll!$A$15))+1,31)&\"!\"&ADDRESS(MATCH(rn_04!$D$9,roll!C:C,0)+1,3,4)),ROW(B18)-1+SUM($B$14:$B$14),0))","v":""},{"$f":"IF(ROW(B18)-1>=$D$14,\"\",OFFSET(INDIRECT(MID(CELL(\"filename\",roll!$A$15),FIND(\"]\",CELL(\"filename\",roll!$A$15))+1,31)&\"!\"&ADDRESS(MATCH(rn_04!$D$9,roll!C:C,0)+1,3,4)),ROW(B18)-1+SUM($B$14:$C$14),0))","v":""},{"$f":"IF(ROW(B18)-1>=$E$14,\"\",OFFSET(INDIRECT(MID(CELL(\"filename\",roll!$A$15),FIND(\"]\",CELL(\"filename\",roll!$A$15))+1,31)&\"!\"&ADDRESS(MATCH(rn_04!$D$9,roll!C:C,0)+1,3,4)),ROW(B18)-1+SUM($B$14:$D$14),0))","v":""},""]
[null,{"$f":"IF(ROW(B19)-1>=$B$14,\"\",OFFSET(INDIRECT(MID(CELL(\"filename\",roll!$A$15),FIND(\"]\",CELL(\"filename\",roll!$A$15))+1,31)&\"!\"&ADDRESS(MATCH(rn_04!$D$9,roll!C:C,0)+1,3,4)),ROW(B19)-1,0))","v":""},{"$f":"IF(ROW(B19)-1>=$C$14,\"\",OFFSET(INDIRECT(MID(CELL(\"filename\",roll!$A$15),FIND(\"]\",CELL(\"filename\",roll!$A$15))+1,31)&\"!\"&ADDRESS(MATCH(rn_04!$D$9,roll!C:C,0)+1,3,4)),ROW(B19)-1+SUM($B$14:$B$14),0))","v":""},{"$f":"IF(ROW(B19)-1>=$D$14,\"\",OFFSET(INDIRECT(MID(CELL(\"filename\",roll!$A$15),FIND(\"]\",CELL(\"filename\",roll!$A$15))+1,31)&\"!\"&ADDRESS(MATCH(rn_04!$D$9,roll!C:C,0)+1,3,4)),ROW(B19)-1+SUM($B$14:$C$14),0))","v":""},{"$f":"IF(ROW(B19)-1>=$E$14,\"\",OFFSET(INDIRECT(MID(CELL(\"filename\",roll!$A$15),FIND(\"]\",CELL(\"filename\",roll!$A$15))+1,31)&\"!\"&ADDRESS(MATCH(rn_04!$D$9,roll!C:C,0)+1,3,4)),ROW(B19)-1+SUM($B$14:$D$14),0))","v":""},""]
[null,{"$f":"IF(ROW(B20)-1>=$B$14,\"\",OFFSET(INDIRECT(MID(CELL(\"filename\",roll!$A$15),FIND(\"]\",CELL(\"filename\",roll!$A$15))+1,31)&\"!\"&ADDRESS(MATCH(rn_04!$D$9,roll!C:C,0)+1,3,4)),ROW(B20)-1,0))","v":""},{"$f":"IF(ROW(B20)-1>=$C$14,\"\",OFFSET(INDIRECT(MID(CELL(\"filename\",roll!$A$15),FIND(\"]\",CELL(\"filename\",roll!$A$15))+1,31)&\"!\"&ADDRESS(MATCH(rn_04!$D$9,roll!C:C,0)+1,3,4)),ROW(B20)-1+SUM($B$14:$B$14),0))","v":""},{"$f":"IF(ROW(B20)-1>=$D$14,\"\",OFFSET(INDIRECT(MID(CELL(\"filename\",roll!$A$15),FIND(\"]\",CELL(\"filename\",roll!$A$15))+1,31)&\"!\"&ADDRESS(MATCH(rn_04!$D$9,roll!C:C,0)+1,3,4)),ROW(B20)-1+SUM($B$14:$C$14),0))","v":""},{"$f":"IF(ROW(B20)-1>=$E$14,\"\",OFFSET(INDIRECT(MID(CELL(\"filename\",roll!$A$15),FIND(\"]\",CELL(\"filename\",roll!$A$15))+1,31)&\"!\"&ADDRESS(MATCH(rn_04!$D$9,roll!C:C,0)+1,3,4)),ROW(B20)-1+SUM($B$14:$D$14),0))","v":""},""]
[]
[null,"परीक्षा प्रभारी",null,null,"केन्द्राधीक्षक "]
[null,{"$f":"rn_01!$B$37","v":"ASD (Lecturer)"},null,null,{"$f":"rn_01!$E$37","v":"XYZ (Principal)"}]

{"sheet":"rn_06","index":6,"n_rows":37,"n_cols":6,"rows_kept":37,"cut":false,"hidden":false,"merged":[[11,1,11,4],[0,1,0,4],[1,1,1,4],[2,1,2,4],[3,1,3,4],[4,1,4,4],[5,1,5,4],[7,1,7,4],[8,1,8,2],[8,3,8,4],[9,1,9,4],[10,1,10,4]]}
[null,{"$f":"rn_01!$B$1","v":"Class VIIITH Board Examination, 2025"}]
[null,"परीक्षा केंद्र नाम एवं परीक्षा केंद्र क्रमांक"]
[null,{"$f":"rn_01!$B$3","v":"GSSS Malutana (12345)"}]
[null,"परीक्षा कक्ष / हॉल क्रमांक"]
[null,{"$f":"rn_01!$K$6","v":6}]
[null,"परीक्षा दिनांक (दिवस) ... से ... तक"]
[null,{"$f":"rn_01!$B$7","v":"01-03-2025"},{"$f":"IF(B7=\"\",\"\",TEXT(B7,\"DDDD\"))","v":"Saturday"},{"$f":"rn_01!$D$7","v":"22-05-2025"},{"$f":"IF(D7=\"\",\"\",TEXT(D7,\"DDDD\"))","v":"Thursday"}]
[null,"परीक्षार्थी रोल नंबर ... से ... तक"]
[null,{"$f":"IF(B14>0,B15,IF(C14>0,C15,IF(D14>0,D15,IF(E14>0,E15,0))))","v":10077},null,{"$f":"IF(E14>0,LOOKUP(2,1/(E15:E34<>\"\"),E15:E34),IF(D14>0,LOOKUP(2,1/(D15:D34<>\"\"),D15:D34),IF(C14>0,LOOKUP(2,1/(C15:C34<>\"\"),C15:C34),IF(B14>0,LOOKUP(2,1/(B15:B34<>\"\"),B15:B34),0))))","v":10086}]
[null,"कुल सम्मिलित परीक्षार्थी "]
[null,{"$f":"COUNTIF($B$15:$E$34,\">0\")","v":19}]
[null,"परीक्षार्थी बैठक व्यवस्था"]
[null,"पंक्ति 1","पंक्ति 2","पंक्ति 3","पंक्ति 4"]
[null,{"$f":"rn_01!L6","v":10},{"$f":"rn_01!M6","v":3},{"$f":"rn_01!N6","v":3},{"$f":"rn_01!O6","v":3}]
[null,{"$f":"IF(ROW(B1)-1>=$B$14,\"\",OFFSET(INDIRECT(MID(CELL(\"filename\",roll!$A$15),FIND(\"]\",CELL(\"filename\",roll!$A$15))+1,31)&\"!\"&ADDRESS(MATCH(rn_05!$D$9,roll!C:C,0)+1,3,4)),ROW(B1)-1,0))","v":10077},{"$f":"IF(ROW(B1)-1>=$C$14,\"\",OFFSET(INDIRECT(MID(CELL(\"filename\",roll!$A$15),FIND(\"]\",CELL(\"filename\",roll!$A$15))+1,31)&\"!\"&ADDRESS(MATCH(rn_05!$D$9,roll!C:C,0)+1,3,4)),ROW(B1)-1+SUM($B$14:$B$14),0))","v":10082},{"$f":"IF(ROW(B1)-1>=$D$14,\"\",OFFSET(INDIRECT(MID(CELL(\"filename\",roll!$A$15),FIND(\"]\",CELL(\"filename\",roll!$A$15))+1,31)&\"!\"&ADDRESS(MATCH(rn_05!$D$9,roll!C:C,0)+1,3,4)),ROW(B1)-1+SUM($B$14:$C$14),0))","v":583},{"$f":"IF(ROW(B1)-1>=$E$14,\"\",OFFSET(INDIRECT(MID(CELL(\"filename\",roll!$A$15),FIND(\"]\",CELL(\"filename\",roll!$A$15))+1,31)&\"!\"&ADDRESS(MATCH(rn_05!$D$9,roll!C:C,0)+1,3,4)),ROW(B1)-1+SUM($B$14:$D$14),0))","v":10085},{"$f":"IF(SUM(B15:E15)>0,1,\"\")","v":1}]
[null,{"$f":"IF(ROW(B2)-1>=$B$14,\"\",OFFSET(INDIRECT(MID(CELL(\"filename\",roll!$A$15),FIND(\"]\",CELL(\"filename\",roll!$A$15))+1,31)&\"!\"&ADDRESS(MATCH(rn_05!$D$9,roll!C:C,0)+1,3,4)),ROW(B2)-1,0))","v":577},{"$f":"IF(ROW(B2)-1>=$C$14,\"\",OFFSET(INDIRECT(MID(CELL(\"filename\",roll!$A$15),FIND(\"]\",CELL(\"filename\",roll!$A$15))+1,31)&\"!\"&ADDRESS(MATCH(rn_05!$D$9,roll!C:C,0)+1,3,4)),ROW(B2)-1+SUM($B$14:$B$14),0))","v":582},{"$f":"IF(ROW(B2)-1>=$D$14,\"\",OFFSET(INDIRECT(MID(CELL(\"filename\",roll!$A$15),FIND(\"]\",CELL(\"filename\",roll!$A$15))+1,31)&\"!\"&ADDRESS(MATCH(rn_05!$D$9,roll!C:C,0)+1,3,4)),ROW(B2)-1+SUM($B$14:$C$14),0))","v":10084},{"$f":"IF(ROW(B2)-1>=$E$14,\"\",OFFSET(INDIRECT(MID(CELL(\"filename\",roll!$A$15),FIND(\"]\",CELL(\"filename\",roll!$A$15))+1,31)&\"!\"&ADDRESS(MATCH(rn_05!$D$9,roll!C:C,0)+1,3,4)),ROW(B2)-1+SUM($B$14:$D$14),0))","v":585},{"$f":"IF(SUM(B16:E16)>0,1,\"\")","v":1}]
[null,{"$f":"IF(ROW(B3)-1>=$B$14,\"\",OFFSET(INDIRECT(MID(CELL(\"filename\",roll!$A$15),FIND(\"]\",CELL(\"filename\",roll!$A$15))+1,31)&\"!\"&ADDRESS(MATCH(rn_05!$D$9,roll!C:C,0)+1,3,4)),ROW(B3)-1,0))","v":10078},{"$f":"IF(ROW(B3)-1>=$C$14,\"\",OFFSET(INDIRECT(MID(CELL(\"filename\",roll!$A$15),FIND(\"]\",CELL(\"filename\",roll!$A$15))+1,31)&\"!\"&ADDRESS(MATCH(rn_05!$D$9,roll!C:C,0)+1,3,4)),ROW(B3)-1+SUM($B$14:$B$14),0))","v":10083},{"$f":"IF(ROW(B3)-1>=$D$14,\"\",OFFSET(INDIRECT(MID(CELL(\"filename\",roll!$A$15),FIND(\"]\",CELL(\"filename\",roll!$A$15))+1,31)&\"!\"&ADDRESS(MATCH(rn_05!$D$9,roll!C:C,0)+1,3,4)),ROW(B3)-1+SUM($B$14:$C$14),0))","v":584},{"$f":"IF(ROW(B3)-1>=$E$14,\"\",OFFSET(INDIRECT(MID(CELL(\"filename\",roll!$A$15),FIND(\"]\",CELL(\"filename\",roll!$A$15))+1,31)&\"!\"&ADDRESS(MATCH(rn_05!$D$9,roll!C:C,0)+1,3,4)),ROW(B3)-1+SUM($B$14:$D$14),0))","v":10086},1]
[null,{"$f":"IF(ROW(B4)-1>=$B$14,\"\",OFFSET(INDIRECT(MID(CELL(\"filename\",roll!$A$15),FIND(\"]\",CELL(\"filename\",roll!$A$15))+1,31)&\"!\"&ADDRESS(MATCH(rn_05!$D$9,roll!C:C,0)+1,3,4)),ROW(B4)-1,0))","v":578},{"$f":"IF(ROW(B4)-1>=$C$14,\"\",OFFSET(INDIRECT(MID(CELL(\"filename\",roll!$A$15),FIND(\"]\",CELL(\"filename\",roll!$A$15))+1,31)&\"!\"&ADDRESS(MATCH(rn_05!$D$9,roll!C:C,0)+1,3,4)),ROW(B4)-1+SUM($B$14:$B$14),0))","v":""},{"$f":"IF(ROW(B4)-1>=$D$14,\"\",OFFSET(INDIRECT(MID(CELL(\"filename\",roll!$A$15),FIND(\"]\",CELL(\"filename\",roll!$A$15))+1,31)&\"!\"&ADDRESS(MATCH(rn_05!$D$9,roll!C:C,0)+1,3,4)),ROW(B4)-1+SUM($B$14:$C$14),0))","v":""},{"$f":"IF(ROW(B4)-1>=$E$14,\"\",OFFSET(INDIRECT(MID(CELL(\"filename\",roll!$A$15),FIND(\"]\",CELL(\"filename\",roll!$A$15))+1,31)&\"!\"&ADDRESS(MATCH(rn_05!$D$9,roll!C:C,0)+1,3,4)),ROW(B4)-1+SUM($B$14:$D$14),0))","v":""},1]
[null,{"$f":"IF(ROW(B5)-1>=$B$14,\"\",OFFSET(INDIRECT(MID(CELL(\"filename\",roll!$A$15),FIND(\"]\",CELL(\"filename\",roll!$A$15))+1,31)&\"!\"&ADDRESS(MATCH(rn_05!$D$9,roll!C:C,0)+1,3,4)),ROW(B5)-1,0))","v":10079},{"$f":"IF(ROW(B5)-1>=$C$14,\"\",OFFSET(INDIRECT(MID(CELL(\"filename\",roll!$A$15),FIND(\"]\",CELL(\"filename\",roll!$A$15))+1,31)&\"!\"&ADDRESS(MATCH(rn_05!$D$9,roll!C:C,0)+1,3,4)),ROW(B5)-1+SUM($B$14:$B$14),0))","v":""},{"$f":"IF(ROW(B5)-1>=$D$14,\"\",OFFSET(INDIRECT(MID(CELL(\"filename\",roll!$A$15),FIND(\"]\",CELL(\"filename\",roll!$A$15))+1,31)&\"!\"&ADDRESS(MATCH(rn_05!$D$9,roll!C:C,0)+1,3,4)),ROW(B5)-1+SUM($B$14:$C$14),0))","v":""},{"$f":"IF(ROW(B5)-1>=$E$14,\"\",OFFSET(INDIRECT(MID(CELL(\"filename\",roll!$A$15),FIND(\"]\",CELL(\"filename\",roll!$A$15))+1,31)&\"!\"&ADDRESS(MATCH(rn_05!$D$9,roll!C:C,0)+1,3,4)),ROW(B5)-1+SUM($B$14:$D$14),0))","v":""},1]
[null,{"$f":"IF(ROW(B6)-1>=$B$14,\"\",OFFSET(INDIRECT(MID(CELL(\"filename\",roll!$A$15),FIND(\"]\",CELL(\"filename\",roll!$A$15))+1,31)&\"!\"&ADDRESS(MATCH(rn_05!$D$9,roll!C:C,0)+1,3,4)),ROW(B6)-1,0))","v":579},{"$f":"IF(ROW(B6)-1>=$C$14,\"\",OFFSET(INDIRECT(MID(CELL(\"filename\",roll!$A$15),FIND(\"]\",CELL(\"filename\",roll!$A$15))+1,31)&\"!\"&ADDRESS(MATCH(rn_05!$D$9,roll!C:C,0)+1,3,4)),ROW(B6)-1+SUM($B$14:$B$14),0))","v":""},{"$f":"IF(ROW(B6)-1>=$D$14,\"\",OFFSET(INDIRECT(MID(CELL(\"filename\",roll!$A$15),FIND(\"]\",CELL(\"filename\",roll!$A$15))+1,31)&\"!\"&ADDRESS(MATCH(rn_05!$D$9,roll!C:C,0)+1,3,4)),ROW(B6)-1+SUM($B$14:$C$14),0))","v":""},{"$f":"IF(ROW(B6)-1>=$E$14,\"\",OFFSET(INDIRECT(MID(CELL(\"filename\",roll!$A$15),FIND(\"]\",CELL(\"filename\",roll!$A$15))+1,31)&\"!\"&ADDRESS(MATCH(rn_05!$D$9,roll!C:C,0)+1,3,4)),ROW(B6)-1+SUM($B$14:$D$14),0))","v":""},1]
[null,{"$f":"IF(ROW(B7)-1>=$B$14,\"\",OFFSET(INDIRECT(MID(CELL(\"filename\",roll!$A$15),FIND(\"]\",CELL(\"filename\",roll!$A$15))+1,31)&\"!\"&ADDRESS(MATCH(rn_05!$D$9,roll!C:C,0)+1,3,4)),ROW(B7)-1,0))","v":10080},{"$f":"IF(ROW(B7)-1>=$C$14,\"\",OFFSET(INDIRECT(MID(CELL(\"filename\",roll!$A$15),FIND(\"]\",CELL(\"filename\",roll!$A$15))+1,31)&\"!\"&ADDRESS(MATCH(rn_05!$D$9,roll!C:C,0)+1,3,4)),ROW(B7)-1+SUM($B$14:$B$14),0))","v":""},{"$f":"IF(ROW(B7)-1>=$D$14,\"\",OFFSET(INDIRECT(MID(CELL(\"filename\",roll!$A$15),FIND(\"]\",CELL(\"filename\",roll!$A$15))+1,31)&\"!\"&ADDRESS(MATCH(rn_05!$D$9,roll!C:C,0)+1,3,4)),ROW(B7)-1+SUM($B$14:$C$14),0))","v":""},{"$f":"IF(ROW(B7)-1>=$E$14,\"\",OFFSET(INDIRECT(MID(CELL(\"filename\",roll!$A$15),FIND(\"]\",CELL(\"filename\",roll!$A$15))+1,31)&\"!\"&ADDRESS(MATCH(rn_05!$D$9,roll!C:C,0)+1,3,4)),ROW(B7)-1+SUM($B$14:$D$14),0))","v":""},1]
[null,{"$f":"IF(ROW(B8)-1>=$B$14,\"\",OFFSET(INDIRECT(MID(CELL(\"filename\",roll!$A$15),FIND(\"]\",CELL(\"filename\",roll!$A$15))+1,31)&\"!\"&ADDRESS(MATCH(rn_05!$D$9,roll!C:C,0)+1,3,4)),ROW(B8)-1,0))","v":580},{"$f":"IF(ROW(B8)-1>=$C$14,\"\",OFFSET(INDIRECT(MID(CELL(\"filename\",roll!$A$15),FIND(\"]\",CELL(\"filename\",roll!$A$15))+1,31)&\"!\"&ADDRESS(MATCH(rn_05!$D$9,roll!C:C,0)+1,3,4)),ROW(B8)-1+SUM($B$14:$B$14),0))","v":""},{"$f":"IF(ROW(B8)-1>=$D$14,\"\",OFFSET(INDIRECT(MID(CELL(\"filename\",roll!$A$15),FIND(\"]\",CELL(\"filename\",roll!$A$15))+1,31)&\"!\"&ADDRESS(MATCH(rn_05!$D$9,roll!C:C,0)+1,3,4)),ROW(B8)-1+SUM($B$14:$C$14),0))","v":""},{"$f":"IF(ROW(B8)-1>=$E$14,\"\",OFFSET(INDIRECT(MID(CELL(\"filename\",roll!$A$15),FIND(\"]\",CELL(\"filename\",roll!$A$15))+1,31)&\"!\"&ADDRESS(MATCH(rn_05!$D$9,roll!C:C,0)+1,3,4)),ROW(B8)-1+SUM($B$14:$D$14),0))","v":""},1]
[null,{"$f":"IF(ROW(B9)-1>=$B$14,\"\",OFFSET(INDIRECT(MID(CELL(\"filename\",roll!$A$15),FIND(\"]\",CELL(\"filename\",roll!$A$15))+1,31)&\"!\"&ADDRESS(MATCH(rn_05!$D$9,roll!C:C,0)+1,3,4)),ROW(B9)-1,0))","v":10081},{"$f":"IF(ROW(B9)-1>=$C$14,\"\",OFFSET(INDIRECT(MID(CELL(\"filename\",roll!$A$15),FIND(\"]\",CELL(\"filename\",roll!$A$15))+1,31)&\"!\"&ADDRESS(MATCH(rn_05!$D$9,roll!C:C,0)+1,3,4)),ROW(B9)-1+SUM($B$14:$B$14),0))","v":""},{"$f":"IF(ROW(B9)-1>=$D$14,\"\",OFFSET(INDIRECT(MID(CELL(\"filename\",roll!$A$15),FIND(\"]\",CELL(\"filename\",roll!$A$15))+1,31)&\"!\"&ADDRESS(MATCH(rn_05!$D$9,roll!C:C,0)+1,3,4)),ROW(B9)-1+SUM($B$14:$C$14),0))","v":""},{"$f":"IF(ROW(B9)-1>=$E$14,\"\",OFFSET(INDIRECT(MID(CELL(\"filename\",roll!$A$15),FIND(\"]\",CELL(\"filename\",roll!$A$15))+1,31)&\"!\"&ADDRESS(MATCH(rn_05!$D$9,roll!C:C,0)+1,3,4)),ROW(B9)-1+SUM($B$14:$D$14),0))","v":""},1]
[null,{"$f":"IF(ROW(B10)-1>=$B$14,\"\",OFFSET(INDIRECT(MID(CELL(\"filename\",roll!$A$15),FIND(\"]\",CELL(\"filename\",roll!$A$15))+1,31)&\"!\"&ADDRESS(MATCH(rn_05!$D$9,roll!C:C,0)+1,3,4)),ROW(B10)-1,0))","v":581},{"$f":"IF(ROW(B10)-1>=$C$14,\"\",OFFSET(INDIRECT(MID(CELL(\"filename\",roll!$A$15),FIND(\"]\",CELL(\"filename\",roll!$A$15))+1,31)&\"!\"&ADDRESS(MATCH(rn_05!$D$9,roll!C:C,0)+1,3,4)),ROW(B10)-1+SUM($B$14:$B$14),0))","v":""},{"$f":"IF(ROW(B10)-1>=$D$14,\"\",OFFSET(INDIRECT(MID(CELL(\"filename\",roll!$A$15),FIND(\"]\",CELL(\"filename\",roll!$A$15))+1,31)&\"!\"&ADDRESS(MATCH(rn_05!$D$9,roll!C:C,0)+1,3,4)),ROW(B10)-1+SUM($B$14:$C$14),0))","v":""},{"$f":"IF(ROW(B10)-1>=$E$14,\"\",OFFSET(INDIRECT(MID(CELL(\"filename\",roll!$A$15),FIND(\"]\",CELL(\"filename\",roll!$A$15))+1,31)&\"!\"&ADDRESS(MATCH(rn_05!$D$9,roll!C:C,0)+1,3,4)),ROW(B10)-1+SUM($B$14:$D$14),0))","v":""},1]
[null,{"$f":"IF(ROW(B11)-1>=$B$14,\"\",OFFSET(INDIRECT(MID(CELL(\"filename\",roll!$A$15),FIND(\"]\",CELL(\"filename\",roll!$A$15))+1,31)&\"!\"&ADDRESS(MATCH(rn_05!$D$9,roll!C:C,0)+1,3,4)),ROW(B11)-1,0))","v":""},{"$f":"IF(ROW(B11)-1>=$C$14,\"\",OFFSET(INDIRECT(MID(CELL(\"filename\",roll!$A$15),FIND(\"]\",CELL(\"filename\",roll!$A$15))+1,31)&\"!\"&ADDRESS(MATCH(rn_05!$D$9,roll!C:C,0)+1,3,4)),ROW(B11)-1+SUM($B$14:$B$14),0))","v":""},{"$f":"IF(ROW(B11)-1>=$D$14,\"\",OFFSET(INDIRECT(MID(CELL(\"filename\",roll!$A$15),FIND(\"]\",CELL(\"filename\",roll!$A$15))+1,31)&\"!\"&ADDRESS(MATCH(rn_05!$D$9,roll!C:C,0)+1,3,4)),ROW(B11)-1+SUM($B$14:$C$14),0))","v":""},{"$f":"IF(ROW(B11)-1>=$E$14,\"\",OFFSET(INDIRECT(MID(CELL(\"filename\",roll!$A$15),FIND(\"]\",CELL(\"filename\",roll!$A$15))+1,31)&\"!\"&ADDRESS(MATCH(rn_05!$D$9,roll!C:C,0)+1,3,4)),ROW(B11)-1+SUM($B$14:$D$14),0))","v":""},""]
[null,{"$f":"IF(ROW(B12)-1>=$B$14,\"\",OFFSET(INDIRECT(MID(CELL(\"filename\",roll!$A$15),FIND(\"]\",CELL(\"filename\",roll!$A$15))+1,31)&\"!\"&ADDRESS(MATCH(rn_05!$D$9,roll!C:C,0)+1,3,4)),ROW(B12)-1,0))","v":""},{"$f":"IF(ROW(B12)-1>=$C$14,\"\",OFFSET(INDIRECT(MID(CELL(\"filename\",roll!$A$15),FIND(\"]\",CELL(\"filename\",roll!$A$15))+1,31)&\"!\"&ADDRESS(MATCH(rn_05!$D$9,roll!C:C,0)+1,3,4)),ROW(B12)-1+SUM($B$14:$B$14),0))","v":""},{"$f":"IF(ROW(B12)-1>=$D$14,\"\",OFFSET(INDIRECT(MID(CELL(\"filename\",roll!$A$15),FIND(\"]\",CELL(\"filename\",roll!$A$15))+1,31)&\"!\"&ADDRESS(MATCH(rn_05!$D$9,roll!C:C,0)+1,3,4)),ROW(B12)-1+SUM($B$14:$C$14),0))","v":""},{"$f":"IF(ROW(B12)-1>=$E$14,\"\",OFFSET(INDIRECT(MID(CELL(\"filename\",roll!$A$15),FIND(\"]\",CELL(\"filename\",roll!$A$15))+1,31)&\"!\"&ADDRESS(MATCH(rn_05!$D$9,roll!C:C,0)+1,3,4)),ROW(B12)-1+SUM($B$14:$D$14),0))","v":""},""]
[null,{"$f":"IF(ROW(B13)-1>=$B$14,\"\",OFFSET(INDIRECT(MID(CELL(\"filename\",roll!$A$15),FIND(\"]\",CELL(\"filename\",roll!$A$15))+1,31)&\"!\"&ADDRESS(MATCH(rn_05!$D$9,roll!C:C,0)+1,3,4)),ROW(B13)-1,0))","v":""},{"$f":"IF(ROW(B13)-1>=$C$14,\"\",OFFSET(INDIRECT(MID(CELL(\"filename\",roll!$A$15),FIND(\"]\",CELL(\"filename\",roll!$A$15))+1,31)&\"!\"&ADDRESS(MATCH(rn_05!$D$9,roll!C:C,0)+1,3,4)),ROW(B13)-1+SUM($B$14:$B$14),0))","v":""},{"$f":"IF(ROW(B13)-1>=$D$14,\"\",OFFSET(INDIRECT(MID(CELL(\"filename\",roll!$A$15),FIND(\"]\",CELL(\"filename\",roll!$A$15))+1,31)&\"!\"&ADDRESS(MATCH(rn_05!$D$9,roll!C:C,0)+1,3,4)),ROW(B13)-1+SUM($B$14:$C$14),0))","v":""},{"$f":"IF(ROW(B13)-1>=$E$14,\"\",OFFSET(INDIRECT(MID(CELL(\"filename\",roll!$A$15),FIND(\"]\",CELL(\"filename\",roll!$A$15))+1,31)&\"!\"&ADDRESS(MATCH(rn_05!$D$9,roll!C:C,0)+1,3,4)),ROW(B13)-1+SUM($B$14:$D$14),0))","v":""},""]
[null,{"$f":"IF(ROW(B14)-1>=$B$14,\"\",OFFSET(INDIRECT(MID(CELL(\"filename\",roll!$A$15),FIND(\"]\",CELL(\"filename\",roll!$A$15))+1,31)&\"!\"&ADDRESS(MATCH(rn_05!$D$9,roll!C:C,0)+1,3,4)),ROW(B14)-1,0))","v":""},{"$f":"IF(ROW(B14)-1>=$C$14,\"\",OFFSET(INDIRECT(MID(CELL(\"filename\",roll!$A$15),FIND(\"]\",CELL(\"filename\",roll!$A$15))+1,31)&\"!\"&ADDRESS(MATCH(rn_05!$D$9,roll!C:C,0)+1,3,4)),ROW(B14)-1+SUM($B$14:$B$14),0))","v":""},{"$f":"IF(ROW(B14)-1>=$D$14,\"\",OFFSET(INDIRECT(MID(CELL(\"filename\",roll!$A$15),FIND(\"]\",CELL(\"filename\",roll!$A$15))+1,31)&\"!\"&ADDRESS(MATCH(rn_05!$D$9,roll!C:C,0)+1,3,4)),ROW(B14)-1+SUM($B$14:$C$14),0))","v":""},{"$f":"IF(ROW(B14)-1>=$E$14,\"\",OFFSET(INDIRECT(MID(CELL(\"filename\",roll!$A$15),FIND(\"]\",CELL(\"filename\",roll!$A$15))+1,31)&\"!\"&ADDRESS(MATCH(rn_05!$D$9,roll!C:C,0)+1,3,4)),ROW(B14)-1+SUM($B$14:$D$14),0))","v":""},""]
[null,{"$f":"IF(ROW(B15)-1>=$B$14,\"\",OFFSET(INDIRECT(MID(CELL(\"filename\",roll!$A$15),FIND(\"]\",CELL(\"filename\",roll!$A$15))+1,31)&\"!\"&ADDRESS(MATCH(rn_05!$D$9,roll!C:C,0)+1,3,4)),ROW(B15)-1,0))","v":""},{"$f":"IF(ROW(B15)-1>=$C$14,\"\",OFFSET(INDIRECT(MID(CELL(\"filename\",roll!$A$15),FIND(\"]\",CELL(\"filename\",roll!$A$15))+1,31)&\"!\"&ADDRESS(MATCH(rn_05!$D$9,roll!C:C,0)+1,3,4)),ROW(B15)-1+SUM($B$14:$B$14),0))","v":""},{"$f":"IF(ROW(B15)-1>=$D$14,\"\",OFFSET(INDIRECT(MID(CELL(\"filename\",roll!$A$15),FIND(\"]\",CELL(\"filename\",roll!$A$15))+1,31)&\"!\"&ADDRESS(MATCH(rn_05!$D$9,roll!C:C,0)+1,3,4)),ROW(B15)-1+SUM($B$14:$C$14),0))","v":""},{"$f":"IF(ROW(B15)-1>=$E$14,\"\",OFFSET(INDIRECT(MID(CELL(\"filename\",roll!$A$15),FIND(\"]\",CELL(\"filename\",roll!$A$15))+1,31)&\"!\"&ADDRESS(MATCH(rn_05!$D$9,roll!C:C,0)+1,3,4)),ROW(B15)-1+SUM($B$14:$D$14),0))","v":""},""]
[null,{"$f":"IF(ROW(B16)-1>=$B$14,\"\",OFFSET(INDIRECT(MID(CELL(\"filename\",roll!$A$15),FIND(\"]\",CELL(\"filename\",roll!$A$15))+1,31)&\"!\"&ADDRESS(MATCH(rn_05!$D$9,roll!C:C,0)+1,3,4)),ROW(B16)-1,0))","v":""},{"$f":"IF(ROW(B16)-1>=$C$14,\"\",OFFSET(INDIRECT(MID(CELL(\"filename\",roll!$A$15),FIND(\"]\",CELL(\"filename\",roll!$A$15))+1,31)&\"!\"&ADDRESS(MATCH(rn_05!$D$9,roll!C:C,0)+1,3,4)),ROW(B16)-1+SUM($B$14:$B$14),0))","v":""},{"$f":"IF(ROW(B16)-1>=$D$14,\"\",OFFSET(INDIRECT(MID(CELL(\"filename\",roll!$A$15),FIND(\"]\",CELL(\"filename\",roll!$A$15))+1,31)&\"!\"&ADDRESS(MATCH(rn_05!$D$9,roll!C:C,0)+1,3,4)),ROW(B16)-1+SUM($B$14:$C$14),0))","v":""},{"$f":"IF(ROW(B16)-1>=$E$14,\"\",OFFSET(INDIRECT(MID(CELL(\"filename\",roll!$A$15),FIND(\"]\",CELL(\"filename\",roll!$A$15))+1,31)&\"!\"&ADDRESS(MATCH(rn_05!$D$9,roll!C:C,0)+1,3,4)),ROW(B16)-1+SUM($B$14:$D$14),0))","v":""},""]
[null,{"$f":"IF(ROW(B17)-1>=$B$14,\"\",OFFSET(INDIRECT(MID(CELL(\"filename\",roll!$A$15),FIND(\"]\",CELL(\"filename\",roll!$A$15))+1,31)&\"!\"&ADDRESS(MATCH(rn_05!$D$9,roll!C:C,0)+1,3,4)),ROW(B17)-1,0))","v":""},{"$f":"IF(ROW(B17)-1>=$C$14,\"\",OFFSET(INDIRECT(MID(CELL(\"filename\",roll!$A$15),FIND(\"]\",CELL(\"filename\",roll!$A$15))+1,31)&\"!\"&ADDRESS(MATCH(rn_05!$D$9,roll!C:C,0)+1,3,4)),ROW(B17)-1+SUM($B$14:$B$14),0))","v":""},{"$f":"IF(ROW(B17)-1>=$D$14,\"\",OFFSET(INDIRECT(MID(CELL(\"filename\",roll!$A$15),FIND(\"]\",CELL(\"filename\",roll!$A$15))+1,31)&\"!\"&ADDRESS(MATCH(rn_05!$D$9,roll!C:C,0)+1,3,4)),ROW(B17)-1+SUM($B$14:$C$14),0))","v":""},{"$f":"IF(ROW(B17)-1>=$E$14,\"\",OFFSET(INDIRECT(MID(CELL(\"filename\",roll!$A$15),FIND(\"]\",CELL(\"filename\",roll!$A$15))+1,31)&\"!\"&ADDRESS(MATCH(rn_05!$D$9,roll!C:C,0)+1,3,4)),ROW(B17)-1+SUM($B$14:$D$14),0))","v":""},""]
[null,{"$f":"IF(ROW(B18)-1>=$B$14,\"\",OFFSET(INDIRECT(MID(CELL(\"filename\",roll!$A$15),FIND(\"]\",CELL(\"filename\",roll!$A$15))+1,31)&\"!\"&ADDRESS(MATCH(rn_05!$D$9,roll!C:C,0)+1,3,4)),ROW(B18)-1,0))","v":""},{"$f":"IF(ROW(B18)-1>=$C$14,\"\",OFFSET(INDIRECT(MID(CELL(\"filename\",roll!$A$15),FIND(\"]\",CELL(\"filename\",roll!$A$15))+1,31)&\"!\"&ADDRESS(MATCH(rn_05!$D$9,roll!C:C,0)+1,3,4)),ROW(B18)-1+SUM($B$14:$B$14),0))","v":""},{"$f":"IF(ROW(B18)-1>=$D$14,\"\",OFFSET(INDIRECT(MID(CELL(\"filename\",roll!$A$15),FIND(\"]\",CELL(\"filename\",roll!$A$15))+1,31)&\"!\"&ADDRESS(MATCH(rn_05!$D$9,roll!C:C,0)+1,3,4)),ROW(B18)-1+SUM($B$14:$C$14),0))","v":""},{"$f":"IF(ROW(B18)-1>=$E$14,\"\",OFFSET(INDIRECT(MID(CELL(\"filename\",roll!$A$15),FIND(\"]\",CELL(\"filename\",roll!$A$15))+1,31)&\"!\"&ADDRESS(MATCH(rn_05!$D$9,roll!C:C,0)+1,3,4)),ROW(B18)-1+SUM($B$14:$D$14),0))","v":""},""]
[null,{"$f":"IF(ROW(B19)-1>=$B$14,\"\",OFFSET(INDIRECT(MID(CELL(\"filename\",roll!$A$15),FIND(\"]\",CELL(\"filename\",roll!$A$15))+1,31)&\"!\"&ADDRESS(MATCH(rn_05!$D$9,roll!C:C,0)+1,3,4)),ROW(B19)-1,0))","v":""},{"$f":"IF(ROW(B19)-1>=$C$14,\"\",OFFSET(INDIRECT(MID(CELL(\"filename\",roll!$A$15),FIND(\"]\",CELL(\"filename\",roll!$A$15))+1,31)&\"!\"&ADDRESS(MATCH(rn_05!$D$9,roll!C:C,0)+1,3,4)),ROW(B19)-1+SUM($B$14:$B$14),0))","v":""},{"$f":"IF(ROW(B19)-1>=$D$14,\"\",OFFSET(INDIRECT(MID(CELL(\"filename\",roll!$A$15),FIND(\"]\",CELL(\"filename\",roll!$A$15))+1,31)&\"!\"&ADDRESS(MATCH(rn_05!$D$9,roll!C:C,0)+1,3,4)),ROW(B19)-1+SUM($B$14:$C$14),0))","v":""},{"$f":"IF(ROW(B19)-1>=$E$14,\"\",OFFSET(INDIRECT(MID(CELL(\"filename\",roll!$A$15),FIND(\"]\",CELL(\"filename\",roll!$A$15))+1,31)&\"!\"&ADDRESS(MATCH(rn_05!$D$9,roll!C:C,0)+1,3,4)),ROW(B19)-1+SUM($B$14:$D$14),0))","v":""},""]
[null,{"$f":"IF(ROW(B20)-1>=$B$14,\"\",OFFSET(INDIRECT(MID(CELL(\"filename\",roll!$A$15),FIND(\"]\",CELL(\"filename\",roll!$A$15))+1,31)&\"!\"&ADDRESS(MATCH(rn_05!$D$9,roll!C:C,0)+1,3,4)),ROW(B20)-1,0))","v":""},{"$f":"IF(ROW(B20)-1>=$C$14,\"\",OFFSET(INDIRECT(MID(CELL(\"filename\",roll!$A$15),FIND(\"]\",CELL(\"filename\",roll!$A$15))+1,31)&\"!\"&ADDRESS(MATCH(rn_05!$D$9,roll!C:C,0)+1,3,4)),ROW(B20)-1+SUM($B$14:$B$14),0))","v":""},{"$f":"IF(ROW(B20)-1>=$D$14,\"\",OFFSET(INDIRECT(MID(CELL(\"filename\",roll!$A$15),FIND(\"]\",CELL(\"filename\",roll!$A$15))+1,31)&\"!\"&ADDRESS(MATCH(rn_05!$D$9,roll!C:C,0)+1,3,4)),ROW(B20)-1+SUM($B$14:$C$14),0))","v":""},{"$f":"IF(ROW(B20)-1>=$E$14,\"\",OFFSET(INDIRECT(MID(CELL(\"filename\",roll!$A$15),FIND(\"]\",CELL(\"filename\",roll!$A$15))+1,31)&\"!\"&ADDRESS(MATCH(rn_05!$D$9,roll!C:C,0)+1,3,4)),ROW(B20)-1+SUM($B$14:$D$14),0))","v":""},""]
[]
[null,"परीक्षा प्रभारी",null,null,"केन्द्राधीक्षक "]
[null,{"$f":"rn_01!$B$37","v":"ASD (Lecturer)"},null,null,{"$f":"rn_01!$E$37","v":"XYZ (Principal)"}]

{"sheet":"rn_07","index":7,"n_rows":37,"n_cols":6,"rows_kept":37,"cut":false,"hidden":false,"merged":[[11,1,11,4],[0,1,0,4],[1,1,1,4],[2,1,2,4],[3,1,3,4],[4,1,4,4],[5,1,5,4],[7,1,7,4],[8,1,8,2],[8,3,8,4],[9,1,9,4],[10,1,10,4]]}
[null,{"$f":"rn_01!$B$1","v":"Class VIIITH Board Examination, 2025"}]
[null,"परीक्षा केंद्र नाम एवं परीक्षा केंद्र क्रमांक"]
[null,{"$f":"rn_01!$B$3","v":"GSSS Malutana (12345)"}]
[null,"परीक्षा कक्ष / हॉल क्रमांक"]
[null,{"$f":"rn_01!$K$7","v":7}]
[null,"परीक्षा दिनांक (दिवस) ... से ... तक"]
[null,{"$f":"rn_01!$B$7","v":"01-03-2025"},{"$f":"IF(B7=\"\",\"\",TEXT(B7,\"DDDD\"))","v":"Saturday"},{"$f":"rn_01!$D$7","v":"22-05-2025"},{"$f":"IF(D7=\"\",\"\",TEXT(D7,\"DDDD\"))","v":"Thursday"}]
[null,"परीक्षार्थी रोल नंबर ... से ... तक"]
[null,{"$f":"IF(B14>0,B15,IF(C14>0,C15,IF(D14>0,D15,IF(E14>0,E15,0))))","v":586},null,{"$f":"IF(E14>0,LOOKUP(2,1/(E15:E34<>\"\"),E15:E34),IF(D14>0,LOOKUP(2,1/(D15:D34<>\"\"),D15:D34),IF(C14>0,LOOKUP(2,1/(C15:C34<>\"\"),C15:C34),IF(B14>0,LOOKUP(2,1/(B15:B34<>\"\"),B15:B34),0))))","v":10104}]
[null,"कुल सम्मिलित परीक्षार्थी "]
[null,{"$f":"COUNTIF($B$15:$E$34,\">0\")","v":36}]
[null,"परीक्षार्थी बैठक व्यवस्था"]
[null,"पंक्ति 1","पंक्ति 2","पंक्ति 3","पंक्ति 4"]
[null,{"$f":"rn_01!L7","v":19},{"$f":"rn_01!M7","v":5},{"$f":"rn_01!N7","v":5},{"$f":"rn_01!O7","v":7}]
[null,{"$f":"IF(ROW(B1)-1>=$B$14,\"\",OFFSET(INDIRECT(MID(CELL(\"filename\",roll!$A$15),FIND(\"]\",CELL(\"filename\",roll!$A$15))+1,31)&\"!\"&ADDRESS(MATCH(rn_06!$D$9,roll!C:C,0)+1,3,4)),ROW(B1)-1,0))","v":586},{"$f":"IF(ROW(B1)-1>=$C$14,\"\",OFFSET(INDIRECT(MID(CELL(\"filename\",roll!$A$15),FIND(\"]\",CELL(\"filename\",roll!$A$15))+1,31)&\"!\"&ADDRESS(MATCH(rn_06!$D$9,roll!C:C,0)+1,3,4)),ROW(B1)-1+SUM($B$14:$B$14),0))","v":10096},{"$f":"IF(ROW(B1)-1>=$D$14,\"\",OFFSET(INDIRECT(MID(CELL(\"filename\",roll!$A$15),FIND(\"]\",CELL(\"filename\",roll!$A$15))+1,31)&\"!\"&ADDRESS(MATCH(rn_06!$D$9,roll!C:C,0)+1,3,4)),ROW(B1)-1+SUM($B$14:$C$14),0))","v":598},{"$f":"IF(ROW(B1)-1>=$E$14,\"\",OFFSET(INDIRECT(MID(CELL(\"filename\",roll!$A$15),FIND(\"]\",CELL(\"filename\",roll!$A$15))+1,31)&\"!\"&ADDRESS(MATCH(rn_06!$D$9,roll!C:C,0)+1,3,4)),ROW(B1)-1+SUM($B$14:$D$14),0))","v":10101},{"$f":"IF(SUM(B15:E15)>0,1,\"\")","v":1}]
[null,{"$f":"IF(ROW(B2)-1>=$B$14,\"\",OFFSET(INDIRECT(MID(CELL(\"filename\",roll!$A$15),FIND(\"]\",CELL(\"filename\",roll!$A$15))+1,31)&\"!\"&ADDRESS(MATCH(rn_06!$D$9,roll!C:C,0)+1,3,4)),ROW(B2)-1,0))","v":10087},{"$f":"IF(ROW(B2)-1>=$C$14,\"\",OFFSET(INDIRECT(MID(CELL(\"filename\",roll!$A$15),FIND(\"]\",CELL(\"filename\",roll!$A$15))+1,31)&\"!\"&ADDRESS(MATCH(rn_06!$D$9,roll!C:C,0)+1,3,4)),ROW(B2)-1+SUM($B$14:$B$14),0))","v":596},{"$f":"IF(ROW(B2)-1>=$D$14,\"\",OFFSET(INDIRECT(MID(CELL(\"filename\",roll!$A$15),FIND(\"]\",CELL(\"filename\",roll!$A$15))+1,31)&\"!\"&ADDRESS(MATCH(rn_06!$D$9,roll!C:C,0)+1,3,4)),ROW(B2)-1+SUM($B$14:$C$14),0))","v":10099},{"$f":"IF(ROW(B2)-1>=$E$14,\"\",OFFSET(INDIRECT(MID(CELL(\"filename\",roll!$A$15),FIND(\"]\",CELL(\"filename\",roll!$A$15))+1,31)&\"!\"&ADDRESS(MATCH(rn_06!$D$9,roll!C:C,0)+1,3,4)),ROW(B2)-1+SUM($B$14:$D$14),0))","v":601},{"$f":"IF(SUM(B16:E16)>0,1,\"\")","v":1}]
[null,{"$f":"IF(ROW(B3)-1>=$B$14,\"\",OFFSET(INDIRECT(MID(CELL(\"filename\",roll!$A$15),FIND(\"]\",CELL(\"filename\",roll!$A$15))+1,31)&\"!\"&ADDRESS(MATCH(rn_06!$D$9,roll!C:C,0)+1,3,4)),ROW(B3)-1,0))","v":587},{"$f":"IF(ROW(B3)-1>=$C$14,\"\",OFFSET(INDIRECT(MID(CELL(\"filename\",roll!$A$15),FIND(\"]\",CELL(\"filename\",roll!$A$15))+1,31)&\"!\"&ADDRESS(MATCH(rn_06!$D$9,roll!C:C,0)+1,3,4)),ROW(B3)-1+SUM($B$14:$B$14),0))","v":10097},{"$f":"IF(ROW(B3)-1>=$D$14,\"\",OFFSET(INDIRECT(MID(CELL(\"filename\",roll!$A$15),FIND(\"]\",CELL(\"filename\",roll!$A$15))+1,31)&\"!\"&ADDRESS(MATCH(rn_06!$D$9,roll!C:C,0)+1,3,4)),ROW(B3)-1+SUM($B$14:$C$14),0))","v":599},{"$f":"IF(ROW(B3)-1>=$E$14,\"\",OFFSET(INDIRECT(MID(CELL(\"filename\",roll!$A$15),FIND(\"]\",CELL(\"filename\",roll!$A$15))+1,31)&\"!\"&ADDRESS(MATCH(rn_06!$D$9,roll!C:C,0)+1,3,4)),ROW(B3)-1+SUM($B$14:$D$14),0))","v":10102},1]
[null,{"$f":"IF(ROW(B4)-1>=$B$14,\"\",OFFSET(INDIRECT(MID(CELL(\"filename\",roll!$A$15),FIND(\"]\",CELL(\"filename\",roll!$A$15))+1,31)&\"!\"&ADDRESS(MATCH(rn_06!$D$9,roll!C:C,0)+1,3,4)),ROW(B4)-1,0))","v":10088},{"$f":"IF(ROW(B4)-1>=$C$14,\"\",OFFSET(INDIRECT(MID(CELL(\"filename\",roll!$A$15),FIND(\"]\",CELL(\"filename\",roll!$A$15))+1,31)&\"!\"&ADDRESS(MATCH(rn_06!$D$9,roll!C:C,0)+1,3,4)),ROW(B4)-1+SUM($B$14:$B$14),0))","v":597},{"$f":"IF(ROW(B4)-1>=$D$14,\"\",OFFSET(INDIRECT(MID(CELL(\"filename\",roll!$A$15),FIND(\"]\",CELL(\"filename\",roll!$A$15))+1,31)&\"!\"&ADDRESS(MATCH(rn_06!$D$9,roll!C:C,0)+1,3,4)),ROW(B4)-1+SUM($B$14:$C$14),0))","v":10100},{"$f":"IF(ROW(B4)-1>=$E$14,\"\",OFFSET(INDIRECT(MID(CELL(\"filename\",roll!$A$15),FIND(\"]\",CELL(\"filename\",roll!$A$15))+1,31)&\"!\"&ADDRESS(MATCH(rn_06!$D$9,roll!C:C,0)+1,3,4)),ROW(B4)-1+SUM($B$14:$D$14),0))","v":602},1]
[null,{"$f":"IF(ROW(B5)-1>=$B$14,\"\",OFFSET(INDIRECT(MID(CELL(\"filename\",roll!$A$15),FIND(\"]\",CELL(\"filename\",roll!$A$15))+1,31)&\"!\"&ADDRESS(MATCH(rn_06!$D$9,roll!C:C,0)+1,3,4)),ROW(B5)-1,0))","v":588},{"$f":"IF(ROW(B5)-1>=$C$14,\"\",OFFSET(INDIRECT(MID(CELL(\"filename\",roll!$A$15),FIND(\"]\",CELL(\"filename\",roll!$A$15))+1,31)&\"!\"&ADDRESS(MATCH(rn_06!$D$9,roll!C:C,0)+1,3,4)),ROW(B5)-1+SUM($B$14:$B$14),0))","v":10098},{"$f":"IF(ROW(B5)-1>=$D$14,\"\",OFFSET(INDIRECT(MID(CELL(\"filename\",roll!$A$15),FIND(\"]\",CELL(\"filename\",roll!$A$15))+1,31)&\"!\"&ADDRESS(MATCH(rn_06!$D$9,roll!C:C,0)+1,3,4)),ROW(B5)-1+SUM($B$14:$C$14),0))","v":600},{"$f":"IF(ROW(B5)-1>=$E$14,\"\",OFFSET(INDIRECT(MID(CELL(\"filename\",roll!$A$15),FIND(\"]\",CELL(\"filename\",roll!$A$15))+1,31)&\"!\"&ADDRESS(MATCH(rn_06!$D$9,roll!C:C,0)+1,3,4)),ROW(B5)-1+SUM($B$14:$D$14),0))","v":10103},1]
[null,{"$f":"IF(ROW(B6)-1>=$B$14,\"\",OFFSET(INDIRECT(MID(CELL(\"filename\",roll!$A$15),FIND(\"]\",CELL(\"filename\",roll!$A$15))+1,31)&\"!\"&ADDRESS(MATCH(rn_06!$D$9,roll!C:C,0)+1,3,4)),ROW(B6)-1,0))","v":10089},{"$f":"IF(ROW(B6)-1>=$C$14,\"\",OFFSET(INDIRECT(MID(CELL(\"filename\",roll!$A$15),FIND(\"]\",CELL(\"filename\",roll!$A$15))+1,31)&\"!\"&ADDRESS(MATCH(rn_06!$D$9,roll!C:C,0)+1,3,4)),ROW(B6)-1+SUM($B$14:$B$14),0))","v":""},{"$f":"IF(ROW(B6)-1>=$D$14,\"\",OFFSET(INDIRECT(MID(CELL(\"filename\",roll!$A$15),FIND(\"]\",CELL(\"filename\",roll!$A$15))+1,31)&\"!\"&ADDRESS(MATCH(rn_06!$D$9,roll!C:C,0)+1,3,4)),ROW(B6)-1+SUM($B$14:$C$14),0))","v":""},{"$f":"IF(ROW(B6)-1>=$E$14,\"\",OFFSET(INDIRECT(MID(CELL(\"filename\",roll!$A$15),FIND(\"]\",CELL(\"filename\",roll!$A$15))+1,31)&\"!\"&ADDRESS(MATCH(rn_06!$D$9,roll!C:C,0)+1,3,4)),ROW(B6)-1+SUM($B$14:$D$14),0))","v":603},1]
[null,{"$f":"IF(ROW(B7)-1>=$B$14,\"\",OFFSET(INDIRECT(MID(CELL(\"filename\",roll!$A$15),FIND(\"]\",CELL(\"filename\",roll!$A$15))+1,31)&\"!\"&ADDRESS(MATCH(rn_06!$D$9,roll!C:C,0)+1,3,4)),ROW(B7)-1,0))","v":589},{"$f":"IF(ROW(B7)-1>=$C$14,\"\",OFFSET(INDIRECT(MID(CELL(\"filename\",roll!$A$15),FIND(\"]\",CELL(\"filename\",roll!$A$15))+1,31)&\"!\"&ADDRESS(MATCH(rn_06!$D$9,roll!C:C,0)+1,3,4)),ROW(B7)-1+SUM($B$14:$B$14),0))","v":""},{"$f":"IF(ROW(B7)-1>=$D$14,\"\",OFFSET(INDIRECT(MID(CELL(\"filename\",roll!$A$15),FIND(\"]\",CELL(\"filename\",roll!$A$15))+1,31)&\"!\"&ADDRESS(MATCH(rn_06!$D$9,roll!C:C,0)+1,3,4)),ROW(B7)-1+SUM($B$14:$C$14),0))","v":""},{"$f":"IF(ROW(B7)-1>=$E$14,\"\",OFFSET(INDIRECT(MID(CELL(\"filename\",roll!$A$15),FIND(\"]\",CELL(\"filename\",roll!$A$15))+1,31)&\"!\"&ADDRESS(MATCH(rn_06!$D$9,roll!C:C,0)+1,3,4)),ROW(B7)-1+SUM($B$14:$D$14),0))","v":10104},1]
[null,{"$f":"IF(ROW(B8)-1>=$B$14,\"\",OFFSET(INDIRECT(MID(CELL(\"filename\",roll!$A$15),FIND(\"]\",CELL(\"filename\",roll!$A$15))+1,31)&\"!\"&ADDRESS(MATCH(rn_06!$D$9,roll!C:C,0)+1,3,4)),ROW(B8)-1,0))","v":10090},{"$f":"IF(ROW(B8)-1>=$C$14,\"\",OFFSET(INDIRECT(MID(CELL(\"filename\",roll!$A$15),FIND(\"]\",CELL(\"filename\",roll!$A$15))+1,31)&\"!\"&ADDRESS(MATCH(rn_06!$D$9,roll!C:C,0)+1,3,4)),ROW(B8)-1+SUM($B$14:$B$14),0))","v":""},{"$f":"IF(ROW(B8)-1>=$D$14,\"\",OFFSET(INDIRECT(MID(CELL(\"filename\",roll!$A$15),FIND(\"]\",CELL(\"filename\",roll!$A$15))+1,31)&\"!\"&ADDRESS(MATCH(rn_06!$D$9,roll!C:C,0)+1,3,4)),ROW(B8)-1+SUM($B$14:$C$14),0))","v":""},{"$f":"IF(ROW(B8)-1>=$E$14,\"\",OFFSET(INDIRECT(MID(CELL(\"filename\",roll!$A$15),FIND(\"]\",CELL(\"filename\",roll!$A$15))+1,31)&\"!\"&ADDRESS(MATCH(rn_06!$D$9,roll!C:C,0)+1,3,4)),ROW(B8)-1+SUM($B$14:$D$14),0))","v":""},1]
[null,{"$f":"IF(ROW(B9)-1>=$B$14,\"\",OFFSET(INDIRECT(MID(CELL(\"filename\",roll!$A$15),FIND(\"]\",CELL(\"filename\",roll!$A$15))+1,31)&\"!\"&ADDRESS(MATCH(rn_06!$D$9,roll!C:C,0)+1,3,4)),ROW(B9)-1,0))","v":590},{"$f":"IF(ROW(B9)-1>=$C$14,\"\",OFFSET(INDIRECT(MID(CELL(\"filename\",roll!$A$15),FIND(\"]\",CELL(\"filename\",roll!$A$15))+1,31)&\"!\"&ADDRESS(MATCH(rn_06!$D$9,roll!C:C,0)+1,3,4)),ROW(B9)-1+SUM($B$14:$B$14),0))","v":""},{"$f":"IF(ROW(B9)-1>=$D$14,\"\",OFFSET(INDIRECT(MID(CELL(\"filename\",roll!$A$15),FIND(\"]\",CELL(\"filename\",roll!$A$15))+1,31)&\"!\"&ADDRESS(MATCH(rn_06!$D$9,roll!C:C,0)+1,3,4)),ROW(B9)-1+SUM($B$14:$C$14),0))","v":""},{"$f":"IF(ROW(B9)-1>=$E$14,\"\",OFFSET(INDIRECT(MID(CELL(\"filename\",roll!$A$15),FIND(\"]\",CELL(\"filename\",roll!$A$15))+1,31)&\"!\"&ADDRESS(MATCH(rn_06!$D$9,roll!C:C,0)+1,3,4)),ROW(B9)-1+SUM($B$14:$D$14),0))","v":""},1]
[null,{"$f":"IF(ROW(B10)-1>=$B$14,\"\",OFFSET(INDIRECT(MID(CELL(\"filename\",roll!$A$15),FIND(\"]\",CELL(\"filename\",roll!$A$15))+1,31)&\"!\"&ADDRESS(MATCH(rn_06!$D$9,roll!C:C,0)+1,3,4)),ROW(B10)-1,0))","v":10091},{"$f":"IF(ROW(B10)-1>=$C$14,\"\",OFFSET(INDIRECT(MID(CELL(\"filename\",roll!$A$15),FIND(\"]\",CELL(\"filename\",roll!$A$15))+1,31)&\"!\"&ADDRESS(MATCH(rn_06!$D$9,roll!C:C,0)+1,3,4)),ROW(B10)-1+SUM($B$14:$B$14),0))","v":""},{"$f":"IF(ROW(B10)-1>=$D$14,\"\",OFFSET(INDIRECT(MID(CELL(\"filename\",roll!$A$15),FIND(\"]\",CELL(\"filename\",roll!$A$15))+1,31)&\"!\"&ADDRESS(MATCH(rn_06!$D$9,roll!C:C,0)+1,3,4)),ROW(B10)-1+SUM($B$14:$C$14),0))","v":""},{"$f":"IF(ROW(B10)-1>=$E$14,\"\",OFFSET(INDIRECT(MID(CELL(\"filename\",roll!$A$15),FIND(\"]\",CELL(\"filename\",roll!$A$15))+1,31)&\"!\"&ADDRESS(MATCH(rn_06!$D$9,roll!C:C,0)+1,3,4)),ROW(B10)-1+SUM($B$14:$D$14),0))","v":""},1]
[null,{"$f":"IF(ROW(B11)-1>=$B$14,\"\",OFFSET(INDIRECT(MID(CELL(\"filename\",roll!$A$15),FIND(\"]\",CELL(\"filename\",roll!$A$15))+1,31)&\"!\"&ADDRESS(MATCH(rn_06!$D$9,roll!C:C,0)+1,3,4)),ROW(B11)-1,0))","v":591},{"$f":"IF(ROW(B11)-1>=$C$14,\"\",OFFSET(INDIRECT(MID(CELL(\"filename\",roll!$A$15),FIND(\"]\",CELL(\"filename\",roll!$A$15))+1,31)&\"!\"&ADDRESS(MATCH(rn_06!$D$9,roll!C:C,0)+1,3,4)),ROW(B11)-1+SUM($B$14:$B$14),0))","v":""},{"$f":"IF(ROW(B11)-1>=$D$14,\"\",OFFSET(INDIRECT(MID(CELL(\"filename\",roll!$A$15),FIND(\"]\",CELL(\"filename\",roll!$A$15))+1,31)&\"!\"&ADDRESS(MATCH(rn_06!$D$9,roll!C:C,0)+1,3,4)),ROW(B11)-1+SUM($B$14:$C$14),0))","v":""},{"$f":"IF(ROW(B11)-1>=$E$14,\"\",OFFSET(INDIRECT(MID(CELL(\"filename\",roll!$A$15),FIND(\"]\",CELL(\"filename\",roll!$A$15))+1,31)&\"!\"&ADDRESS(MATCH(rn_06!$D$9,roll!C:C,0)+1,3,4)),ROW(B11)-1+SUM($B$14:$D$14),0))","v":""},1]
[null,{"$f":"IF(ROW(B12)-1>=$B$14,\"\",OFFSET(INDIRECT(MID(CELL(\"filename\",roll!$A$15),FIND(\"]\",CELL(\"filename\",roll!$A$15))+1,31)&\"!\"&ADDRESS(MATCH(rn_06!$D$9,roll!C:C,0)+1,3,4)),ROW(B12)-1,0))","v":10092},{"$f":"IF(ROW(B12)-1>=$C$14,\"\",OFFSET(INDIRECT(MID(CELL(\"filename\",roll!$A$15),FIND(\"]\",CELL(\"filename\",roll!$A$15))+1,31)&\"!\"&ADDRESS(MATCH(rn_06!$D$9,roll!C:C,0)+1,3,4)),ROW(B12)-1+SUM($B$14:$B$14),0))","v":""},{"$f":"IF(ROW(B12)-1>=$D$14,\"\",OFFSET(INDIRECT(MID(CELL(\"filename\",roll!$A$15),FIND(\"]\",CELL(\"filename\",roll!$A$15))+1,31)&\"!\"&ADDRESS(MATCH(rn_06!$D$9,roll!C:C,0)+1,3,4)),ROW(B12)-1+SUM($B$14:$C$14),0))","v":""},{"$f":"IF(ROW(B12)-1>=$E$14,\"\",OFFSET(INDIRECT(MID(CELL(\"filename\",roll!$A$15),FIND(\"]\",CELL(\"filename\",roll!$A$15))+1,31)&\"!\"&ADDRESS(MATCH(rn_06!$D$9,roll!C:C,0)+1,3,4)),ROW(B12)-1+SUM($B$14:$D$14),0))","v":""},1]
[null,{"$f":"IF(ROW(B13)-1>=$B$14,\"\",OFFSET(INDIRECT(MID(CELL(\"filename\",roll!$A$15),FIND(\"]\",CELL(\"filename\",roll!$A$15))+1,31)&\"!\"&ADDRESS(MATCH(rn_06!$D$9,roll!C:C,0)+1,3,4)),ROW(B13)-1,0))","v":592},{"$f":"IF(ROW(B13)-1>=$C$14,\"\",OFFSET(INDIRECT(MID(CELL(\"filename\",roll!$A$15),FIND(\"]\",CELL(\"filename\",roll!$A$15))+1,31)&\"!\"&ADDRESS(MATCH(rn_06!$D$9,roll!C:C,0)+1,3,4)),ROW(B13)-1+SUM($B$14:$B$14),0))","v":""},{"$f":"IF(ROW(B13)-1>=$D$14,\"\",OFFSET(INDIRECT(MID(CELL(\"filename\",roll!$A$15),FIND(\"]\",CELL(\"filename\",roll!$A$15))+1,31)&\"!\"&ADDRESS(MATCH(rn_06!$D$9,roll!C:C,0)+1,3,4)),ROW(B13)-1+SUM($B$14:$C$14),0))","v":""},{"$f":"IF(ROW(B13)-1>=$E$14,\"\",OFFSET(INDIRECT(MID(CELL(\"filename\",roll!$A$15),FIND(\"]\",CELL(\"filename\",roll!$A$15))+1,31)&\"!\"&ADDRESS(MATCH(rn_06!$D$9,roll!C:C,0)+1,3,4)),ROW(B13)-1+SUM($B$14:$D$14),0))","v":""},1]
[null,{"$f":"IF(ROW(B14)-1>=$B$14,\"\",OFFSET(INDIRECT(MID(CELL(\"filename\",roll!$A$15),FIND(\"]\",CELL(\"filename\",roll!$A$15))+1,31)&\"!\"&ADDRESS(MATCH(rn_06!$D$9,roll!C:C,0)+1,3,4)),ROW(B14)-1,0))","v":10093},{"$f":"IF(ROW(B14)-1>=$C$14,\"\",OFFSET(INDIRECT(MID(CELL(\"filename\",roll!$A$15),FIND(\"]\",CELL(\"filename\",roll!$A$15))+1,31)&\"!\"&ADDRESS(MATCH(rn_06!$D$9,roll!C:C,0)+1,3,4)),ROW(B14)-1+SUM($B$14:$B$14),0))","v":""},{"$f":"IF(ROW(B14)-1>=$D$14,\"\",OFFSET(INDIRECT(MID(CELL(\"filename\",roll!$A$15),FIND(\"]\",CELL(\"filename\",roll!$A$15))+1,31)&\"!\"&ADDRESS(MATCH(rn_06!$D$9,roll!C:C,0)+1,3,4)),ROW(B14)-1+SUM($B$14:$C$14),0))","v":""},{"$f":"IF(ROW(B14)-1>=$E$14,\"\",OFFSET(INDIRECT(MID(CELL(\"filename\",roll!$A$15),FIND(\"]\",CELL(\"filename\",roll!$A$15))+1,31)&\"!\"&ADDRESS(MATCH(rn_06!$D$9,roll!C:C,0)+1,3,4)),ROW(B14)-1+SUM($B$14:$D$14),0))","v":""},1]
[null,{"$f":"IF(ROW(B15)-1>=$B$14,\"\",OFFSET(INDIRECT(MID(CELL(\"filename\",roll!$A$15),FIND(\"]\",CELL(\"filename\",roll!$A$15))+1,31)&\"!\"&ADDRESS(MATCH(rn_06!$D$9,roll!C:C,0)+1,3,4)),ROW(B15)-1,0))","v":593},{"$f":"IF(ROW(B15)-1>=$C$14,\"\",OFFSET(INDIRECT(MID(CELL(\"filename\",roll!$A$15),FIND(\"]\",CELL(\"filename\",roll!$A$15))+1,31)&\"!\"&ADDRESS(MATCH(rn_06!$D$9,roll!C:C,0)+1,3,4)),ROW(B15)-1+SUM($B$14:$B$14),0))","v":""},{"$f":"IF(ROW(B15)-1>=$D$14,\"\",OFFSET(INDIRECT(MID(CELL(\"filename\",roll!$A$15),FIND(\"]\",CELL(\"filename\",roll!$A$15))+1,31)&\"!\"&ADDRESS(MATCH(rn_06!$D$9,roll!C:C,0)+1,3,4)),ROW(B15)-1+SUM($B$14:$C$14),0))","v":""},{"$f":"IF(ROW(B15)-1>=$E$14,\"\",OFFSET(INDIRECT(MID(CELL(\"filename\",roll!$A$15),FIND(\"]\",CELL(\"filename\",roll!$A$15))+1,31)&\"!\"&ADDRESS(MATCH(rn_06!$D$9,roll!C:C,0)+1,3,4)),ROW(B15)-1+SUM($B$14:$D$14),0))","v":""},1]
[null,{"$f":"IF(ROW(B16)-1>=$B$14,\"\",OFFSET(INDIRECT(MID(CELL(\"filename\",roll!$A$15),FIND(\"]\",CELL(\"filename\",roll!$A$15))+1,31)&\"!\"&ADDRESS(MATCH(rn_06!$D$9,roll!C:C,0)+1,3,4)),ROW(B16)-1,0))","v":10094},{"$f":"IF(ROW(B16)-1>=$C$14,\"\",OFFSET(INDIRECT(MID(CELL(\"filename\",roll!$A$15),FIND(\"]\",CELL(\"filename\",roll!$A$15))+1,31)&\"!\"&ADDRESS(MATCH(rn_06!$D$9,roll!C:C,0)+1,3,4)),ROW(B16)-1+SUM($B$14:$B$14),0))","v":""},{"$f":"IF(ROW(B16)-1>=$D$14,\"\",OFFSET(INDIRECT(MID(CELL(\"filename\",roll!$A$15),FIND(\"]\",CELL(\"filename\",roll!$A$15))+1,31)&\"!\"&ADDRESS(MATCH(rn_06!$D$9,roll!C:C,0)+1,3,4)),ROW(B16)-1+SUM($B$14:$C$14),0))","v":""},{"$f":"IF(ROW(B16)-1>=$E$14,\"\",OFFSET(INDIRECT(MID(CELL(\"filename\",roll!$A$15),FIND(\"]\",CELL(\"filename\",roll!$A$15))+1,31)&\"!\"&ADDRESS(MATCH(rn_06!$D$9,roll!C:C,0)+1,3,4)),ROW(B16)-1+SUM($B$14:$D$14),0))","v":""},1]
[null,{"$f":"IF(ROW(B17)-1>=$B$14,\"\",OFFSET(INDIRECT(MID(CELL(\"filename\",roll!$A$15),FIND(\"]\",CELL(\"filename\",roll!$A$15))+1,31)&\"!\"&ADDRESS(MATCH(rn_06!$D$9,roll!C:C,0)+1,3,4)),ROW(B17)-1,0))","v":594},{"$f":"IF(ROW(B17)-1>=$C$14,\"\",OFFSET(INDIRECT(MID(CELL(\"filename\",roll!$A$15),FIND(\"]\",CELL(\"filename\",roll!$A$15))+1,31)&\"!\"&ADDRESS(MATCH(rn_06!$D$9,roll!C:C,0)+1,3,4)),ROW(B17)-1+SUM($B$14:$B$14),0))","v":""},{"$f":"IF(ROW(B17)-1>=$D$14,\"\",OFFSET(INDIRECT(MID(CELL(\"filename\",roll!$A$15),FIND(\"]\",CELL(\"filename\",roll!$A$15))+1,31)&\"!\"&ADDRESS(MATCH(rn_06!$D$9,roll!C:C,0)+1,3,4)),ROW(B17)-1+SUM($B$14:$C$14),0))","v":""},{"$f":"IF(ROW(B17)-1>=$E$14,\"\",OFFSET(INDIRECT(MID(CELL(\"filename\",roll!$A$15),FIND(\"]\",CELL(\"filename\",roll!$A$15))+1,31)&\"!\"&ADDRESS(MATCH(rn_06!$D$9,roll!C:C,0)+1,3,4)),ROW(B17)-1+SUM($B$14:$D$14),0))","v":""},1]
[null,{"$f":"IF(ROW(B18)-1>=$B$14,\"\",OFFSET(INDIRECT(MID(CELL(\"filename\",roll!$A$15),FIND(\"]\",CELL(\"filename\",roll!$A$15))+1,31)&\"!\"&ADDRESS(MATCH(rn_06!$D$9,roll!C:C,0)+1,3,4)),ROW(B18)-1,0))","v":10095},{"$f":"IF(ROW(B18)-1>=$C$14,\"\",OFFSET(INDIRECT(MID(CELL(\"filename\",roll!$A$15),FIND(\"]\",CELL(\"filename\",roll!$A$15))+1,31)&\"!\"&ADDRESS(MATCH(rn_06!$D$9,roll!C:C,0)+1,3,4)),ROW(B18)-1+SUM($B$14:$B$14),0))","v":""},{"$f":"IF(ROW(B18)-1>=$D$14,\"\",OFFSET(INDIRECT(MID(CELL(\"filename\",roll!$A$15),FIND(\"]\",CELL(\"filename\",roll!$A$15))+1,31)&\"!\"&ADDRESS(MATCH(rn_06!$D$9,roll!C:C,0)+1,3,4)),ROW(B18)-1+SUM($B$14:$C$14),0))","v":""},{"$f":"IF(ROW(B18)-1>=$E$14,\"\",OFFSET(INDIRECT(MID(CELL(\"filename\",roll!$A$15),FIND(\"]\",CELL(\"filename\",roll!$A$15))+1,31)&\"!\"&ADDRESS(MATCH(rn_06!$D$9,roll!C:C,0)+1,3,4)),ROW(B18)-1+SUM($B$14:$D$14),0))","v":""},1]
[null,{"$f":"IF(ROW(B19)-1>=$B$14,\"\",OFFSET(INDIRECT(MID(CELL(\"filename\",roll!$A$15),FIND(\"]\",CELL(\"filename\",roll!$A$15))+1,31)&\"!\"&ADDRESS(MATCH(rn_06!$D$9,roll!C:C,0)+1,3,4)),ROW(B19)-1,0))","v":595},{"$f":"IF(ROW(B19)-1>=$C$14,\"\",OFFSET(INDIRECT(MID(CELL(\"filename\",roll!$A$15),FIND(\"]\",CELL(\"filename\",roll!$A$15))+1,31)&\"!\"&ADDRESS(MATCH(rn_06!$D$9,roll!C:C,0)+1,3,4)),ROW(B19)-1+SUM($B$14:$B$14),0))","v":""},{"$f":"IF(ROW(B19)-1>=$D$14,\"\",OFFSET(INDIRECT(MID(CELL(\"filename\",roll!$A$15),FIND(\"]\",CELL(\"filename\",roll!$A$15))+1,31)&\"!\"&ADDRESS(MATCH(rn_06!$D$9,roll!C:C,0)+1,3,4)),ROW(B19)-1+SUM($B$14:$C$14),0))","v":""},{"$f":"IF(ROW(B19)-1>=$E$14,\"\",OFFSET(INDIRECT(MID(CELL(\"filename\",roll!$A$15),FIND(\"]\",CELL(\"filename\",roll!$A$15))+1,31)&\"!\"&ADDRESS(MATCH(rn_06!$D$9,roll!C:C,0)+1,3,4)),ROW(B19)-1+SUM($B$14:$D$14),0))","v":""},1]
[null,{"$f":"IF(ROW(B20)-1>=$B$14,\"\",OFFSET(INDIRECT(MID(CELL(\"filename\",roll!$A$15),FIND(\"]\",CELL(\"filename\",roll!$A$15))+1,31)&\"!\"&ADDRESS(MATCH(rn_06!$D$9,roll!C:C,0)+1,3,4)),ROW(B20)-1,0))","v":""},{"$f":"IF(ROW(B20)-1>=$C$14,\"\",OFFSET(INDIRECT(MID(CELL(\"filename\",roll!$A$15),FIND(\"]\",CELL(\"filename\",roll!$A$15))+1,31)&\"!\"&ADDRESS(MATCH(rn_06!$D$9,roll!C:C,0)+1,3,4)),ROW(B20)-1+SUM($B$14:$B$14),0))","v":""},{"$f":"IF(ROW(B20)-1>=$D$14,\"\",OFFSET(INDIRECT(MID(CELL(\"filename\",roll!$A$15),FIND(\"]\",CELL(\"filename\",roll!$A$15))+1,31)&\"!\"&ADDRESS(MATCH(rn_06!$D$9,roll!C:C,0)+1,3,4)),ROW(B20)-1+SUM($B$14:$C$14),0))","v":""},{"$f":"IF(ROW(B20)-1>=$E$14,\"\",OFFSET(INDIRECT(MID(CELL(\"filename\",roll!$A$15),FIND(\"]\",CELL(\"filename\",roll!$A$15))+1,31)&\"!\"&ADDRESS(MATCH(rn_06!$D$9,roll!C:C,0)+1,3,4)),ROW(B20)-1+SUM($B$14:$D$14),0))","v":""},""]
[]
[null,"परीक्षा प्रभारी",null,null,"केन्द्राधीक्षक "]
[null,{"$f":"rn_01!$B$37","v":"ASD (Lecturer)"},null,null,{"$f":"rn_01!$E$37","v":"XYZ (Principal)"}]

{"sheet":"rn_08","index":8,"n_rows":37,"n_cols":6,"rows_kept":37,"cut":false,"hidden":false,"merged":[[11,1,11,4],[0,1,0,4],[1,1,1,4],[2,1,2,4],[3,1,3,4],[4,1,4,4],[5,1,5,4],[7,1,7,4],[8,1,8,2],[8,3,8,4],[9,1,9,4],[10,1,10,4]]}
[null,{"$f":"rn_01!$B$1","v":"Class VIIITH Board Examination, 2025"}]
[null,"परीक्षा केंद्र नाम एवं परीक्षा केंद्र क्रमांक"]
[null,{"$f":"rn_01!$B$3","v":"GSSS Malutana (12345)"}]
[null,"परीक्षा कक्ष / हॉल क्रमांक"]
[null,{"$f":"rn_01!$K$8","v":8}]
[null,"परीक्षा दिनांक (दिवस) ... से ... तक"]
[null,{"$f":"rn_01!$B$7","v":"01-03-2025"},{"$f":"IF(B7=\"\",\"\",TEXT(B7,\"DDDD\"))","v":"Saturday"},{"$f":"rn_01!$D$7","v":"22-05-2025"},{"$f":"IF(D7=\"\",\"\",TEXT(D7,\"DDDD\"))","v":"Thursday"}]
[null,"परीक्षार्थी रोल नंबर ... से ... तक"]
[null,{"$f":"IF(B14>0,B15,IF(C14>0,C15,IF(D14>0,D15,IF(E14>0,E15,0))))","v":604},null,{"$f":"IF(E14>0,LOOKUP(2,1/(E15:E34<>\"\"),E15:E34),IF(D14>0,LOOKUP(2,1/(D15:D34<>\"\"),D15:D34),IF(C14>0,LOOKUP(2,1/(C15:C34<>\"\"),C15:C34),IF(B14>0,LOOKUP(2,1/(B15:B34<>\"\"),B15:B34),0))))","v":10127}]
[null,"कुल सम्मिलित परीक्षार्थी "]
[null,{"$f":"COUNTIF($B$15:$E$34,\">0\")","v":46}]
[null,"परीक्षार्थी बैठक व्यवस्था"]
[null,"पंक्ति 1","पंक्ति 2","पंक्ति 3","पंक्ति 4"]
[null,{"$f":"rn_01!L8","v":20},{"$f":"rn_01!M8","v":3},{"$f":"rn_01!N8","v":3},{"$f":"rn_01!O8","v":20}]
[null,{"$f":"IF(ROW(B1)-1>=$B$14,\"\",OFFSET(INDIRECT(MID(CELL(\"filename\",roll!$A$15),FIND(\"]\",CELL(\"filename\",roll!$A$15))+1,31)&\"!\"&ADDRESS(MATCH(rn_07!$D$9,roll!C:C,0)+1,3,4)),ROW(B1)-1,0))","v":604},{"$f":"IF(ROW(B1)-1>=$C$14,\"\",OFFSET(INDIRECT(MID(CELL(\"filename\",roll!$A$15),FIND(\"]\",CELL(\"filename\",roll!$A$15))+1,31)&\"!\"&ADDRESS(MATCH(rn_07!$D$9,roll!C:C,0)+1,3,4)),ROW(B1)-1+SUM($B$14:$B$14),0))","v":614},{"$f":"IF(ROW(B1)-1>=$D$14,\"\",OFFSET(INDIRECT(MID(CELL(\"filename\",roll!$A$15),FIND(\"]\",CELL(\"filename\",roll!$A$15))+1,31)&\"!\"&ADDRESS(MATCH(rn_07!$D$9,roll!C:C,0)+1,3,4)),ROW(B1)-1+SUM($B$14:$C$14),0))","v":10116},{"$f":"IF(ROW(B1)-1>=$E$14,\"\",OFFSET(INDIRECT(MID(CELL(\"filename\",roll!$A$15),FIND(\"]\",CELL(\"filename\",roll!$A$15))+1,31)&\"!\"&ADDRESS(MATCH(rn_07!$D$9,roll!C:C,0)+1,3,4)),ROW(B1)-1+SUM($B$14:$D$14),0))","v":617},{"$f":"IF(SUM(B15:E15)>0,1,\"\")","v":1}]
[null,{"$f":"IF(ROW(B2)-1>=$B$14,\"\",OFFSET(INDIRECT(MID(CELL(\"filename\",roll!$A$15),FIND(\"]\",CELL(\"filename\",roll!$A$15))+1,31)&\"!\"&ADDRESS(MATCH(rn_07!$D$9,roll!C:C,0)+1,3,4)),ROW(B2)-1,0))","v":10105},{"$f":"IF(ROW(B2)-1>=$C$14,\"\",OFFSET(INDIRECT(MID(CELL(\"filename\",roll!$A$15),FIND(\"]\",CELL(\"filename\",roll!$A$15))+1,31)&\"!\"&ADDRESS(MATCH(rn_07!$D$9,roll!C:C,0)+1,3,4)),ROW(B2)-1+SUM($B$14:$B$14),0))","v":10115},{"$f":"IF(ROW(B2)-1>=$D$14,\"\",OFFSET(INDIRECT(MID(CELL(\"filename\",roll!$A$15),FIND(\"]\",CELL(\"filename\",roll!$A$15))+1,31)&\"!\"&ADDRESS(MATCH(rn_07!$D$9,roll!C:C,0)+1,3,4)),ROW(B2)-1+SUM($B$14:$C$14),0))","v":616},{"$f":"IF(ROW(B2)-1>=$E$14,\"\",OFFSET(INDIRECT(MID(CELL(\"filename\",roll!$A$15),FIND(\"]\",CELL(\"filename\",roll!$A$15))+1,31)&\"!\"&ADDRESS(MATCH(rn_07!$D$9,roll!C:C,0)+1,3,4)),ROW(B2)-1+SUM($B$14:$D$14),0))","v":10118},{"$f":"IF(SUM(B16:E16)>0,1,\"\")","v":1}]
[null,{"$f":"IF(ROW(B3)-1>=$B$14,\"\",OFFSET(INDIRECT(MID(CELL(\"filename\",roll!$A$15),FIND(\"]\",CELL(\"filename\",roll!$A$15))+1,31)&\"!\"&ADDRESS(MATCH(rn_07!$D$9,roll!C:C,0)+1,3,4)),ROW(B3)-1,0))","v":605},{"$f":"IF(ROW(B3)-1>=$C$14,\"\",OFFSET(INDIRECT(MID(CELL(\"filename\",roll!$A$15),FIND(\"]\",CELL(\"filename\",roll!$A$15))+1,31)&\"!\"&ADDRESS(MATCH(rn_07!$D$9,roll!C:C,0)+1,3,4)),ROW(B3)-1+SUM($B$14:$B$14),0))","v":615},{"$f":"IF(ROW(B3)-1>=$D$14,\"\",OFFSET(INDIRECT(MID(CELL(\"filename\",roll!$A$15),FIND(\"]\",CELL(\"filename\",roll!$A$15))+1,31)&\"!\"&ADDRESS(MATCH(rn_07!$D$9,roll!C:C,0)+1,3,4)),ROW(B3)-1+SUM($B$14:$C$14),0))","v":10117},{"$f":"IF(ROW(B3)-1>=$E$14,\"\",OFFSET(INDIRECT(MID(CELL(\"filename\",roll!$A$15),FIND(\"]\",CELL(\"filename\",roll!$A$15))+1,31)&\"!\"&ADDRESS(MATCH(rn_07!$D$9,roll!C:C,0)+1,3,4)),ROW(B3)-1+SUM($B$14:$D$14),0))","v":618},1]
[null,{"$f":"IF(ROW(B4)-1>=$B$14,\"\",OFFSET(INDIRECT(MID(CELL(\"filename\",roll!$A$15),FIND(\"]\",CELL(\"filename\",roll!$A$15))+1,31)&\"!\"&ADDRESS(MATCH(rn_07!$D$9,roll!C:C,0)+1,3,4)),ROW(B4)-1,0))","v":10106},{"$f":"IF(ROW(B4)-1>=$C$14,\"\",OFFSET(INDIRECT(MID(CELL(\"filename\",roll!$A$15),FIND(\"]\",CELL(\"filename\",roll!$A$15))+1,31)&\"!\"&ADDRESS(MATCH(rn_07!$D$9,roll!C:C,0)+1,3,4)),ROW(B4)-1+SUM($B$14:$B$14),0))","v":""},{"$f":"IF(ROW(B4)-1>=$D$14,\"\",OFFSET(INDIRECT(MID(CELL(\"filename\",roll!$A$15),FIND(\"]\",CELL(\"filename\",roll!$A$15))+1,31)&\"!\"&ADDRESS(MATCH(rn_07!$D$9,roll!C:C,0)+1,3,4)),ROW(B4)-1+SUM($B$14:$C$14),0))","v":""},{"$f":"IF(ROW(B4)-1>=$E$14,\"\",OFFSET(INDIRECT(MID(CELL(\"filename\",roll!$A$15),FIND(\"]\",CELL(\"filename\",roll!$A$15))+1,31)&\"!\"&ADDRESS(MATCH(rn_07!$D$9,roll!C:C,0)+1,3,4)),ROW(B4)-1+SUM($B$14:$D$14),0))","v":10119},1]
[null,{"$f":"IF(ROW(B5)-1>=$B$14,\"\",OFFSET(INDIRECT(MID(CELL(\"filename\",roll!$A$15),FIND(\"]\",CELL(\"filename\",roll!$A$15))+1,31)&\"!\"&ADDRESS(MATCH(rn_07!$D$9,roll!C:C,0)+1,3,4)),ROW(B5)-1,0))","v":606},{"$f":"IF(ROW(B5)-1>=$C$14,\"\",OFFSET(INDIRECT(MID(CELL(\"filename\",roll!$A$15),FIND(\"]\",CELL(\"filename\",roll!$A$15))+1,31)&\"!\"&ADDRESS(MATCH(rn_07!$D$9,roll!C:C,0)+1,3,4)),ROW(B5)-1+SUM($B$14:$B$14),0))","v":""},{"$f":"IF(ROW(B5)-1>=$D$14,\"\",OFFSET(INDIRECT(MID(CELL(\"filename\",roll!$A$15),FIND(\"]\",CELL(\"filename\",roll!$A$15))+1,31)&\"!\"&ADDRESS(MATCH(rn_07!$D$9,roll!C:C,0)+1,3,4)),ROW(B5)-1+SUM($B$14:$C$14),0))","v":""},{"$f":"IF(ROW(B5)-1>=$E$14,\"\",OFFSET(INDIRECT(MID(CELL(\"filename\",roll!$A$15),FIND(\"]\",CELL(\"filename\",roll!$A$15))+1,31)&\"!\"&ADDRESS(MATCH(rn_07!$D$9,roll!C:C,0)+1,3,4)),ROW(B5)-1+SUM($B$14:$D$14),0))","v":619},1]
[null,{"$f":"IF(ROW(B6)-1>=$B$14,\"\",OFFSET(INDIRECT(MID(CELL(\"filename\",roll!$A$15),FIND(\"]\",CELL(\"filename\",roll!$A$15))+1,31)&\"!\"&ADDRESS(MATCH(rn_07!$D$9,roll!C:C,0)+1,3,4)),ROW(B6)-1,0))","v":10107},{"$f":"IF(ROW(B6)-1>=$C$14,\"\",OFFSET(INDIRECT(MID(CELL(\"filename\",roll!$A$15),FIND(\"]\",CELL(\"filename\",roll!$A$15))+1,31)&\"!\"&ADDRESS(MATCH(rn_07!$D$9,roll!C:C,0)+1,3,4)),ROW(B6)-1+SUM($B$14:$B$14),0))","v":""},{"$f":"IF(ROW(B6)-1>=$D$14,\"\",OFFSET(INDIRECT(MID(CELL(\"filename\",roll!$A$15),FIND(\"]\",CELL(\"filename\",roll!$A$15))+1,31)&\"!\"&ADDRESS(MATCH(rn_07!$D$9,roll!C:C,0)+1,3,4)),ROW(B6)-1+SUM($B$14:$C$14),0))","v":""},{"$f":"IF(ROW(B6)-1>=$E$14,\"\",OFFSET(INDIRECT(MID(CELL(\"filename\",roll!$A$15),FIND(\"]\",CELL(\"filename\",roll!$A$15))+1,31)&\"!\"&ADDRESS(MATCH(rn_07!$D$9,roll!C:C,0)+1,3,4)),ROW(B6)-1+SUM($B$14:$D$14),0))","v":10120},1]
[null,{"$f":"IF(ROW(B7)-1>=$B$14,\"\",OFFSET(INDIRECT(MID(CELL(\"filename\",roll!$A$15),FIND(\"]\",CELL(\"filename\",roll!$A$15))+1,31)&\"!\"&ADDRESS(MATCH(rn_07!$D$9,roll!C:C,0)+1,3,4)),ROW(B7)-1,0))","v":607},{"$f":"IF(ROW(B7)-1>=$C$14,\"\",OFFSET(INDIRECT(MID(CELL(\"filename\",roll!$A$15),FIND(\"]\",CELL(\"filename\",roll!$A$15))+1,31)&\"!\"&ADDRESS(MATCH(rn_07!$D$9,roll!C:C,0)+1,3,4)),ROW(B7)-1+SUM($B$14:$B$14),0))","v":""},{"$f":"IF(ROW(B7)-1>=$D$14,\"\",OFFSET(INDIRECT(MID(CELL(\"filename\",roll!$A$15),FIND(\"]\",CELL(\"filename\",roll!$A$15))+1,31)&\"!\"&ADDRESS(MATCH(rn_07!$D$9,roll!C:C,0)+1,3,4)),ROW(B7)-1+SUM($B$14:$C$14),0))","v":""},{"$f":"IF(ROW(B7)-1>=$E$14,\"\",OFFSET(INDIRECT(MID(CELL(\"filename\",roll!$A$15),FIND(\"]\",CELL(\"filename\",roll!$A$15))+1,31)&\"!\"&ADDRESS(MATCH(rn_07!$D$9,roll!C:C,0)+1,3,4)),ROW(B7)-1+SUM($B$14:$D$14),0))","v":620},1]
[null,{"$f":"IF(ROW(B8)-1>=$B$14,\"\",OFFSET(INDIRECT(MID(CELL(\"filename\",roll!$A$15),FIND(\"]\",CELL(\"filename\",roll!$A$15))+1,31)&\"!\"&ADDRESS(MATCH(rn_07!$D$9,roll!C:C,0)+1,3,4)),ROW(B8)-1,0))","v":10108},{"$f":"IF(ROW(B8)-1>=$C$14,\"\",OFFSET(INDIRECT(MID(CELL(\"filename\",roll!$A$15),FIND(\"]\",CELL(\"filename\",roll!$A$15))+1,31)&\"!\"&ADDRESS(MATCH(rn_07!$D$9,roll!C:C,0)+1,3,4)),ROW(B8)-1+SUM($B$14:$B$14),0))","v":""},{"$f":"IF(ROW(B8)-1>=$D$14,\"\",OFFSET(INDIRECT(MID(CELL(\"filename\",roll!$A$15),FIND(\"]\",CELL(\"filename\",roll!$A$15))+1,31)&\"!\"&ADDRESS(MATCH(rn_07!$D$9,roll!C:C,0)+1,3,4)),ROW(B8)-1+SUM($B$14:$C$14),0))","v":""},{"$f":"IF(ROW(B8)-1>=$E$14,\"\",OFFSET(INDIRECT(MID(CELL(\"filename\",roll!$A$15),FIND(\"]\",CELL(\"filename\",roll!$A$15))+1,31)&\"!\"&ADDRESS(MATCH(rn_07!$D$9,roll!C:C,0)+1,3,4)),ROW(B8)-1+SUM($B$14:$D$14),0))","v":10121},1]
[null,{"$f":"IF(ROW(B9)-1>=$B$14,\"\",OFFSET(INDIRECT(MID(CELL(\"filename\",roll!$A$15),FIND(\"]\",CELL(\"filename\",roll!$A$15))+1,31)&\"!\"&ADDRESS(MATCH(rn_07!$D$9,roll!C:C,0)+1,3,4)),ROW(B9)-1,0))","v":608},{"$f":"IF(ROW(B9)-1>=$C$14,\"\",OFFSET(INDIRECT(MID(CELL(\"filename\",roll!$A$15),FIND(\"]\",CELL(\"filename\",roll!$A$15))+1,31)&\"!\"&ADDRESS(MATCH(rn_07!$D$9,roll!C:C,0)+1,3,4)),ROW(B9)-1+SUM($B$14:$B$14),0))","v":""},{"$f":"IF(ROW(B9)-1>=$D$14,\"\",OFFSET(INDIRECT(MID(CELL(\"filename\",roll!$A$15),FIND(\"]\",CELL(\"filename\",roll!$A$15))+1,31)&\"!\"&ADDRESS(MATCH(rn_07!$D$9,roll!C:C,0)+1,3,4)),ROW(B9)-1+SUM($B$14:$C$14),0))","v":""},{"$f":"IF(ROW(B9)-1>=$E$14,\"\",OFFSET(INDIRECT(MID(CELL(\"filename\",roll!$A$15),FIND(\"]\",CELL(\"filename\",roll!$A$15))+1,31)&\"!\"&ADDRESS(MATCH(rn_07!$D$9,roll!C:C,0)+1,3,4)),ROW(B9)-1+SUM($B$14:$D$14),0))","v":621},1]
[null,{"$f":"IF(ROW(B10)-1>=$B$14,\"\",OFFSET(INDIRECT(MID(CELL(\"filename\",roll!$A$15),FIND(\"]\",CELL(\"filename\",roll!$A$15))+1,31)&\"!\"&ADDRESS(MATCH(rn_07!$D$9,roll!C:C,0)+1,3,4)),ROW(B10)-1,0))","v":10109},{"$f":"IF(ROW(B10)-1>=$C$14,\"\",OFFSET(INDIRECT(MID(CELL(\"filename\",roll!$A$15),FIND(\"]\",CELL(\"filename\",roll!$A$15))+1,31)&\"!\"&ADDRESS(MATCH(rn_07!$D$9,roll!C:C,0)+1,3,4)),ROW(B10)-1+SUM($B$14:$B$14),0))","v":""},{"$f":"IF(ROW(B10)-1>=$D$14,\"\",OFFSET(INDIRECT(MID(CELL(\"filename\",roll!$A$15),FIND(\"]\",CELL(\"filename\",roll!$A$15))+1,31)&\"!\"&ADDRESS(MATCH(rn_07!$D$9,roll!C:C,0)+1,3,4)),ROW(B10)-1+SUM($B$14:$C$14),0))","v":""},{"$f":"IF(ROW(B10)-1>=$E$14,\"\",OFFSET(INDIRECT(MID(CELL(\"filename\",roll!$A$15),FIND(\"]\",CELL(\"filename\",roll!$A$15))+1,31)&\"!\"&ADDRESS(MATCH(rn_07!$D$9,roll!C:C,0)+1,3,4)),ROW(B10)-1+SUM($B$14:$D$14),0))","v":10122},1]
[null,{"$f":"IF(ROW(B11)-1>=$B$14,\"\",OFFSET(INDIRECT(MID(CELL(\"filename\",roll!$A$15),FIND(\"]\",CELL(\"filename\",roll!$A$15))+1,31)&\"!\"&ADDRESS(MATCH(rn_07!$D$9,roll!C:C,0)+1,3,4)),ROW(B11)-1,0))","v":609},{"$f":"IF(ROW(B11)-1>=$C$14,\"\",OFFSET(INDIRECT(MID(CELL(\"filename\",roll!$A$15),FIND(\"]\",CELL(\"filename\",roll!$A$15))+1,31)&\"!\"&ADDRESS(MATCH(rn_07!$D$9,roll!C:C,0)+1,3,4)),ROW(B11)-1+SUM($B$14:$B$14),0))","v":""},{"$f":"IF(ROW(B11)-1>=$D$14,\"\",OFFSET(INDIRECT(MID(CELL(\"filename\",roll!$A$15),FIND(\"]\",CELL(\"filename\",roll!$A$15))+1,31)&\"!\"&ADDRESS(MATCH(rn_07!$D$9,roll!C:C,0)+1,3,4)),ROW(B11)-1+SUM($B$14:$C$14),0))","v":""},{"$f":"IF(ROW(B11)-1>=$E$14,\"\",OFFSET(INDIRECT(MID(CELL(\"filename\",roll!$A$15),FIND(\"]\",CELL(\"filename\",roll!$A$15))+1,31)&\"!\"&ADDRESS(MATCH(rn_07!$D$9,roll!C:C,0)+1,3,4)),ROW(B11)-1+SUM($B$14:$D$14),0))","v":622},1]
[null,{"$f":"IF(ROW(B12)-1>=$B$14,\"\",OFFSET(INDIRECT(MID(CELL(\"filename\",roll!$A$15),FIND(\"]\",CELL(\"filename\",roll!$A$15))+1,31)&\"!\"&ADDRESS(MATCH(rn_07!$D$9,roll!C:C,0)+1,3,4)),ROW(B12)-1,0))","v":10110},{"$f":"IF(ROW(B12)-1>=$C$14,\"\",OFFSET(INDIRECT(MID(CELL(\"filename\",roll!$A$15),FIND(\"]\",CELL(\"filename\",roll!$A$15))+1,31)&\"!\"&ADDRESS(MATCH(rn_07!$D$9,roll!C:C,0)+1,3,4)),ROW(B12)-1+SUM($B$14:$B$14),0))","v":""},{"$f":"IF(ROW(B12)-1>=$D$14,\"\",OFFSET(INDIRECT(MID(CELL(\"filename\",roll!$A$15),FIND(\"]\",CELL(\"filename\",roll!$A$15))+1,31)&\"!\"&ADDRESS(MATCH(rn_07!$D$9,roll!C:C,0)+1,3,4)),ROW(B12)-1+SUM($B$14:$C$14),0))","v":""},{"$f":"IF(ROW(B12)-1>=$E$14,\"\",OFFSET(INDIRECT(MID(CELL(\"filename\",roll!$A$15),FIND(\"]\",CELL(\"filename\",roll!$A$15))+1,31)&\"!\"&ADDRESS(MATCH(rn_07!$D$9,roll!C:C,0)+1,3,4)),ROW(B12)-1+SUM($B$14:$D$14),0))","v":10123},1]
[null,{"$f":"IF(ROW(B13)-1>=$B$14,\"\",OFFSET(INDIRECT(MID(CELL(\"filename\",roll!$A$15),FIND(\"]\",CELL(\"filename\",roll!$A$15))+1,31)&\"!\"&ADDRESS(MATCH(rn_07!$D$9,roll!C:C,0)+1,3,4)),ROW(B13)-1,0))","v":610},{"$f":"IF(ROW(B13)-1>=$C$14,\"\",OFFSET(INDIRECT(MID(CELL(\"filename\",roll!$A$15),FIND(\"]\",CELL(\"filename\",roll!$A$15))+1,31)&\"!\"&ADDRESS(MATCH(rn_07!$D$9,roll!C:C,0)+1,3,4)),ROW(B13)-1+SUM($B$14:$B$14),0))","v":""},{"$f":"IF(ROW(B13)-1>=$D$14,\"\",OFFSET(INDIRECT(MID(CELL(\"filename\",roll!$A$15),FIND(\"]\",CELL(\"filename\",roll!$A$15))+1,31)&\"!\"&ADDRESS(MATCH(rn_07!$D$9,roll!C:C,0)+1,3,4)),ROW(B13)-1+SUM($B$14:$C$14),0))","v":""},{"$f":"IF(ROW(B13)-1>=$E$14,\"\",OFFSET(INDIRECT(MID(CELL(\"filename\",roll!$A$15),FIND(\"]\",CELL(\"filename\",roll!$A$15))+1,31)&\"!\"&ADDRESS(MATCH(rn_07!$D$9,roll!C:C,0)+1,3,4)),ROW(B13)-1+SUM($B$14:$D$14),0))","v":623},1]
[null,{"$f":"IF(ROW(B14)-1>=$B$14,\"\",OFFSET(INDIRECT(MID(CELL(\"filename\",roll!$A$15),FIND(\"]\",CELL(\"filename\",roll!$A$15))+1,31)&\"!\"&ADDRESS(MATCH(rn_07!$D$9,roll!C:C,0)+1,3,4)),ROW(B14)-1,0))","v":10111},{"$f":"IF(ROW(B14)-1>=$C$14,\"\",OFFSET(INDIRECT(MID(CELL(\"filename\",roll!$A$15),FIND(\"]\",CELL(\"filename\",roll!$A$15))+1,31)&\"!\"&ADDRESS(MATCH(rn_07!$D$9,roll!C:C,0)+1,3,4)),ROW(B14)-1+SUM($B$14:$B$14),0))","v":""},{"$f":"IF(ROW(B14)-1>=$D$14,\"\",OFFSET(INDIRECT(MID(CELL(\"filename\",roll!$A$15),FIND(\"]\",CELL(\"filename\",roll!$A$15))+1,31)&\"!\"&ADDRESS(MATCH(rn_07!$D$9,roll!C:C,0)+1,3,4)),ROW(B14)-1+SUM($B$14:$C$14),0))","v":""},{"$f":"IF(ROW(B14)-1>=$E$14,\"\",OFFSET(INDIRECT(MID(CELL(\"filename\",roll!$A$15),FIND(\"]\",CELL(\"filename\",roll!$A$15))+1,31)&\"!\"&ADDRESS(MATCH(rn_07!$D$9,roll!C:C,0)+1,3,4)),ROW(B14)-1+SUM($B$14:$D$14),0))","v":10124},1]
[null,{"$f":"IF(ROW(B15)-1>=$B$14,\"\",OFFSET(INDIRECT(MID(CELL(\"filename\",roll!$A$15),FIND(\"]\",CELL(\"filename\",roll!$A$15))+1,31)&\"!\"&ADDRESS(MATCH(rn_07!$D$9,roll!C:C,0)+1,3,4)),ROW(B15)-1,0))","v":611},{"$f":"IF(ROW(B15)-1>=$C$14,\"\",OFFSET(INDIRECT(MID(CELL(\"filename\",roll!$A$15),FIND(\"]\",CELL(\"filename\",roll!$A$15))+1,31)&\"!\"&ADDRESS(MATCH(rn_07!$D$9,roll!C:C,0)+1,3,4)),ROW(B15)-1+SUM($B$14:$B$14),0))","v":""},{"$f":"IF(ROW(B15)-1>=$D$14,\"\",OFFSET(INDIRECT(MID(CELL(\"filename\",roll!$A$15),FIND(\"]\",CELL(\"filename\",roll!$A$15))+1,31)&\"!\"&ADDRESS(MATCH(rn_07!$D$9,roll!C:C,0)+1,3,4)),ROW(B15)-1+SUM($B$14:$C$14),0))","v":""},{"$f":"IF(ROW(B15)-1>=$E$14,\"\",OFFSET(INDIRECT(MID(CELL(\"filename\",roll!$A$15),FIND(\"]\",CELL(\"filename\",roll!$A$15))+1,31)&\"!\"&ADDRESS(MATCH(rn_07!$D$9,roll!C:C,0)+1,3,4)),ROW(B15)-1+SUM($B$14:$D$14),0))","v":624},1]
[null,{"$f":"IF(ROW(B16)-1>=$B$14,\"\",OFFSET(INDIRECT(MID(CELL(\"filename\",roll!$A$15),FIND(\"]\",CELL(\"filename\",roll!$A$15))+1,31)&\"!\"&ADDRESS(MATCH(rn_07!$D$9,roll!C:C,0)+1,3,4)),ROW(B16)-1,0))","v":10112},{"$f":"IF(ROW(B16)-1>=$C$14,\"\",OFFSET(INDIRECT(MID(CELL(\"filename\",roll!$A$15),FIND(\"]\",CELL(\"filename\",roll!$A$15))+1,31)&\"!\"&ADDRESS(MATCH(rn_07!$D$9,roll!C:C,0)+1,3,4)),ROW(B16)-1+SUM($B$14:$B$14),0))","v":""},{"$f":"IF(ROW(B16)-1>=$D$14,\"\",OFFSET(INDIRECT(MID(CELL(\"filename\",roll!$A$15),FIND(\"]\",CELL(\"filename\",roll!$A$15))+1,31)&\"!\"&ADDRESS(MATCH(rn_07!$D$9,roll!C:C,0)+1,3,4)),ROW(B16)-1+SUM($B$14:$C$14),0))","v":""},{"$f":"IF(ROW(B16)-1>=$E$14,\"\",OFFSET(INDIRECT(MID(CELL(\"filename\",roll!$A$15),FIND(\"]\",CELL(\"filename\",roll!$A$15))+1,31)&\"!\"&ADDRESS(MATCH(rn_07!$D$9,roll!C:C,0)+1,3,4)),ROW(B16)-1+SUM($B$14:$D$14),0))","v":10125},1]
[null,{"$f":"IF(ROW(B17)-1>=$B$14,\"\",OFFSET(INDIRECT(MID(CELL(\"filename\",roll!$A$15),FIND(\"]\",CELL(\"filename\",roll!$A$15))+1,31)&\"!\"&ADDRESS(MATCH(rn_07!$D$9,roll!C:C,0)+1,3,4)),ROW(B17)-1,0))","v":612},{"$f":"IF(ROW(B17)-1>=$C$14,\"\",OFFSET(INDIRECT(MID(CELL(\"filename\",roll!$A$15),FIND(\"]\",CELL(\"filename\",roll!$A$15))+1,31)&\"!\"&ADDRESS(MATCH(rn_07!$D$9,roll!C:C,0)+1,3,4)),ROW(B17)-1+SUM($B$14:$B$14),0))","v":""},{"$f":"IF(ROW(B17)-1>=$D$14,\"\",OFFSET(INDIRECT(MID(CELL(\"filename\",roll!$A$15),FIND(\"]\",CELL(\"filename\",roll!$A$15))+1,31)&\"!\"&ADDRESS(MATCH(rn_07!$D$9,roll!C:C,0)+1,3,4)),ROW(B17)-1+SUM($B$14:$C$14),0))","v":""},{"$f":"IF(ROW(B17)-1>=$E$14,\"\",OFFSET(INDIRECT(MID(CELL(\"filename\",roll!$A$15),FIND(\"]\",CELL(\"filename\",roll!$A$15))+1,31)&\"!\"&ADDRESS(MATCH(rn_07!$D$9,roll!C:C,0)+1,3,4)),ROW(B17)-1+SUM($B$14:$D$14),0))","v":625},1]
[null,{"$f":"IF(ROW(B18)-1>=$B$14,\"\",OFFSET(INDIRECT(MID(CELL(\"filename\",roll!$A$15),FIND(\"]\",CELL(\"filename\",roll!$A$15))+1,31)&\"!\"&ADDRESS(MATCH(rn_07!$D$9,roll!C:C,0)+1,3,4)),ROW(B18)-1,0))","v":10113},{"$f":"IF(ROW(B18)-1>=$C$14,\"\",OFFSET(INDIRECT(MID(CELL(\"filename\",roll!$A$15),FIND(\"]\",CELL(\"filename\",roll!$A$15))+1,31)&\"!\"&ADDRESS(MATCH(rn_07!$D$9,roll!C:C,0)+1,3,4)),ROW(B18)-1+SUM($B$14:$B$14),0))","v":""},{"$f":"IF(ROW(B18)-1>=$D$14,\"\",OFFSET(INDIRECT(MID(CELL(\"filename\",roll!$A$15),FIND(\"]\",CELL(\"filename\",roll!$A$15))+1,31)&\"!\"&ADDRESS(MATCH(rn_07!$D$9,roll!C:C,0)+1,3,4)),ROW(B18)-1+SUM($B$14:$C$14),0))","v":""},{"$f":"IF(ROW(B18)-1>=$E$14,\"\",OFFSET(INDIRECT(MID(CELL(\"filename\",roll!$A$15),FIND(\"]\",CELL(\"filename\",roll!$A$15))+1,31)&\"!\"&ADDRESS(MATCH(rn_07!$D$9,roll!C:C,0)+1,3,4)),ROW(B18)-1+SUM($B$14:$D$14),0))","v":10126},1]
[null,{"$f":"IF(ROW(B19)-1>=$B$14,\"\",OFFSET(INDIRECT(MID(CELL(\"filename\",roll!$A$15),FIND(\"]\",CELL(\"filename\",roll!$A$15))+1,31)&\"!\"&ADDRESS(MATCH(rn_07!$D$9,roll!C:C,0)+1,3,4)),ROW(B19)-1,0))","v":613},{"$f":"IF(ROW(B19)-1>=$C$14,\"\",OFFSET(INDIRECT(MID(CELL(\"filename\",roll!$A$15),FIND(\"]\",CELL(\"filename\",roll!$A$15))+1,31)&\"!\"&ADDRESS(MATCH(rn_07!$D$9,roll!C:C,0)+1,3,4)),ROW(B19)-1+SUM($B$14:$B$14),0))","v":""},{"$f":"IF(ROW(B19)-1>=$D$14,\"\",OFFSET(INDIRECT(MID(CELL(\"filename\",roll!$A$15),FIND(\"]\",CELL(\"filename\",roll!$A$15))+1,31)&\"!\"&ADDRESS(MATCH(rn_07!$D$9,roll!C:C,0)+1,3,4)),ROW(B19)-1+SUM($B$14:$C$14),0))","v":""},{"$f":"IF(ROW(B19)-1>=$E$14,\"\",OFFSET(INDIRECT(MID(CELL(\"filename\",roll!$A$15),FIND(\"]\",CELL(\"filename\",roll!$A$15))+1,31)&\"!\"&ADDRESS(MATCH(rn_07!$D$9,roll!C:C,0)+1,3,4)),ROW(B19)-1+SUM($B$14:$D$14),0))","v":626},1]
[null,{"$f":"IF(ROW(B20)-1>=$B$14,\"\",OFFSET(INDIRECT(MID(CELL(\"filename\",roll!$A$15),FIND(\"]\",CELL(\"filename\",roll!$A$15))+1,31)&\"!\"&ADDRESS(MATCH(rn_07!$D$9,roll!C:C,0)+1,3,4)),ROW(B20)-1,0))","v":10114},{"$f":"IF(ROW(B20)-1>=$C$14,\"\",OFFSET(INDIRECT(MID(CELL(\"filename\",roll!$A$15),FIND(\"]\",CELL(\"filename\",roll!$A$15))+1,31)&\"!\"&ADDRESS(MATCH(rn_07!$D$9,roll!C:C,0)+1,3,4)),ROW(B20)-1+SUM($B$14:$B$14),0))","v":""},{"$f":"IF(ROW(B20)-1>=$D$14,\"\",OFFSET(INDIRECT(MID(CELL(\"filename\",roll!$A$15),FIND(\"]\",CELL(\"filename\",roll!$A$15))+1,31)&\"!\"&ADDRESS(MATCH(rn_07!$D$9,roll!C:C,0)+1,3,4)),ROW(B20)-1+SUM($B$14:$C$14),0))","v":""},{"$f":"IF(ROW(B20)-1>=$E$14,\"\",OFFSET(INDIRECT(MID(CELL(\"filename\",roll!$A$15),FIND(\"]\",CELL(\"filename\",roll!$A$15))+1,31)&\"!\"&ADDRESS(MATCH(rn_07!$D$9,roll!C:C,0)+1,3,4)),ROW(B20)-1+SUM($B$14:$D$14),0))","v":10127},1]
[]
[null,"परीक्षा प्रभारी",null,null,"केन्द्राधीक्षक "]
[null,{"$f":"rn_01!$B$37","v":"ASD (Lecturer)"},null,null,{"$f":"rn_01!$E$37","v":"XYZ (Principal)"}]

{"sheet":"rn_09","index":9,"n_rows":37,"n_cols":6,"rows_kept":37,"cut":false,"hidden":false,"merged":[[11,1,11,4],[0,1,0,4],[1,1,1,4],[2,1,2,4],[3,1,3,4],[4,1,4,4],[5,1,5,4],[7,1,7,4],[8,1,8,2],[8,3,8,4],[9,1,9,4],[10,1,10,4]]}
[null,{"$f":"rn_01!$B$1","v":"Class VIIITH Board Examination, 2025"}]
[null,"परीक्षा केंद्र नाम एवं परीक्षा केंद्र क्रमांक"]
[null,{"$f":"rn_01!$B$3","v":"GSSS Malutana (12345)"}]
[null,"परीक्षा कक्ष / हॉल क्रमांक"]
[null,{"$f":"rn_01!$K$9","v":9}]
[null,"परीक्षा दिनांक (दिवस) ... से ... तक"]
[null,{"$f":"rn_01!$B$7","v":"01-03-2025"},{"$f":"IF(B7=\"\",\"\",TEXT(B7,\"DDDD\"))","v":"Saturday"},{"$f":"rn_01!$D$7","v":"22-05-2025"},{"$f":"IF(D7=\"\",\"\",TEXT(D7,\"DDDD\"))","v":"Thursday"}]
[null,"परीक्षार्थी रोल नंबर ... से ... तक"]
[null,{"$f":"IF(B14>0,B15,IF(C14>0,C15,IF(D14>0,D15,IF(E14>0,E15,0))))","v":627},null,{"$f":"IF(E14>0,LOOKUP(2,1/(E15:E34<>\"\"),E15:E34),IF(D14>0,LOOKUP(2,1/(D15:D34<>\"\"),D15:D34),IF(C14>0,LOOKUP(2,1/(C15:C34<>\"\"),C15:C34),IF(B14>0,LOOKUP(2,1/(B15:B34<>\"\"),B15:B34),0))))","v":10151}]
[null,"कुल सम्मिलित परीक्षार्थी "]
[null,{"$f":"COUNTIF($B$15:$E$34,\">0\")","v":48}]
[null,"परीक्षार्थी बैठक व्यवस्था"]
[null,"पंक्ति 1","पंक्ति 2","पंक्ति 3","पंक्ति 4"]
[null,{"$f":"rn_01!L9","v":20},{"$f":"rn_01!M9","v":9},{"$f":"rn_01!N9","v":8},{"$f":"rn_01!O9","v":11}]
[null,{"$f":"IF(ROW(B1)-1>=$B$14,\"\",OFFSET(INDIRECT(MID(CELL(\"filename\",roll!$A$15),FIND(\"]\",CELL(\"filename\",roll!$A$15))+1,31)&\"!\"&ADDRESS(MATCH(rn_08!$D$9,roll!C:C,0)+1,3,4)),ROW(B1)-1,0))","v":627},{"$f":"IF(ROW(B1)-1>=$C$14,\"\",OFFSET(INDIRECT(MID(CELL(\"filename\",roll!$A$15),FIND(\"]\",CELL(\"filename\",roll!$A$15))+1,31)&\"!\"&ADDRESS(MATCH(rn_08!$D$9,roll!C:C,0)+1,3,4)),ROW(B1)-1+SUM($B$14:$B$14),0))","v":637},{"$f":"IF(ROW(B1)-1>=$D$14,\"\",OFFSET(INDIRECT(MID(CELL(\"filename\",roll!$A$15),FIND(\"]\",CELL(\"filename\",roll!$A$15))+1,31)&\"!\"&ADDRESS(MATCH(rn_08!$D$9,roll!C:C,0)+1,3,4)),ROW(B1)-1+SUM($B$14:$C$14),0))","v":10142},{"$f":"IF(ROW(B1)-1>=$E$14,\"\",OFFSET(INDIRECT(MID(CELL(\"filename\",roll!$A$15),FIND(\"]\",CELL(\"filename\",roll!$A$15))+1,31)&\"!\"&ADDRESS(MATCH(rn_08!$D$9,roll!C:C,0)+1,3,4)),ROW(B1)-1+SUM($B$14:$D$14),0))","v":10146},{"$f":"IF(SUM(B15:E15)>0,1,\"\")","v":1}]
[null,{"$f":"IF(ROW(B2)-1>=$B$14,\"\",OFFSET(INDIRECT(MID(CELL(\"filename\",roll!$A$15),FIND(\"]\",CELL(\"filename\",roll!$A$15))+1,31)&\"!\"&ADDRESS(MATCH(rn_08!$D$9,roll!C:C,0)+1,3,4)),ROW(B2)-1,0))","v":10128},{"$f":"IF(ROW(B2)-1>=$C$14,\"\",OFFSET(INDIRECT(MID(CELL(\"filename\",roll!$A$15),FIND(\"]\",CELL(\"filename\",roll!$A$15))+1,31)&\"!\"&ADDRESS(MATCH(rn_08!$D$9,roll!C:C,0)+1,3,4)),ROW(B2)-1+SUM($B$14:$B$14),0))","v":10138},{"$f":"IF(ROW(B2)-1>=$D$14,\"\",OFFSET(INDIRECT(MID(CELL(\"filename\",roll!$A$15),FIND(\"]\",CELL(\"filename\",roll!$A$15))+1,31)&\"!\"&ADDRESS(MATCH(rn_08!$D$9,roll!C:C,0)+1,3,4)),ROW(B2)-1+SUM($B$14:$C$14),0))","v":642},{"$f":"IF(ROW(B2)-1>=$E$14,\"\",OFFSET(INDIRECT(MID(CELL(\"filename\",roll!$A$15),FIND(\"]\",CELL(\"filename\",roll!$A$15))+1,31)&\"!\"&ADDRESS(MATCH(rn_08!$D$9,roll!C:C,0)+1,3,4)),ROW(B2)-1+SUM($B$14:$D$14),0))","v":646},{"$f":"IF(SUM(B16:E16)>0,1,\"\")","v":1}]
[null,{"$f":"IF(ROW(B3)-1>=$B$14,\"\",OFFSET(INDIRECT(MID(CELL(\"filename\",roll!$A$15),FIND(\"]\",CELL(\"filename\",roll!$A$15))+1,31)&\"!\"&ADDRESS(MATCH(rn_08!$D$9,roll!C:C,0)+1,3,4)),ROW(B3)-1,0))","v":628},{"$f":"IF(ROW(B3)-1>=$C$14,\"\",OFFSET(INDIRECT(MID(CELL(\"filename\",roll!$A$15),FIND(\"]\",CELL(\"filename\",roll!$A$15))+1,31)&\"!\"&ADDRESS(MATCH(rn_08!$D$9,roll!C:C,0)+1,3,4)),ROW(B3)-1+SUM($B$14:$B$14),0))","v":638},{"$f":"IF(ROW(B3)-1>=$D$14,\"\",OFFSET(INDIRECT(MID(CELL(\"filename\",roll!$A$15),FIND(\"]\",CELL(\"filename\",roll!$A$15))+1,31)&\"!\"&ADDRESS(MATCH(rn_08!$D$9,roll!C:C,0)+1,3,4)),ROW(B3)-1+SUM($B$14:$C$14),0))","v":10143},{"$f":"IF(ROW(B3)-1>=$E$14,\"\",OFFSET(INDIRECT(MID(CELL(\"filename\",roll!$A$15),FIND(\"]\",CELL(\"filename\",roll!$A$15))+1,31)&\"!\"&ADDRESS(MATCH(rn_08!$D$9,roll!C:C,0)+1,3,4)),ROW(B3)-1+SUM($B$14:$D$14),0))","v":10147},1]
[null,{"$f":"IF(ROW(B4)-1>=$B$14,\"\",OFFSET(INDIRECT(MID(CELL(\"filename\",roll!$A$15),FIND(\"]\",CELL(\"filename\",roll!$A$15))+1,31)&\"!\"&ADDRESS(MATCH(rn_08!$D$9,roll!C:C,0)+1,3,4)),ROW(B4)-1,0))","v":10129},{"$f":"IF(ROW(B4)-1>=$C$14,\"\",OFFSET(INDIRECT(MID(CELL(\"filename\",roll!$A$15),FIND(\"]\",CELL(\"filename\",roll!$A$15))+1,31)&\"!\"&ADDRESS(MATCH(rn_08!$D$9,roll!C:C,0)+1,3,4)),ROW(B4)-1+SUM($B$14:$B$14),0))","v":10139},{"$f":"IF(ROW(B4)-1>=$D$14,\"\",OFFSET(INDIRECT(MID(CELL(\"filename\",roll!$A$15),FIND(\"]\",CELL(\"filename\",roll!$A$15))+1,31)&\"!\"&ADDRESS(MATCH(rn_08!$D$9,roll!C:C,0)+1,3,4)),ROW(B4)-1+SUM($B$14:$C$14),0))","v":643},{"$f":"IF(ROW(B4)-1>=$E$14,\"\",OFFSET(INDIRECT(MID(CELL(\"filename\",roll!$A$15),FIND(\"]\",CELL(\"filename\",roll!$A$15))+1,31)&\"!\"&ADDRESS(MATCH(rn_08!$D$9,roll!C:C,0)+1,3,4)),ROW(B4)-1+SUM($B$14:$D$14),0))","v":647},1]
[null,{"$f":"IF(ROW(B5)-1>=$B$14,\"\",OFFSET(INDIRECT(MID(CELL(\"filename\",roll!$A$15),FIND(\"]\",CELL(\"filename\",roll!$A$15))+1,31)&\"!\"&ADDRESS(MATCH(rn_08!$D$9,roll!C:C,0)+1,3,4)),ROW(B5)-1,0))","v":629},{"$f":"IF(ROW(B5)-1>=$C$14,\"\",OFFSET(INDIRECT(MID(CELL(\"filename\",roll!$A$15),FIND(\"]\",CELL(\"filename\",roll!$A$15))+1,31)&\"!\"&ADDRESS(MATCH(rn_08!$D$9,roll!C:C,0)+1,3,4)),ROW(B5)-1+SUM($B$14:$B$14),0))","v":639},{"$f":"IF(ROW(B5)-1>=$D$14,\"\",OFFSET(INDIRECT(MID(CELL(\"filename\",roll!$A$15),FIND(\"]\",CELL(\"filename\",roll!$A$15))+1,31)&\"!\"&ADDRESS(MATCH(rn_08!$D$9,roll!C:C,0)+1,3,4)),ROW(B5)-1+SUM($B$14:$C$14),0))","v":10144},{"$f":"IF(ROW(B5)-1>=$E$14,\"\",OFFSET(INDIRECT(MID(CELL(\"filename\",roll!$A$15),FIND(\"]\",CELL(\"filename\",roll!$A$15))+1,31)&\"!\"&ADDRESS(MATCH(rn_08!$D$9,roll!C:C,0)+1,3,4)),ROW(B5)-1+SUM($B$14:$D$14),0))","v":10148},1]
[null,{"$f":"IF(ROW(B6)-1>=$B$14,\"\",OFFSET(INDIRECT(MID(CELL(\"filename\",roll!$A$15),FIND(\"]\",CELL(\"filename\",roll!$A$15))+1,31)&\"!\"&ADDRESS(MATCH(rn_08!$D$9,roll!C:C,0)+1,3,4)),ROW(B6)-1,0))","v":10130},{"$f":"IF(ROW(B6)-1>=$C$14,\"\",OFFSET(INDIRECT(MID(CELL(\"filename\",roll!$A$15),FIND(\"]\",CELL(\"filename\",roll!$A$15))+1,31)&\"!\"&ADDRESS(MATCH(rn_08!$D$9,roll!C:C,0)+1,3,4)),ROW(B6)-1+SUM($B$14:$B$14),0))","v":10140},{"$f":"IF(ROW(B6)-1>=$D$14,\"\",OFFSET(INDIRECT(MID(CELL(\"filename\",roll!$A$15),FIND(\"]\",CELL(\"filename\",roll!$A$15))+1,31)&\"!\"&ADDRESS(MATCH(rn_08!$D$9,roll!C:C,0)+1,3,4)),ROW(B6)-1+SUM($B$14:$C$14),0))","v":644},{"$f":"IF(ROW(B6)-1>=$E$14,\"\",OFFSET(INDIRECT(MID(CELL(\"filename\",roll!$A$15),FIND(\"]\",CELL(\"filename\",roll!$A$15))+1,31)&\"!\"&ADDRESS(MATCH(rn_08!$D$9,roll!C:C,0)+1,3,4)),ROW(B6)-1+SUM($B$14:$D$14),0))","v":648},1]
[null,{"$f":"IF(ROW(B7)-1>=$B$14,\"\",OFFSET(INDIRECT(MID(CELL(\"filename\",roll!$A$15),FIND(\"]\",CELL(\"filename\",roll!$A$15))+1,31)&\"!\"&ADDRESS(MATCH(rn_08!$D$9,roll!C:C,0)+1,3,4)),ROW(B7)-1,0))","v":630},{"$f":"IF(ROW(B7)-1>=$C$14,\"\",OFFSET(INDIRECT(MID(CELL(\"filename\",roll!$A$15),FIND(\"]\",CELL(\"filename\",roll!$A$15))+1,31)&\"!\"&ADDRESS(MATCH(rn_08!$D$9,roll!C:C,0)+1,3,4)),ROW(B7)-1+SUM($B$14:$B$14),0))","v":640},{"$f":"IF(ROW(B7)-1>=$D$14,\"\",OFFSET(INDIRECT(MID(CELL(\"filename\",roll!$A$15),FIND(\"]\",CELL(\"filename\",roll!$A$15))+1,31)&\"!\"&ADDRESS(MATCH(rn_08!$D$9,roll!C:C,0)+1,3,4)),ROW(B7)-1+SUM($B$14:$C$14),0))","v":10145},{"$f":"IF(ROW(B7)-1>=$E$14,\"\",OFFSET(INDIRECT(MID(CELL(\"filename\",roll!$A$15),FIND(\"]\",CELL(\"filename\",roll!$A$15))+1,31)&\"!\"&ADDRESS(MATCH(rn_08!$D$9,roll!C:C,0)+1,3,4)),ROW(B7)-1+SUM($B$14:$D$14),0))","v":10149},1]
[null,{"$f":"IF(ROW(B8)-1>=$B$14,\"\",OFFSET(INDIRECT(MID(CELL(\"filename\",roll!$A$15),FIND(\"]\",CELL(\"filename\",roll!$A$15))+1,31)&\"!\"&ADDRESS(MATCH(rn_08!$D$9,roll!C:C,0)+1,3,4)),ROW(B8)-1,0))","v":10131},{"$f":"IF(ROW(B8)-1>=$C$14,\"\",OFFSET(INDIRECT(MID(CELL(\"filename\",roll!$A$15),FIND(\"]\",CELL(\"filename\",roll!$A$15))+1,31)&\"!\"&ADDRESS(MATCH(rn_08!$D$9,roll!C:C,0)+1,3,4)),ROW(B8)-1+SUM($B$14:$B$14),0))","v":10141},{"$f":"IF(ROW(B8)-1>=$D$14,\"\",OFFSET(INDIRECT(MID(CELL(\"filename\",roll!$A$15),FIND(\"]\",CELL(\"filename\",roll!$A$15))+1,31)&\"!\"&ADDRESS(MATCH(rn_08!$D$9,roll!C:C,0)+1,3,4)),ROW(B8)-1+SUM($B$14:$C$14),0))","v":645},{"$f":"IF(ROW(B8)-1>=$E$14,\"\",OFFSET(INDIRECT(MID(CELL(\"filename\",roll!$A$15),FIND(\"]\",CELL(\"filename\",roll!$A$15))+1,31)&\"!\"&ADDRESS(MATCH(rn_08!$D$9,roll!C:C,0)+1,3,4)),ROW(B8)-1+SUM($B$14:$D$14),0))","v":649},1]
[null,{"$f":"IF(ROW(B9)-1>=$B$14,\"\",OFFSET(INDIRECT(MID(CELL(\"filename\",roll!$A$15),FIND(\"]\",CELL(\"filename\",roll!$A$15))+1,31)&\"!\"&ADDRESS(MATCH(rn_08!$D$9,roll!C:C,0)+1,3,4)),ROW(B9)-1,0))","v":631},{"$f":"IF(ROW(B9)-1>=$C$14,\"\",OFFSET(INDIRECT(MID(CELL(\"filename\",roll!$A$15),FIND(\"]\",CELL(\"filename\",roll!$A$15))+1,31)&\"!\"&ADDRESS(MATCH(rn_08!$D$9,roll!C:C,0)+1,3,4)),ROW(B9)-1+SUM($B$14:$B$14),0))","v":641},{"$f":"IF(ROW(B9)-1>=$D$14,\"\",OFFSET(INDIRECT(MID(CELL(\"filename\",roll!$A$15),FIND(\"]\",CELL(\"filename\",roll!$A$15))+1,31)&\"!\"&ADDRESS(MATCH(rn_08!$D$9,roll!C:C,0)+1,3,4)),ROW(B9)-1+SUM($B$14:$C$14),0))","v":""},{"$f":"IF(ROW(B9)-1>=$E$14,\"\",OFFSET(INDIRECT(MID(CELL(\"filename\",roll!$A$15),FIND(\"]\",CELL(\"filename\",roll!$A$15))+1,31)&\"!\"&ADDRESS(MATCH(rn_08!$D$9,roll!C:C,0)+1,3,4)),ROW(B9)-1+SUM($B$14:$D$14),0))","v":10150},1]
[null,{"$f":"IF(ROW(B10)-1>=$B$14,\"\",OFFSET(INDIRECT(MID(CELL(\"filename\",roll!$A$15),FIND(\"]\",CELL(\"filename\",roll!$A$15))+1,31)&\"!\"&ADDRESS(MATCH(rn_08!$D$9,roll!C:C,0)+1,3,4)),ROW(B10)-1,0))","v":10132},{"$f":"IF(ROW(B10)-1>=$C$14,\"\",OFFSET(INDIRECT(MID(CELL(\"filename\",roll!$A$15),FIND(\"]\",CELL(\"filename\",roll!$A$15))+1,31)&\"!\"&ADDRESS(MATCH(rn_08!$D$9,roll!C:C,0)+1,3,4)),ROW(B10)-1+SUM($B$14:$B$14),0))","v":""},{"$f":"IF(ROW(B10)-1>=$D$14,\"\",OFFSET(INDIRECT(MID(CELL(\"filename\",roll!$A$15),FIND(\"]\",CELL(\"filename\",roll!$A$15))+1,31)&\"!\"&ADDRESS(MATCH(rn_08!$D$9,roll!C:C,0)+1,3,4)),ROW(B10)-1+SUM($B$14:$C$14),0))","v":""},{"$f":"IF(ROW(B10)-1>=$E$14,\"\",OFFSET(INDIRECT(MID(CELL(\"filename\",roll!$A$15),FIND(\"]\",CELL(\"filename\",roll!$A$15))+1,31)&\"!\"&ADDRESS(MATCH(rn_08!$D$9,roll!C:C,0)+1,3,4)),ROW(B10)-1+SUM($B$14:$D$14),0))","v":650},1]
[null,{"$f":"IF(ROW(B11)-1>=$B$14,\"\",OFFSET(INDIRECT(MID(CELL(\"filename\",roll!$A$15),FIND(\"]\",CELL(\"filename\",roll!$A$15))+1,31)&\"!\"&ADDRESS(MATCH(rn_08!$D$9,roll!C:C,0)+1,3,4)),ROW(B11)-1,0))","v":632},{"$f":"IF(ROW(B11)-1>=$C$14,\"\",OFFSET(INDIRECT(MID(CELL(\"filename\",roll!$A$15),FIND(\"]\",CELL(\"filename\",roll!$A$15))+1,31)&\"!\"&ADDRESS(MATCH(rn_08!$D$9,roll!C:C,0)+1,3,4)),ROW(B11)-1+SUM($B$14:$B$14),0))","v":""},{"$f":"IF(ROW(B11)-1>=$D$14,\"\",OFFSET(INDIRECT(MID(CELL(\"filename\",roll!$A$15),FIND(\"]\",CELL(\"filename\",roll!$A$15))+1,31)&\"!\"&ADDRESS(MATCH(rn_08!$D$9,roll!C:C,0)+1,3,4)),ROW(B11)-1+SUM($B$14:$C$14),0))","v":""},{"$f":"IF(ROW(B11)-1>=$E$14,\"\",OFFSET(INDIRECT(MID(CELL(\"filename\",roll!$A$15),FIND(\"]\",CELL(\"filename\",roll!$A$15))+1,31)&\"!\"&ADDRESS(MATCH(rn_08!$D$9,roll!C:C,0)+1,3,4)),ROW(B11)-1+SUM($B$14:$D$14),0))","v":10151},1]
[null,{"$f":"IF(ROW(B12)-1>=$B$14,\"\",OFFSET(INDIRECT(MID(CELL(\"filename\",roll!$A$15),FIND(\"]\",CELL(\"filename\",roll!$A$15))+1,31)&\"!\"&ADDRESS(MATCH(rn_08!$D$9,roll!C:C,0)+1,3,4)),ROW(B12)-1,0))","v":10133},{"$f":"IF(ROW(B12)-1>=$C$14,\"\",OFFSET(INDIRECT(MID(CELL(\"filename\",roll!$A$15),FIND(\"]\",CELL(\"filename\",roll!$A$15))+1,31)&\"!\"&ADDRESS(MATCH(rn_08!$D$9,roll!C:C,0)+1,3,4)),ROW(B12)-1+SUM($B$14:$B$14),0))","v":""},{"$f":"IF(ROW(B12)-1>=$D$14,\"\",OFFSET(INDIRECT(MID(CELL(\"filename\",roll!$A$15),FIND(\"]\",CELL(\"filename\",roll!$A$15))+1,31)&\"!\"&ADDRESS(MATCH(rn_08!$D$9,roll!C:C,0)+1,3,4)),ROW(B12)-1+SUM($B$14:$C$14),0))","v":""},{"$f":"IF(ROW(B12)-1>=$E$14,\"\",OFFSET(INDIRECT(MID(CELL(\"filename\",roll!$A$15),FIND(\"]\",CELL(\"filename\",roll!$A$15))+1,31)&\"!\"&ADDRESS(MATCH(rn_08!$D$9,roll!C:C,0)+1,3,4)),ROW(B12)-1+SUM($B$14:$D$14),0))","v":""},1]
[null,{"$f":"IF(ROW(B13)-1>=$B$14,\"\",OFFSET(INDIRECT(MID(CELL(\"filename\",roll!$A$15),FIND(\"]\",CELL(\"filename\",roll!$A$15))+1,31)&\"!\"&ADDRESS(MATCH(rn_08!$D$9,roll!C:C,0)+1,3,4)),ROW(B13)-1,0))","v":633},{"$f":"IF(ROW(B13)-1>=$C$14,\"\",OFFSET(INDIRECT(MID(CELL(\"filename\",roll!$A$15),FIND(\"]\",CELL(\"filename\",roll!$A$15))+1,31)&\"!\"&ADDRESS(MATCH(rn_08!$D$9,roll!C:C,0)+1,3,4)),ROW(B13)-1+SUM($B$14:$B$14),0))","v":""},{"$f":"IF(ROW(B13)-1>=$D$14,\"\",OFFSET(INDIRECT(MID(CELL(\"filename\",roll!$A$15),FIND(\"]\",CELL(\"filename\",roll!$A$15))+1,31)&\"!\"&ADDRESS(MATCH(rn_08!$D$9,roll!C:C,0)+1,3,4)),ROW(B13)-1+SUM($B$14:$C$14),0))","v":""},{"$f":"IF(ROW(B13)-1>=$E$14,\"\",OFFSET(INDIRECT(MID(CELL(\"filename\",roll!$A$15),FIND(\"]\",CELL(\"filename\",roll!$A$15))+1,31)&\"!\"&ADDRESS(MATCH(rn_08!$D$9,roll!C:C,0)+1,3,4)),ROW(B13)-1+SUM($B$14:$D$14),0))","v":""},1]
[null,{"$f":"IF(ROW(B14)-1>=$B$14,\"\",OFFSET(INDIRECT(MID(CELL(\"filename\",roll!$A$15),FIND(\"]\",CELL(\"filename\",roll!$A$15))+1,31)&\"!\"&ADDRESS(MATCH(rn_08!$D$9,roll!C:C,0)+1,3,4)),ROW(B14)-1,0))","v":10134},{"$f":"IF(ROW(B14)-1>=$C$14,\"\",OFFSET(INDIRECT(MID(CELL(\"filename\",roll!$A$15),FIND(\"]\",CELL(\"filename\",roll!$A$15))+1,31)&\"!\"&ADDRESS(MATCH(rn_08!$D$9,roll!C:C,0)+1,3,4)),ROW(B14)-1+SUM($B$14:$B$14),0))","v":""},{"$f":"IF(ROW(B14)-1>=$D$14,\"\",OFFSET(INDIRECT(MID(CELL(\"filename\",roll!$A$15),FIND(\"]\",CELL(\"filename\",roll!$A$15))+1,31)&\"!\"&ADDRESS(MATCH(rn_08!$D$9,roll!C:C,0)+1,3,4)),ROW(B14)-1+SUM($B$14:$C$14),0))","v":""},{"$f":"IF(ROW(B14)-1>=$E$14,\"\",OFFSET(INDIRECT(MID(CELL(\"filename\",roll!$A$15),FIND(\"]\",CELL(\"filename\",roll!$A$15))+1,31)&\"!\"&ADDRESS(MATCH(rn_08!$D$9,roll!C:C,0)+1,3,4)),ROW(B14)-1+SUM($B$14:$D$14),0))","v":""},1]
[null,{"$f":"IF(ROW(B15)-1>=$B$14,\"\",OFFSET(INDIRECT(MID(CELL(\"filename\",roll!$A$15),FIND(\"]\",CELL(\"filename\",roll!$A$15))+1,31)&\"!\"&ADDRESS(MATCH(rn_08!$D$9,roll!C:C,0)+1,3,4)),ROW(B15)-1,0))","v":634},{"$f":"IF(ROW(B15)-1>=$C$14,\"\",OFFSET(INDIRECT(MID(CELL(\"filename\",roll!$A$15),FIND(\"]\",CELL(\"filename\",roll!$A$15))+1,31)&\"!\"&ADDRESS(MATCH(rn_08!$D$9,roll!C:C,0)+1,3,4)),ROW(B15)-1+SUM($B$14:$B$14),0))","v":""},{"$f":"IF(ROW(B15)-1>=$D$14,\"\",OFFSET(INDIRECT(MID(CELL(\"filename\",roll!$A$15),FIND(\"]\",CELL(\"filename\",roll!$A$15))+1,31)&\"!\"&ADDRESS(MATCH(rn_08!$D$9,roll!C:C,0)+1,3,4)),ROW(B15)-1+SUM($B$14:$C$14),0))","v":""},{"$f":"IF(ROW(B15)-1>=$E$14,\"\",OFFSET(INDIRECT(MID(CELL(\"filename\",roll!$A$15),FIND(\"]\",CELL(\"filename\",roll!$A$15))+1,31)&\"!\"&ADDRESS(MATCH(rn_08!$D$9,roll!C:C,0)+1,3,4)),ROW(B15)-1+SUM($B$14:$D$14),0))","v":""},1]
[null,{"$f":"IF(ROW(B16)-1>=$B$14,\"\",OFFSET(INDIRECT(MID(CELL(\"filename\",roll!$A$15),FIND(\"]\",CELL(\"filename\",roll!$A$15))+1,31)&\"!\"&ADDRESS(MATCH(rn_08!$D$9,roll!C:C,0)+1,3,4)),ROW(B16)-1,0))","v":10135},{"$f":"IF(ROW(B16)-1>=$C$14,\"\",OFFSET(INDIRECT(MID(CELL(\"filename\",roll!$A$15),FIND(\"]\",CELL(\"filename\",roll!$A$15))+1,31)&\"!\"&ADDRESS(MATCH(rn_08!$D$9,roll!C:C,0)+1,3,4)),ROW(B16)-1+SUM($B$14:$B$14),0))","v":""},{"$f":"IF(ROW(B16)-1>=$D$14,\"\",OFFSET(INDIRECT(MID(CELL(\"filename\",roll!$A$15),FIND(\"]\",CELL(\"filename\",roll!$A$15))+1,31)&\"!\"&ADDRESS(MATCH(rn_08!$D$9,roll!C:C,0)+1,3,4)),ROW(B16)-1+SUM($B$14:$C$14),0))","v":""},{"$f":"IF(ROW(B16)-1>=$E$14,\"\",OFFSET(INDIRECT(MID(CELL(\"filename\",roll!$A$15),FIND(\"]\",CELL(\"filename\",roll!$A$15))+1,31)&\"!\"&ADDRESS(MATCH(rn_08!$D$9,roll!C:C,0)+1,3,4)),ROW(B16)-1+SUM($B$14:$D$14),0))","v":""},1]
[null,{"$f":"IF(ROW(B17)-1>=$B$14,\"\",OFFSET(INDIRECT(MID(CELL(\"filename\",roll!$A$15),FIND(\"]\",CELL(\"filename\",roll!$A$15))+1,31)&\"!\"&ADDRESS(MATCH(rn_08!$D$9,roll!C:C,0)+1,3,4)),ROW(B17)-1,0))","v":635},{"$f":"IF(ROW(B17)-1>=$C$14,\"\",OFFSET(INDIRECT(MID(CELL(\"filename\",roll!$A$15),FIND(\"]\",CELL(\"filename\",roll!$A$15))+1,31)&\"!\"&ADDRESS(MATCH(rn_08!$D$9,roll!C:C,0)+1,3,4)),ROW(B17)-1+SUM($B$14:$B$14),0))","v":""},{"$f":"IF(ROW(B17)-1>=$D$14,\"\",OFFSET(INDIRECT(MID(CELL(\"filename\",roll!$A$15),FIND(\"]\",CELL(\"filename\",roll!$A$15))+1,31)&\"!\"&ADDRESS(MATCH(rn_08!$D$9,roll!C:C,0)+1,3,4)),ROW(B17)-1+SUM($B$14:$C$14),0))","v":""},{"$f":"IF(ROW(B17)-1>=$E$14,\"\",OFFSET(INDIRECT(MID(CELL(\"filename\",roll!$A$15),FIND(\"]\",CELL(\"filename\",roll!$A$15))+1,31)&\"!\"&ADDRESS(MATCH(rn_08!$D$9,roll!C:C,0)+1,3,4)),ROW(B17)-1+SUM($B$14:$D$14),0))","v":""},1]
[null,{"$f":"IF(ROW(B18)-1>=$B$14,\"\",OFFSET(INDIRECT(MID(CELL(\"filename\",roll!$A$15),FIND(\"]\",CELL(\"filename\",roll!$A$15))+1,31)&\"!\"&ADDRESS(MATCH(rn_08!$D$9,roll!C:C,0)+1,3,4)),ROW(B18)-1,0))","v":10136},{"$f":"IF(ROW(B18)-1>=$C$14,\"\",OFFSET(INDIRECT(MID(CELL(\"filename\",roll!$A$15),FIND(\"]\",CELL(\"filename\",roll!$A$15))+1,31)&\"!\"&ADDRESS(MATCH(rn_08!$D$9,roll!C:C,0)+1,3,4)),ROW(B18)-1+SUM($B$14:$B$14),0))","v":""},{"$f":"IF(ROW(B18)-1>=$D$14,\"\",OFFSET(INDIRECT(MID(CELL(\"filename\",roll!$A$15),FIND(\"]\",CELL(\"filename\",roll!$A$15))+1,31)&\"!\"&ADDRESS(MATCH(rn_08!$D$9,roll!C:C,0)+1,3,4)),ROW(B18)-1+SUM($B$14:$C$14),0))","v":""},{"$f":"IF(ROW(B18)-1>=$E$14,\"\",OFFSET(INDIRECT(MID(CELL(\"filename\",roll!$A$15),FIND(\"]\",CELL(\"filename\",roll!$A$15))+1,31)&\"!\"&ADDRESS(MATCH(rn_08!$D$9,roll!C:C,0)+1,3,4)),ROW(B18)-1+SUM($B$14:$D$14),0))","v":""},1]
[null,{"$f":"IF(ROW(B19)-1>=$B$14,\"\",OFFSET(INDIRECT(MID(CELL(\"filename\",roll!$A$15),FIND(\"]\",CELL(\"filename\",roll!$A$15))+1,31)&\"!\"&ADDRESS(MATCH(rn_08!$D$9,roll!C:C,0)+1,3,4)),ROW(B19)-1,0))","v":636},{"$f":"IF(ROW(B19)-1>=$C$14,\"\",OFFSET(INDIRECT(MID(CELL(\"filename\",roll!$A$15),FIND(\"]\",CELL(\"filename\",roll!$A$15))+1,31)&\"!\"&ADDRESS(MATCH(rn_08!$D$9,roll!C:C,0)+1,3,4)),ROW(B19)-1+SUM($B$14:$B$14),0))","v":""},{"$f":"IF(ROW(B19)-1>=$D$14,\"\",OFFSET(INDIRECT(MID(CELL(\"filename\",roll!$A$15),FIND(\"]\",CELL(\"filename\",roll!$A$15))+1,31)&\"!\"&ADDRESS(MATCH(rn_08!$D$9,roll!C:C,0)+1,3,4)),ROW(B19)-1+SUM($B$14:$C$14),0))","v":""},{"$f":"IF(ROW(B19)-1>=$E$14,\"\",OFFSET(INDIRECT(MID(CELL(\"filename\",roll!$A$15),FIND(\"]\",CELL(\"filename\",roll!$A$15))+1,31)&\"!\"&ADDRESS(MATCH(rn_08!$D$9,roll!C:C,0)+1,3,4)),ROW(B19)-1+SUM($B$14:$D$14),0))","v":""},1]
[null,{"$f":"IF(ROW(B20)-1>=$B$14,\"\",OFFSET(INDIRECT(MID(CELL(\"filename\",roll!$A$15),FIND(\"]\",CELL(\"filename\",roll!$A$15))+1,31)&\"!\"&ADDRESS(MATCH(rn_08!$D$9,roll!C:C,0)+1,3,4)),ROW(B20)-1,0))","v":10137},{"$f":"IF(ROW(B20)-1>=$C$14,\"\",OFFSET(INDIRECT(MID(CELL(\"filename\",roll!$A$15),FIND(\"]\",CELL(\"filename\",roll!$A$15))+1,31)&\"!\"&ADDRESS(MATCH(rn_08!$D$9,roll!C:C,0)+1,3,4)),ROW(B20)-1+SUM($B$14:$B$14),0))","v":""},{"$f":"IF(ROW(B20)-1>=$D$14,\"\",OFFSET(INDIRECT(MID(CELL(\"filename\",roll!$A$15),FIND(\"]\",CELL(\"filename\",roll!$A$15))+1,31)&\"!\"&ADDRESS(MATCH(rn_08!$D$9,roll!C:C,0)+1,3,4)),ROW(B20)-1+SUM($B$14:$C$14),0))","v":""},{"$f":"IF(ROW(B20)-1>=$E$14,\"\",OFFSET(INDIRECT(MID(CELL(\"filename\",roll!$A$15),FIND(\"]\",CELL(\"filename\",roll!$A$15))+1,31)&\"!\"&ADDRESS(MATCH(rn_08!$D$9,roll!C:C,0)+1,3,4)),ROW(B20)-1+SUM($B$14:$D$14),0))","v":""},1]
[]
[null,"परीक्षा प्रभारी",null,null,"केन्द्राधीक्षक "]
[null,{"$f":"rn_01!$B$37","v":"ASD (Lecturer)"},null,null,{"$f":"rn_01!$E$37","v":"XYZ (Principal)"}]

{"sheet":"rn_10","index":10,"n_rows":37,"n_cols":6,"rows_kept":37,"cut":false,"hidden":false,"merged":[[11,1,11,4],[0,1,0,4],[1,1,1,4],[2,1,2,4],[3,1,3,4],[4,1,4,4],[5,1,5,4],[7,1,7,4],[8,1,8,2],[8,3,8,4],[9,1,9,4],[10,1,10,4]]}
[null,{"$f":"rn_01!$B$1","v":"Class VIIITH Board Examination, 2025"}]
[null,"परीक्षा केंद्र नाम एवं परीक्षा केंद्र क्रमांक"]
[null,{"$f":"rn_01!$B$3","v":"GSSS Malutana (12345)"}]
[null,"परीक्षा कक्ष / हॉल क्रमांक"]
[null,{"$f":"rn_01!$K$10","v":10}]
[null,"परीक्षा दिनांक (दिवस) ... से ... तक"]
[null,{"$f":"rn_01!$B$7","v":"01-03-2025"},{"$f":"IF(B7=\"\",\"\",TEXT(B7,\"DDDD\"))","v":"Saturday"},{"$f":"rn_01!$D$7","v":"22-05-2025"},{"$f":"IF(D7=\"\",\"\",TEXT(D7,\"DDDD\"))","v":"Thursday"}]
[null,"परीक्षार्थी रोल नंबर ... से ... तक"]
[null,{"$f":"IF(B14>0,B15,IF(C14>0,C15,IF(D14>0,D15,IF(E14>0,E15,0))))","v":651},null,{"$f":"IF(E14>0,LOOKUP(2,1/(E15:E34<>\"\"),E15:E34),IF(D14>0,LOOKUP(2,1/(D15:D34<>\"\"),D15:D34),IF(C14>0,LOOKUP(2,1/(C15:C34<>\"\"),C15:C34),IF(B14>0,LOOKUP(2,1/(B15:B34<>\"\"),B15:B34),0))))","v":666}]
[null,"कुल सम्मिलित परीक्षार्थी "]
[null,{"$f":"COUNTIF($B$15:$E$34,\">0\")","v":31}]
[null,"परीक्षार्थी बैठक व्यवस्था"]
[null,"पंक्ति 1","पंक्ति 2","पंक्ति 3","पंक्ति 4"]
[null,{"$f":"rn_01!L10","v":10},{"$f":"rn_01!M10","v":6},{"$f":"rn_01!N10","v":3},{"$f":"rn_01!O10","v":12}]
[null,{"$f":"IF(ROW(B1)-1>=$B$14,\"\",OFFSET(INDIRECT(MID(CELL(\"filename\",roll!$A$15),FIND(\"]\",CELL(\"filename\",roll!$A$15))+1,31)&\"!\"&ADDRESS(MATCH(rn_09!$D$9,roll!C:C,0)+1,3,4)),ROW(B1)-1,0))","v":651},{"$f":"IF(ROW(B1)-1>=$C$14,\"\",OFFSET(INDIRECT(MID(CELL(\"filename\",roll!$A$15),FIND(\"]\",CELL(\"filename\",roll!$A$15))+1,31)&\"!\"&ADDRESS(MATCH(rn_09!$D$9,roll!C:C,0)+1,3,4)),ROW(B1)-1+SUM($B$14:$B$14),0))","v":656},{"$f":"IF(ROW(B1)-1>=$D$14,\"\",OFFSET(INDIRECT(MID(CELL(\"filename\",roll!$A$15),FIND(\"]\",CELL(\"filename\",roll!$A$15))+1,31)&\"!\"&ADDRESS(MATCH(rn_09!$D$9,roll!C:C,0)+1,3,4)),ROW(B1)-1+SUM($B$14:$C$14),0))","v":659},{"$f":"IF(ROW(B1)-1>=$E$14,\"\",OFFSET(INDIRECT(MID(CELL(\"filename\",roll!$A$15),FIND(\"]\",CELL(\"filename\",roll!$A$15))+1,31)&\"!\"&ADDRESS(MATCH(rn_09!$D$9,roll!C:C,0)+1,3,4)),ROW(B1)-1+SUM($B$14:$D$14),0))","v":10161},{"$f":"IF(SUM(B15:E15)>0,1,\"\")","v":1}]
[null,{"$f":"IF(ROW(B2)-1>=$B$14,\"\",OFFSET(INDIRECT(MID(CELL(\"filename\",roll!$A$15),FIND(\"]\",CELL(\"filename\",roll!$A$15))+1,31)&\"!\"&ADDRESS(MATCH(rn_09!$D$9,roll!C:C,0)+1,3,4)),ROW(B2)-1,0))","v":10152},{"$f":"IF(ROW(B2)-1>=$C$14,\"\",OFFSET(INDIRECT(MID(CELL(\"filename\",roll!$A$15),FIND(\"]\",CELL(\"filename\",roll!$A$15))+1,31)&\"!\"&ADDRESS(MATCH(rn_09!$D$9,roll!C:C,0)+1,3,4)),ROW(B2)-1+SUM($B$14:$B$14),0))","v":10157},{"$f":"IF(ROW(B2)-1>=$D$14,\"\",OFFSET(INDIRECT(MID(CELL(\"filename\",roll!$A$15),FIND(\"]\",CELL(\"filename\",roll!$A$15))+1,31)&\"!\"&ADDRESS(MATCH(rn_09!$D$9,roll!C:C,0)+1,3,4)),ROW(B2)-1+SUM($B$14:$C$14),0))","v":10160},{"$f":"IF(ROW(B2)-1>=$E$14,\"\",OFFSET(INDIRECT(MID(CELL(\"filename\",roll!$A$15),FIND(\"]\",CELL(\"filename\",roll!$A$15))+1,31)&\"!\"&ADDRESS(MATCH(rn_09!$D$9,roll!C:C,0)+1,3,4)),ROW(B2)-1+SUM($B$14:$D$14),0))","v":661},{"$f":"IF(SUM(B16:E16)>0,1,\"\")","v":1}]
[null,{"$f":"IF(ROW(B3)-1>=$B$14,\"\",OFFSET(INDIRECT(MID(CELL(\"filename\",roll!$A$15),FIND(\"]\",CELL(\"filename\",roll!$A$15))+1,31)&\"!\"&ADDRESS(MATCH(rn_09!$D$9,roll!C:C,0)+1,3,4)),ROW(B3)-1,0))","v":652},{"$f":"IF(ROW(B3)-1>=$C$14,\"\",OFFSET(INDIRECT(MID(CELL(\"filename\",roll!$A$15),FIND(\"]\",CELL(\"filename\",roll!$A$15))+1,31)&\"!\"&ADDRESS(MATCH(rn_09!$D$9,roll!C:C,0)+1,3,4)),ROW(B3)-1+SUM($B$14:$B$14),0))","v":657},{"$f":"IF(ROW(B3)-1>=$D$14,\"\",OFFSET(INDIRECT(MID(CELL(\"filename\",roll!$A$15),FIND(\"]\",CELL(\"filename\",roll!$A$15))+1,31)&\"!\"&ADDRESS(MATCH(rn_09!$D$9,roll!C:C,0)+1,3,4)),ROW(B3)-1+SUM($B$14:$C$14),0))","v":660},{"$f":"IF(ROW(B3)-1>=$E$14,\"\",OFFSET(INDIRECT(MID(CELL(\"filename\",roll!$A$15),FIND(\"]\",CELL(\"filename\",roll!$A$15))+1,31)&\"!\"&ADDRESS(MATCH(rn_09!$D$9,roll!C:C,0)+1,3,4)),ROW(B3)-1+SUM($B$14:$D$14),0))","v":10162},1]
[null,{"$f":"IF(ROW(B4)-1>=$B$14,\"\",OFFSET(INDIRECT(MID(CELL(\"filename\",roll!$A$15),FIND(\"]\",CELL(\"filename\",roll!$A$15))+1,31)&\"!\"&ADDRESS(MATCH(rn_09!$D$9,roll!C:C,0)+1,3,4)),ROW(B4)-1,0))","v":10153},{"$f":"IF(ROW(B4)-1>=$C$14,\"\",OFFSET(INDIRECT(MID(CELL(\"filename\",roll!$A$15),FIND(\"]\",CELL(\"filename\",roll!$A$15))+1,31)&\"!\"&ADDRESS(MATCH(rn_09!$D$9,roll!C:C,0)+1,3,4)),ROW(B4)-1+SUM($B$14:$B$14),0))","v":10158},{"$f":"IF(ROW(B4)-1>=$D$14,\"\",OFFSET(INDIRECT(MID(CELL(\"filename\",roll!$A$15),FIND(\"]\",CELL(\"filename\",roll!$A$15))+1,31)&\"!\"&ADDRESS(MATCH(rn_09!$D$9,roll!C:C,0)+1,3,4)),ROW(B4)-1+SUM($B$14:$C$14),0))","v":""},{"$f":"IF(ROW(B4)-1>=$E$14,\"\",OFFSET(INDIRECT(MID(CELL(\"filename\",roll!$A$15),FIND(\"]\",CELL(\"filename\",roll!$A$15))+1,31)&\"!\"&ADDRESS(MATCH(rn_09!$D$9,roll!C:C,0)+1,3,4)),ROW(B4)-1+SUM($B$14:$D$14),0))","v":662},1]
[null,{"$f":"IF(ROW(B5)-1>=$B$14,\"\",OFFSET(INDIRECT(MID(CELL(\"filename\",roll!$A$15),FIND(\"]\",CELL(\"filename\",roll!$A$15))+1,31)&\"!\"&ADDRESS(MATCH(rn_09!$D$9,roll!C:C,0)+1,3,4)),ROW(B5)-1,0))","v":653},{"$f":"IF(ROW(B5)-1>=$C$14,\"\",OFFSET(INDIRECT(MID(CELL(\"filename\",roll!$A$15),FIND(\"]\",CELL(\"filename\",roll!$A$15))+1,31)&\"!\"&ADDRESS(MATCH(rn_09!$D$9,roll!C:C,0)+1,3,4)),ROW(B5)-1+SUM($B$14:$B$14),0))","v":658},{"$f":"IF(ROW(B5)-1>=$D$14,\"\",OFFSET(INDIRECT(MID(CELL(\"filename\",roll!$A$15),FIND(\"]\",CELL(\"filename\",roll!$A$15))+1,31)&\"!\"&ADDRESS(MATCH(rn_09!$D$9,roll!C:C,0)+1,3,4)),ROW(B5)-1+SUM($B$14:$C$14),0))","v":""},{"$f":"IF(ROW(B5)-1>=$E$14,\"\",OFFSET(INDIRECT(MID(CELL(\"filename\",roll!$A$15),FIND(\"]\",CELL(\"filename\",roll!$A$15))+1,31)&\"!\"&ADDRESS(MATCH(rn_09!$D$9,roll!C:C,0)+1,3,4)),ROW(B5)-1+SUM($B$14:$D$14),0))","v":10163},1]
[null,{"$f":"IF(ROW(B6)-1>=$B$14,\"\",OFFSET(INDIRECT(MID(CELL(\"filename\",roll!$A$15),FIND(\"]\",CELL(\"filename\",roll!$A$15))+1,31)&\"!\"&ADDRESS(MATCH(rn_09!$D$9,roll!C:C,0)+1,3,4)),ROW(B6)-1,0))","v":10154},{"$f":"IF(ROW(B6)-1>=$C$14,\"\",OFFSET(INDIRECT(MID(CELL(\"filename\",roll!$A$15),FIND(\"]\",CELL(\"filename\",roll!$A$15))+1,31)&\"!\"&ADDRESS(MATCH(rn_09!$D$9,roll!C:C,0)+1,3,4)),ROW(B6)-1+SUM($B$14:$B$14),0))","v":10159},{"$f":"IF(ROW(B6)-1>=$D$14,\"\",OFFSET(INDIRECT(MID(CELL(\"filename\",roll!$A$15),FIND(\"]\",CELL(\"filename\",roll!$A$15))+1,31)&\"!\"&ADDRESS(MATCH(rn_09!$D$9,roll!C:C,0)+1,3,4)),ROW(B6)-1+SUM($B$14:$C$14),0))","v":""},{"$f":"IF(ROW(B6)-1>=$E$14,\"\",OFFSET(INDIRECT(MID(CELL(\"filename\",roll!$A$15),FIND(\"]\",CELL(\"filename\",roll!$A$15))+1,31)&\"!\"&ADDRESS(MATCH(rn_09!$D$9,roll!C:C,0)+1,3,4)),ROW(B6)-1+SUM($B$14:$D$14),0))","v":663},1]
[null,{"$f":"IF(ROW(B7)-1>=$B$14,\"\",OFFSET(INDIRECT(MID(CELL(\"filename\",roll!$A$15),FIND(\"]\",CELL(\"filename\",roll!$A$15))+1,31)&\"!\"&ADDRESS(MATCH(rn_09!$D$9,roll!C:C,0)+1,3,4)),ROW(B7)-1,0))","v":654},{"$f":"IF(ROW(B7)-1>=$C$14,\"\",OFFSET(INDIRECT(MID(CELL(\"filename\",roll!$A$15),FIND(\"]\",CELL(\"filename\",roll!$A$15))+1,31)&\"!\"&ADDRESS(MATCH(rn_09!$D$9,roll!C:C,0)+1,3,4)),ROW(B7)-1+SUM($B$14:$B$14),0))","v":""},{"$f":"IF(ROW(B7)-1>=$D$14,\"\",OFFSET(INDIRECT(MID(CELL(\"filename\",roll!$A$15),FIND(\"]\",CELL(\"filename\",roll!$A$15))+1,31)&\"!\"&ADDRESS(MATCH(rn_09!$D$9,roll!C:C,0)+1,3,4)),ROW(B7)-1+SUM($B$14:$C$14),0))","v":""},{"$f":"IF(ROW(B7)-1>=$E$14,\"\",OFFSET(INDIRECT(MID(CELL(\"filename\",roll!$A$15),FIND(\"]\",CELL(\"filename\",roll!$A$15))+1,31)&\"!\"&ADDRESS(MATCH(rn_09!$D$9,roll!C:C,0)+1,3,4)),ROW(B7)-1+SUM($B$14:$D$14),0))","v":10164},1]
[null,{"$f":"IF(ROW(B8)-1>=$B$14,\"\",OFFSET(INDIRECT(MID(CELL(\"filename\",roll!$A$15),FIND(\"]\",CELL(\"filename\",roll!$A$15))+1,31)&\"!\"&ADDRESS(MATCH(rn_09!$D$9,roll!C:C,0)+1,3,4)),ROW(B8)-1,0))","v":10155},{"$f":"IF(ROW(B8)-1>=$C$14,\"\",OFFSET(INDIRECT(MID(CELL(\"filename\",roll!$A$15),FIND(\"]\",CELL(\"filename\",roll!$A$15))+1,31)&\"!\"&ADDRESS(MATCH(rn_09!$D$9,roll!C:C,0)+1,3,4)),ROW(B8)-1+SUM($B$14:$B$14),0))","v":""},{"$f":"IF(ROW(B8)-1>=$D$14,\"\",OFFSET(INDIRECT(MID(CELL(\"filename\",roll!$A$15),FIND(\"]\",CELL(\"filename\",roll!$A$15))+1,31)&\"!\"&ADDRESS(MATCH(rn_09!$D$9,roll!C:C,0)+1,3,4)),ROW(B8)-1+SUM($B$14:$C$14),0))","v":""},{"$f":"IF(ROW(B8)-1>=$E$14,\"\",OFFSET(INDIRECT(MID(CELL(\"filename\",roll!$A$15),FIND(\"]\",CELL(\"filename\",roll!$A$15))+1,31)&\"!\"&ADDRESS(MATCH(rn_09!$D$9,roll!C:C,0)+1,3,4)),ROW(B8)-1+SUM($B$14:$D$14),0))","v":664},1]
[null,{"$f":"IF(ROW(B9)-1>=$B$14,\"\",OFFSET(INDIRECT(MID(CELL(\"filename\",roll!$A$15),FIND(\"]\",CELL(\"filename\",roll!$A$15))+1,31)&\"!\"&ADDRESS(MATCH(rn_09!$D$9,roll!C:C,0)+1,3,4)),ROW(B9)-1,0))","v":655},{"$f":"IF(ROW(B9)-1>=$C$14,\"\",OFFSET(INDIRECT(MID(CELL(\"filename\",roll!$A$15),FIND(\"]\",CELL(\"filename\",roll!$A$15))+1,31)&\"!\"&ADDRESS(MATCH(rn_09!$D$9,roll!C:C,0)+1,3,4)),ROW(B9)-1+SUM($B$14:$B$14),0))","v":""},{"$f":"IF(ROW(B9)-1>=$D$14,\"\",OFFSET(INDIRECT(MID(CELL(\"filename\",roll!$A$15),FIND(\"]\",CELL(\"filename\",roll!$A$15))+1,31)&\"!\"&ADDRESS(MATCH(rn_09!$D$9,roll!C:C,0)+1,3,4)),ROW(B9)-1+SUM($B$14:$C$14),0))","v":""},{"$f":"IF(ROW(B9)-1>=$E$14,\"\",OFFSET(INDIRECT(MID(CELL(\"filename\",roll!$A$15),FIND(\"]\",CELL(\"filename\",roll!$A$15))+1,31)&\"!\"&ADDRESS(MATCH(rn_09!$D$9,roll!C:C,0)+1,3,4)),ROW(B9)-1+SUM($B$14:$D$14),0))","v":10165},1]
[null,{"$f":"IF(ROW(B10)-1>=$B$14,\"\",OFFSET(INDIRECT(MID(CELL(\"filename\",roll!$A$15),FIND(\"]\",CELL(\"filename\",roll!$A$15))+1,31)&\"!\"&ADDRESS(MATCH(rn_09!$D$9,roll!C:C,0)+1,3,4)),ROW(B10)-1,0))","v":10156},{"$f":"IF(ROW(B10)-1>=$C$14,\"\",OFFSET(INDIRECT(MID(CELL(\"filename\",roll!$A$15),FIND(\"]\",CELL(\"filename\",roll!$A$15))+1,31)&\"!\"&ADDRESS(MATCH(rn_09!$D$9,roll!C:C,0)+1,3,4)),ROW(B10)-1+SUM($B$14:$B$14),0))","v":""},{"$f":"IF(ROW(B10)-1>=$D$14,\"\",OFFSET(INDIRECT(MID(CELL(\"filename\",roll!$A$15),FIND(\"]\",CELL(\"filename\",roll!$A$15))+1,31)&\"!\"&ADDRESS(MATCH(rn_09!$D$9,roll!C:C,0)+1,3,4)),ROW(B10)-1+SUM($B$14:$C$14),0))","v":""},{"$f":"IF(ROW(B10)-1>=$E$14,\"\",OFFSET(INDIRECT(MID(CELL(\"filename\",roll!$A$15),FIND(\"]\",CELL(\"filename\",roll!$A$15))+1,31)&\"!\"&ADDRESS(MATCH(rn_09!$D$9,roll!C:C,0)+1,3,4)),ROW(B10)-1+SUM($B$14:$D$14),0))","v":665},1]
[null,{"$f":"IF(ROW(B11)-1>=$B$14,\"\",OFFSET(INDIRECT(MID(CELL(\"filename\",roll!$A$15),FIND(\"]\",CELL(\"filename\",roll!$A$15))+1,31)&\"!\"&ADDRESS(MATCH(rn_09!$D$9,roll!C:C,0)+1,3,4)),ROW(B11)-1,0))","v":""},{"$f":"IF(ROW(B11)-1>=$C$14,\"\",OFFSET(INDIRECT(MID(CELL(\"filename\",roll!$A$15),FIND(\"]\",CELL(\"filename\",roll!$A$15))+1,31)&\"!\"&ADDRESS(MATCH(rn_09!$D$9,roll!C:C,0)+1,3,4)),ROW(B11)-1+SUM($B$14:$B$14),0))","v":""},{"$f":"IF(ROW(B11)-1>=$D$14,\"\",OFFSET(INDIRECT(MID(CELL(\"filename\",roll!$A$15),FIND(\"]\",CELL(\"filename\",roll!$A$15))+1,31)&\"!\"&ADDRESS(MATCH(rn_09!$D$9,roll!C:C,0)+1,3,4)),ROW(B11)-1+SUM($B$14:$C$14),0))","v":""},{"$f":"IF(ROW(B11)-1>=$E$14,\"\",OFFSET(INDIRECT(MID(CELL(\"filename\",roll!$A$15),FIND(\"]\",CELL(\"filename\",roll!$A$15))+1,31)&\"!\"&ADDRESS(MATCH(rn_09!$D$9,roll!C:C,0)+1,3,4)),ROW(B11)-1+SUM($B$14:$D$14),0))","v":10166},1]
[null,{"$f":"IF(ROW(B12)-1>=$B$14,\"\",OFFSET(INDIRECT(MID(CELL(\"filename\",roll!$A$15),FIND(\"]\",CELL(\"filename\",roll!$A$15))+1,31)&\"!\"&ADDRESS(MATCH(rn_09!$D$9,roll!C:C,0)+1,3,4)),ROW(B12)-1,0))","v":""},{"$f":"IF(ROW(B12)-1>=$C$14,\"\",OFFSET(INDIRECT(MID(CELL(\"filename\",roll!$A$15),FIND(\"]\",CELL(\"filename\",roll!$A$15))+1,31)&\"!\"&ADDRESS(MATCH(rn_09!$D$9,roll!C:C,0)+1,3,4)),ROW(B12)-1+SUM($B$14:$B$14),0))","v":""},{"$f":"IF(ROW(B12)-1>=$D$14,\"\",OFFSET(INDIRECT(MID(CELL(\"filename\",roll!$A$15),FIND(\"]\",CELL(\"filename\",roll!$A$15))+1,31)&\"!\"&ADDRESS(MATCH(rn_09!$D$9,roll!C:C,0)+1,3,4)),ROW(B12)-1+SUM($B$14:$C$14),0))","v":""},{"$f":"IF(ROW(B12)-1>=$E$14,\"\",OFFSET(INDIRECT(MID(CELL(\"filename\",roll!$A$15),FIND(\"]\",CELL(\"filename\",roll!$A$15))+1,31)&\"!\"&ADDRESS(MATCH(rn_09!$D$9,roll!C:C,0)+1,3,4)),ROW(B12)-1+SUM($B$14:$D$14),0))","v":666},1]
[null,{"$f":"IF(ROW(B13)-1>=$B$14,\"\",OFFSET(INDIRECT(MID(CELL(\"filename\",roll!$A$15),FIND(\"]\",CELL(\"filename\",roll!$A$15))+1,31)&\"!\"&ADDRESS(MATCH(rn_09!$D$9,roll!C:C,0)+1,3,4)),ROW(B13)-1,0))","v":""},{"$f":"IF(ROW(B13)-1>=$C$14,\"\",OFFSET(INDIRECT(MID(CELL(\"filename\",roll!$A$15),FIND(\"]\",CELL(\"filename\",roll!$A$15))+1,31)&\"!\"&ADDRESS(MATCH(rn_09!$D$9,roll!C:C,0)+1,3,4)),ROW(B13)-1+SUM($B$14:$B$14),0))","v":""},{"$f":"IF(ROW(B13)-1>=$D$14,\"\",OFFSET(INDIRECT(MID(CELL(\"filename\",roll!$A$15),FIND(\"]\",CELL(\"filename\",roll!$A$15))+1,31)&\"!\"&ADDRESS(MATCH(rn_09!$D$9,roll!C:C,0)+1,3,4)),ROW(B13)-1+SUM($B$14:$C$14),0))","v":""},{"$f":"IF(ROW(B13)-1>=$E$14,\"\",OFFSET(INDIRECT(MID(CELL(\"filename\",roll!$A$15),FIND(\"]\",CELL(\"filename\",roll!$A$15))+1,31)&\"!\"&ADDRESS(MATCH(rn_09!$D$9,roll!C:C,0)+1,3,4)),ROW(B13)-1+SUM($B$14:$D$14),0))","v":""},""]
[null,{"$f":"IF(ROW(B14)-1>=$B$14,\"\",OFFSET(INDIRECT(MID(CELL(\"filename\",roll!$A$15),FIND(\"]\",CELL(\"filename\",roll!$A$15))+1,31)&\"!\"&ADDRESS(MATCH(rn_09!$D$9,roll!C:C,0)+1,3,4)),ROW(B14)-1,0))","v":""},{"$f":"IF(ROW(B14)-1>=$C$14,\"\",OFFSET(INDIRECT(MID(CELL(\"filename\",roll!$A$15),FIND(\"]\",CELL(\"filename\",roll!$A$15))+1,31)&\"!\"&ADDRESS(MATCH(rn_09!$D$9,roll!C:C,0)+1,3,4)),ROW(B14)-1+SUM($B$14:$B$14),0))","v":""},{"$f":"IF(ROW(B14)-1>=$D$14,\"\",OFFSET(INDIRECT(MID(CELL(\"filename\",roll!$A$15),FIND(\"]\",CELL(\"filename\",roll!$A$15))+1,31)&\"!\"&ADDRESS(MATCH(rn_09!$D$9,roll!C:C,0)+1,3,4)),ROW(B14)-1+SUM($B$14:$C$14),0))","v":""},{"$f":"IF(ROW(B14)-1>=$E$14,\"\",OFFSET(INDIRECT(MID(CELL(\"filename\",roll!$A$15),FIND(\"]\",CELL(\"filename\",roll!$A$15))+1,31)&\"!\"&ADDRESS(MATCH(rn_09!$D$9,roll!C:C,0)+1,3,4)),ROW(B14)-1+SUM($B$14:$D$14),0))","v":""},""]
[null,{"$f":"IF(ROW(B15)-1>=$B$14,\"\",OFFSET(INDIRECT(MID(CELL(\"filename\",roll!$A$15),FIND(\"]\",CELL(\"filename\",roll!$A$15))+1,31)&\"!\"&ADDRESS(MATCH(rn_09!$D$9,roll!C:C,0)+1,3,4)),ROW(B15)-1,0))","v":""},{"$f":"IF(ROW(B15)-1>=$C$14,\"\",OFFSET(INDIRECT(MID(CELL(\"filename\",roll!$A$15),FIND(\"]\",CELL(\"filename\",roll!$A$15))+1,31)&\"!\"&ADDRESS(MATCH(rn_09!$D$9,roll!C:C,0)+1,3,4)),ROW(B15)-1+SUM($B$14:$B$14),0))","v":""},{"$f":"IF(ROW(B15)-1>=$D$14,\"\",OFFSET(INDIRECT(MID(CELL(\"filename\",roll!$A$15),FIND(\"]\",CELL(\"filename\",roll!$A$15))+1,31)&\"!\"&ADDRESS(MATCH(rn_09!$D$9,roll!C:C,0)+1,3,4)),ROW(B15)-1+SUM($B$14:$C$14),0))","v":""},{"$f":"IF(ROW(B15)-1>=$E$14,\"\",OFFSET(INDIRECT(MID(CELL(\"filename\",roll!$A$15),FIND(\"]\",CELL(\"filename\",roll!$A$15))+1,31)&\"!\"&ADDRESS(MATCH(rn_09!$D$9,roll!C:C,0)+1,3,4)),ROW(B15)-1+SUM($B$14:$D$14),0))","v":""},""]
[null,{"$f":"IF(ROW(B16)-1>=$B$14,\"\",OFFSET(INDIRECT(MID(CELL(\"filename\",roll!$A$15),FIND(\"]\",CELL(\"filename\",roll!$A$15))+1,31)&\"!\"&ADDRESS(MATCH(rn_09!$D$9,roll!C:C,0)+1,3,4)),ROW(B16)-1,0))","v":""},{"$f":"IF(ROW(B16)-1>=$C$14,\"\",OFFSET(INDIRECT(MID(CELL(\"filename\",roll!$A$15),FIND(\"]\",CELL(\"filename\",roll!$A$15))+1,31)&\"!\"&ADDRESS(MATCH(rn_09!$D$9,roll!C:C,0)+1,3,4)),ROW(B16)-1+SUM($B$14:$B$14),0))","v":""},{"$f":"IF(ROW(B16)-1>=$D$14,\"\",OFFSET(INDIRECT(MID(CELL(\"filename\",roll!$A$15),FIND(\"]\",CELL(\"filename\",roll!$A$15))+1,31)&\"!\"&ADDRESS(MATCH(rn_09!$D$9,roll!C:C,0)+1,3,4)),ROW(B16)-1+SUM($B$14:$C$14),0))","v":""},{"$f":"IF(ROW(B16)-1>=$E$14,\"\",OFFSET(INDIRECT(MID(CELL(\"filename\",roll!$A$15),FIND(\"]\",CELL(\"filename\",roll!$A$15))+1,31)&\"!\"&ADDRESS(MATCH(rn_09!$D$9,roll!C:C,0)+1,3,4)),ROW(B16)-1+SUM($B$14:$D$14),0))","v":""},""]
[null,{"$f":"IF(ROW(B17)-1>=$B$14,\"\",OFFSET(INDIRECT(MID(CELL(\"filename\",roll!$A$15),FIND(\"]\",CELL(\"filename\",roll!$A$15))+1,31)&\"!\"&ADDRESS(MATCH(rn_09!$D$9,roll!C:C,0)+1,3,4)),ROW(B17)-1,0))","v":""},{"$f":"IF(ROW(B17)-1>=$C$14,\"\",OFFSET(INDIRECT(MID(CELL(\"filename\",roll!$A$15),FIND(\"]\",CELL(\"filename\",roll!$A$15))+1,31)&\"!\"&ADDRESS(MATCH(rn_09!$D$9,roll!C:C,0)+1,3,4)),ROW(B17)-1+SUM($B$14:$B$14),0))","v":""},{"$f":"IF(ROW(B17)-1>=$D$14,\"\",OFFSET(INDIRECT(MID(CELL(\"filename\",roll!$A$15),FIND(\"]\",CELL(\"filename\",roll!$A$15))+1,31)&\"!\"&ADDRESS(MATCH(rn_09!$D$9,roll!C:C,0)+1,3,4)),ROW(B17)-1+SUM($B$14:$C$14),0))","v":""},{"$f":"IF(ROW(B17)-1>=$E$14,\"\",OFFSET(INDIRECT(MID(CELL(\"filename\",roll!$A$15),FIND(\"]\",CELL(\"filename\",roll!$A$15))+1,31)&\"!\"&ADDRESS(MATCH(rn_09!$D$9,roll!C:C,0)+1,3,4)),ROW(B17)-1+SUM($B$14:$D$14),0))","v":""},""]
[null,{"$f":"IF(ROW(B18)-1>=$B$14,\"\",OFFSET(INDIRECT(MID(CELL(\"filename\",roll!$A$15),FIND(\"]\",CELL(\"filename\",roll!$A$15))+1,31)&\"!\"&ADDRESS(MATCH(rn_09!$D$9,roll!C:C,0)+1,3,4)),ROW(B18)-1,0))","v":""},{"$f":"IF(ROW(B18)-1>=$C$14,\"\",OFFSET(INDIRECT(MID(CELL(\"filename\",roll!$A$15),FIND(\"]\",CELL(\"filename\",roll!$A$15))+1,31)&\"!\"&ADDRESS(MATCH(rn_09!$D$9,roll!C:C,0)+1,3,4)),ROW(B18)-1+SUM($B$14:$B$14),0))","v":""},{"$f":"IF(ROW(B18)-1>=$D$14,\"\",OFFSET(INDIRECT(MID(CELL(\"filename\",roll!$A$15),FIND(\"]\",CELL(\"filename\",roll!$A$15))+1,31)&\"!\"&ADDRESS(MATCH(rn_09!$D$9,roll!C:C,0)+1,3,4)),ROW(B18)-1+SUM($B$14:$C$14),0))","v":""},{"$f":"IF(ROW(B18)-1>=$E$14,\"\",OFFSET(INDIRECT(MID(CELL(\"filename\",roll!$A$15),FIND(\"]\",CELL(\"filename\",roll!$A$15))+1,31)&\"!\"&ADDRESS(MATCH(rn_09!$D$9,roll!C:C,0)+1,3,4)),ROW(B18)-1+SUM($B$14:$D$14),0))","v":""},""]
[null,{"$f":"IF(ROW(B19)-1>=$B$14,\"\",OFFSET(INDIRECT(MID(CELL(\"filename\",roll!$A$15),FIND(\"]\",CELL(\"filename\",roll!$A$15))+1,31)&\"!\"&ADDRESS(MATCH(rn_09!$D$9,roll!C:C,0)+1,3,4)),ROW(B19)-1,0))","v":""},{"$f":"IF(ROW(B19)-1>=$C$14,\"\",OFFSET(INDIRECT(MID(CELL(\"filename\",roll!$A$15),FIND(\"]\",CELL(\"filename\",roll!$A$15))+1,31)&\"!\"&ADDRESS(MATCH(rn_09!$D$9,roll!C:C,0)+1,3,4)),ROW(B19)-1+SUM($B$14:$B$14),0))","v":""},{"$f":"IF(ROW(B19)-1>=$D$14,\"\",OFFSET(INDIRECT(MID(CELL(\"filename\",roll!$A$15),FIND(\"]\",CELL(\"filename\",roll!$A$15))+1,31)&\"!\"&ADDRESS(MATCH(rn_09!$D$9,roll!C:C,0)+1,3,4)),ROW(B19)-1+SUM($B$14:$C$14),0))","v":""},{"$f":"IF(ROW(B19)-1>=$E$14,\"\",OFFSET(INDIRECT(MID(CELL(\"filename\",roll!$A$15),FIND(\"]\",CELL(\"filename\",roll!$A$15))+1,31)&\"!\"&ADDRESS(MATCH(rn_09!$D$9,roll!C:C,0)+1,3,4)),ROW(B19)-1+SUM($B$14:$D$14),0))","v":""},""]
[null,{"$f":"IF(ROW(B20)-1>=$B$14,\"\",OFFSET(INDIRECT(MID(CELL(\"filename\",roll!$A$15),FIND(\"]\",CELL(\"filename\",roll!$A$15))+1,31)&\"!\"&ADDRESS(MATCH(rn_09!$D$9,roll!C:C,0)+1,3,4)),ROW(B20)-1,0))","v":""},{"$f":"IF(ROW(B20)-1>=$C$14,\"\",OFFSET(INDIRECT(MID(CELL(\"filename\",roll!$A$15),FIND(\"]\",CELL(\"filename\",roll!$A$15))+1,31)&\"!\"&ADDRESS(MATCH(rn_09!$D$9,roll!C:C,0)+1,3,4)),ROW(B20)-1+SUM($B$14:$B$14),0))","v":""},{"$f":"IF(ROW(B20)-1>=$D$14,\"\",OFFSET(INDIRECT(MID(CELL(\"filename\",roll!$A$15),FIND(\"]\",CELL(\"filename\",roll!$A$15))+1,31)&\"!\"&ADDRESS(MATCH(rn_09!$D$9,roll!C:C,0)+1,3,4)),ROW(B20)-1+SUM($B$14:$C$14),0))","v":""},{"$f":"IF(ROW(B20)-1>=$E$14,\"\",OFFSET(INDIRECT(MID(CELL(\"filename\",roll!$A$15),FIND(\"]\",CELL(\"filename\",roll!$A$15))+1,31)&\"!\"&ADDRESS(MATCH(rn_09!$D$9,roll!C:C,0)+1,3,4)),ROW(B20)-1+SUM($B$14:$D$14),0))","v":""},""]
[]
[null,"परीक्षा प्रभारी",null,null,"केन्द्राधीक्षक "]
[null,{"$f":"rn_01!$B$37","v":"ASD (Lecturer)"},null,null,{"$f":"rn_01!$E$37","v":"XYZ (Principal)"}]

{"sheet":"pks","index":11,"n_rows":10,"n_cols":1,"rows_kept":10,"cut":false,"hidden":false,"merged":[[7,0,7,9],[8,0,8,9],[9,0,9,9],[10,0,10,9],[4,0,4,9],[6,0,6,9],[0,0,0,9],[1,0,1,9],[2,0,2,9],[3,0,3,9],[5,0,5,9]]}
["pksaini"]
["Auto Examination Seating Arrangement Utility"]
["for 800 candidates (students)"]
["Specially Class Eightth Board Exam"]
[]
["1. EXAM CENTRE DETAIL"]
["2. ROLL NUMBER DETAIL"]
["3. PRINT PDF "]
["4. FORMAT 1, 2, 3                                                       To unlock these format password are \"password\""]
["5. ROLL NUMBER SERIES 2, 3"]

{"sheet":"p-2","index":12,"n_rows":30,"n_cols":11,"rows_kept":30,"cut":false,"hidden":false,"merged":[[28,2,28,5],[29,2,29,5],[25,6,25,10],[25,0,25,2],[0,0,0,10],[1,0,1,10],[2,0,2,10]]}
["कार्यालय प्रधानाचार्य एवं अध्यक्ष, प्रारंभिक शिक्षा पूर्णता प्रमाण पत्र परीक्षा, 2024 डाइट अलवर"]
["Email-dietalwar@gmail.com"]
["परीक्षा केंद्र एवं नोडल (संग्रहण) केंद्र व्यय विवरण "]
[null,"परीक्षा केंद्र कोड नंबर :",80905,null,null,null,null,"परीक्षार्थी संख्यां :",164]
["क्र. सं.","पदनाम- केन्द्राधीक्षक/परीक्षा प्रभारी/पर्यवीक्षक/वीक्षक/सहा कर्मचारी","नाम कार्मिक","कुल दिवस ","मानदेय \nदर","कुल मानदेय ","बैंक खाता संख्यां","बैंक एवं शाखा","आई एफ एस सी कोड","एम्प्लोयी आईडी","हस्ताक्षर"]
[1,"केन्द्राधीक्षक",null,6,100,{"$f":"D6*E6","v":600}]
[2,"परीक्षा प्रभारी",null,6,90,{"$f":"D7*E7","v":540}]
[3,"वीक्षक/परिवीक्षक ",null,6,80,480]
[4,"वीक्षक/परिवीक्षक ",null,5,80,400]
[5,"वीक्षक/परिवीक्षक ",null,2,80,160]
[6,"वीक्षक/परिवीक्षक ",null,3,80,240]
[7,"वीक्षक/परिवीक्षक ",null,6,80,480]
[8,"वीक्षक/परिवीक्षक ",null,2,80,160]
[9,"वीक्षक/परिवीक्षक ",null,4,80,320]
[10,"वीक्षक/परिवीक्षक ",null,3,80,240]
[11,"वीक्षक/परिवीक्षक ",null,5,80,400]
[12,"वीक्षक/परिवीक्षक ",null,5,80,400]
[13,"वीक्षक/परिवीक्षक ",null,6,80,480]
[14,"वीक्षक/परिवीक्षक ",null,4,80,320]
[15,"वीक्षक/परिवीक्षक ",null,1,80,80]
[16,"वीक्षक/परिवीक्षक ",null,2,80,160]
[17,"वीक्षक/परिवीक्षक ",null,1,80,80]
[18,"वीक्षक/परिवीक्षक ",null,1,80,80]
[19,"सहायक कर्मचारी",null,3,50,150]
[20,"सहायक कर्मचारी",null,3,50,150]
["मानदेय का कुल योग -",null,null,{"$f":"SUM(D6:D25)","v":74},{"$f":"SUM(E6:E25)","v":1570},{"$f":"SUM(F6:F25)","v":5920}]
[]
[null,"हस्ताक्षर केन्द्राधीक्षक"]
[null,"नाम केन्द्राधीक्षक :"]
[null,"मोबाइल नंबर : "]

{"sheet":"p-3","index":13,"n_rows":15,"n_cols":12,"rows_kept":15,"cut":false,"hidden":false,"merged":[[13,2,13,3],[14,2,14,3],[10,0,10,3],[10,7,10,11],[0,0,0,11],[1,0,1,11],[2,0,2,11]]}
[{"$f":"'p-2'!$A$1","v":"कार्यालय प्रधानाचार्य एवं अध्यक्ष, प्रारंभिक शिक्षा पूर्णता प्रमाण पत्र परीक्षा, 2024 डाइट अलवर"}]
[{"$f":"'p-2'!$A$2","v":"Email-dietalwar@gmail.com"}]
["परीक्षा केंद्र द्वारा बण्डल भेजने का व्यय विवरण "]
["क्र. सं.","कार्मिक का नाम","पद नाम ","दिनांक ","बण्डल का किराया ","कार्मिक का किराया ","कुल व्यय ","Bank Account Number","Bank Name & Branch Name","Bank IFSC","Employee ID","हस्ताक्षर"]
[1,null,"वरिष्ठ अध्या","2024-03-28",0,60,{"$f":"E5+F5","v":60}]
[2,null,"वरिष्ठ अध्या","2024-03-29",0,60,60]
[3,null,"वरिष्ठ अध्या","2024-03-30",0,60,60]
[4,null,"वरिष्ठ अध्या","2024-03-31",0,60,60]
[5,null,"वरिष्ठ अध्या","2024-04-01",0,60,60]
[6,null,"वरिष्ठ अध्या","2024-04-02",0,60,60]
["मानदेय का कुल योग ",null,null,null,{"$f":"SUM(E5:E10)","v":0},360,{"$f":"SUM(G5:G10)","v":360}]
[]
[null,"हस्ताक्षर केन्द्राधीक्षक"]
[null,"नाम केन्द्राधीक्षक :",{"$f":"'p-2'!$C$29","v":0}]
[null,"मोबाइल नंबर : ",{"$f":"'p-2'!$C$30","v":0}]

{"sheet":"p-1","index":14,"n_rows":27,"n_cols":5,"rows_kept":27,"cut":false,"hidden":false,"merged":[[4,1,4,3],[5,1,5,3],[6,1,6,3],[25,2,25,3],[26,2,26,3],[17,1,17,3],[18,1,18,3],[19,1,19,3],[20,1,20,3],[21,1,21,3],[2,0,2,4],[16,0,16,3],[22,0,22,4],[1,0,1,4],[0,0,0,4],[11,1,11,3],[12,1,12,3],[13,1,13,3],[14,1,14,3],[15,1,15,3],[3,0,3,1],[17,0,21,0],[7,1,7,3],[8,1,8,3],[9,1,9,3],[10,1,10,3]]}
[{"$f":"'p-2'!$A$1","v":"कार्यालय प्रधानाचार्य एवं अध्यक्ष, प्रारंभिक शिक्षा पूर्णता प्रमाण पत्र परीक्षा, 2024 डाइट अलवर"}]
[{"$f":"'p-2'!$A$2","v":"Email-dietalwar@gmail.com"}]
["परीक्षा केंद्र एवं नोडल (संग्रहण) केंद्र व्यय का मदवार इकजाई विवरण"]
["परीक्षा केंद्र कोड नं. -",null,{"$f":"'p-2'!$C$4","v":80905},"परीक्षार्थी संख्यां -",{"$f":"'p-2'!$I$4","v":164}]
["क्र.सं.","मदवार व्यय",null,null,"कुल व्यय"]
[1,"केन्द्राधीक्षक का मानदेय -",null,null,{"$f":"'p-2'!$F$6","v":600}]
[2,"परीक्षा प्रभारी का मानदेय -",null,null,{"$f":"'p-2'!$F$7","v":540}]
[3,"परिवीक्षकों का मानदेय -",null,null,{"$f":"80*2*6","v":960}]
[4,"वीक्षकों का मानदेय -",null,null,{"$f":"80*7*6","v":3360}]
[5,"सहायक कर्मचारियों का मानदेय -",null,null,{"$f":"50*6*2","v":600}]
[6,"उत्तर-पुस्तिका जांच हेतु मानदेय -",null,null,0]
[7,"परीक्षा केंद्र हेतु स्टेशनरी आदि व्यय हेतु रु. 500/-",null,null,500]
[8,"नोडल (संग्रहण) केंद्र के लिए स्टेशनरी आदि व्यय हेतु रु. 1000/-",null,null,0]
[9,"उत्तर पुस्तिका परिवहन व्यय",null,null,360]
[10,"प्रश्न पत्र पेटिका परिवहन व्यय",null,null,500]
[11,"परीक्षा दिवस को पुलिस थाने से प्रश्न पत्र लाने का किराया",null,null,360]
["सर्व योग",null,null,null,{"$f":"SUM(E6:E16)","v":7780}]
[null,"बैंक खाता संख्यां जिसमे राशी जमा की जानी हैं -"]
[null,"खाता धारक का नाम -"]
[null,"बैंक शाखा का नाम -"]
[null,"बैंक  IFSC कोड"]
[null,"संस्था का  TAN नंबर"]
["नोट : नोडल (संग्रहण)/ परीक्षा केंद्र बैंक पासबुक की प्रति जमा करें -"]
[]
[null,"हस्ताक्षर केन्द्राधीक्षक"]
[null,"नाम केन्द्राधीक्षक :",{"$f":"'p-2'!$C$29","v":0}]
[null,"मोबाइल नंबर : ",{"$f":"'p-2'!$C$30","v":0}]

{"sheet":"rs-2","index":15,"n_rows":30,"n_cols":7,"rows_kept":30,"cut":false,"hidden":false,"merged":[[19,1,20,1],[19,2,20,2],[19,6,20,6],[25,1,26,1],[25,2,26,2],[25,6,26,6],[21,1,22,1],[21,2,22,2],[21,6,22,6],[23,1,24,1],[23,2,24,2],[23,6,24,6],[15,1,16,1],[15,2,16,2],[15,6,16,6],[17,1,18,1],[17,2,18,2],[17,6,18,6],[11,1,12,1],[11,2,12,2],[11,6,12,6],[13,1,14,1],[13,2,14,2],[13,6,14,6],[7,1,8,1],[7,2,8,2],[7,6,8,6],[9,1,10,1],[9,2,10,2],[9,6,10,6],[4,1,4,6],[1,1,1,6],[2,1,2,6],[3,1,3,6],[5,1,6,1],[5,2,6,2],[5,3,5,5],[5,6,6,6]]}
[]
[null,{"$f":"rn_01!$B$1","v":"Class VIIITH Board Examination, 2025"}]
[null,{"$f":"rn_01!$B$2","v":"परीक्षा केंद्र नाम एवं परीक्षा केंद्र क्रमांक"}]
[null,{"$f":"rn_01!$B$3","v":"GSSS Malutana (12345)"}]
[null,"परीक्षार्थी समेकित बैठक व्यवस्था"]
[null,"क्र.\nसं.","कक्ष \nक्रमांक","रोल नंबर",null,null,"कुल \nपरीक्षार्थी"]
[null,null,null," से","तक","कुल"]
[null,1,"001",null,null,{"$f":"IF(D8=\"\",\"\",E8-D8+1)","v":""},{"$f":"SUM(F8:F9)","v":0}]
[null,null,null,null,null,{"$f":"IF(D9=\"\",\"\",E9-D9+1)","v":""}]
[null,2,"002",null,null,"",{"$f":"SUM(F10:F11)","v":0}]
[null,null,null,null,null,""]
[null,3,"003",null,null,"",{"$f":"SUM(F12:F13)","v":0}]
[null,null,null,null,null,""]
[null,4,"004",null,null,"",{"$f":"SUM(F14:F15)","v":0}]
[null,null,null,null,null,""]
[null,5,"005",null,null,"",{"$f":"SUM(F16:F17)","v":0}]
[null,null,null,null,null,""]
[null,6,"006",null,null,"",{"$f":"SUM(F18:F19)","v":0}]
[null,null,null,null,null,""]
[null,7,"007",null,null,"",{"$f":"SUM(F20:F21)","v":0}]
[null,null,null,null,null,""]
[null,8,"008",null,null,"",{"$f":"SUM(F22:F23)","v":0}]
[null,null,null,null,null,""]
[null,9,"009",null,null,"",{"$f":"SUM(F24:F25)","v":0}]
[null,null,null,null,null,""]
[null,10,"010",null,null,"",{"$f":"SUM(F26:F27)","v":0}]
[null,null,null,null,null,""]
[]
[null,"परीक्षा प्रभारी",null,null,null,"केन्द्राधीक्षक"]
[null,{"$f":"rn_01!$B$37","v":"ASD (Lecturer)"},null,null,null,{"$f":"rn_01!$E$37","v":"XYZ (Principal)"}]

{"sheet":"rs-3","index":16,"n_rows":40,"n_cols":7,"rows_kept":40,"cut":false,"hidden":false,"merged":[[25,1,27,1],[25,2,27,2],[25,6,27,6],[34,1,36,1],[34,2,36,2],[34,6,36,6],[28,1,30,1],[28,2,30,2],[28,6,30,6],[31,1,33,1],[31,2,33,2],[31,6,33,6],[19,1,21,1],[19,2,21,2],[19,6,21,6],[22,1,24,1],[22,2,24,2],[22,6,24,6],[13,1,15,1],[13,2,15,2],[13,6,15,6],[16,1,18,1],[16,2,18,2],[16,6,18,6],[7,1,9,1],[7,2,9,2],[7,6,9,6],[10,1,12,1],[10,2,12,2],[10,6,12,6],[4,1,4,6],[1,1,1,6],[2,1,2,6],[3,1,3,6],[5,1,6,1],[5,2,6,2],[5,3,5,5],[5,6,6,6]]}
[]
[null,{"$f":"rn_01!$B$1","v":"Class VIIITH Board Examination, 2025"}]
[null,{"$f":"rn_01!$B$2","v":"परीक्षा केंद्र नाम एवं परीक्षा केंद्र क्रमांक"}]
[null,{"$f":"rn_01!$B$3","v":"GSSS Malutana (12345)"}]
[null,"परीक्षार्थी समेकित बैठक व्यवस्था"]
[null,"क्र.\nसं.","कक्ष \nक्रमांक","रोल नंबर",null,null,"कुल \nपरीक्षार्थी"]
[null,null,null," से","तक","कुल"]
[null,1,"001",501,510,{"$f":"IF(D8=\"\",\"\",E8-D8+1)","v":10},{"$f":"SUM(F8:F10)","v":10}]
[null,null,null,null,null,{"$f":"IF(D9=\"\",\"\",E9-D9+1)","v":""}]
[null,null,null,null,null,""]
[null,2,"002",null,null,"",{"$f":"SUM(F11:F13)","v":0}]
[null,null,null,null,null,""]
[null,null,null,null,null,""]
[null,3,"003",null,null,"",{"$f":"SUM(F14:F16)","v":0}]
[null,null,null,null,null,""]
[null,null,null,null,null,""]
[null,4,"004",null,null,"",{"$f":"SUM(F17:F19)","v":0}]
[null,null,null,null,null,""]
[null,null,null,null,null,""]
[null,5,"005",null,null,"",{"$f":"SUM(F20:F22)","v":0}]
[null,null,null,null,null,""]
[null,null,null,null,null,""]
[null,6,"006",null,null,"",{"$f":"SUM(F23:F25)","v":0}]
[null,null,null,null,null,""]
[null,null,null,null,null,""]
[null,7,"007",null,null,"",{"$f":"SUM(F26:F28)","v":0}]
[null,null,null,null,null,""]
[null,null,null,null,null,""]
[null,8,"008",null,null,"",{"$f":"SUM(F29:F31)","v":0}]
[null,null,null,null,null,""]
[null,null,null,null,null,""]
[null,9,"009",null,null,"",{"$f":"SUM(F32:F34)","v":0}]
[null,null,null,null,null,""]
[null,null,null,null,null,""]
[null,10,"010",null,null,"",{"$f":"SUM(F35:F37)","v":0}]
[null,null,null,null,null,""]
[null,null,null,null,null,""]
[]
[null,"परीक्षा प्रभारी",null,null,null,"केन्द्राधीक्षक"]
[null,{"$f":"rn_01!$B$37","v":"ASD (Lecturer)"},null,null,null,{"$f":"rn_01!$E$37","v":"XYZ (Principal)"}]