{"text_format":"1","workbook":"xlsx","n_sheets":3,"sheets":["Info Sheet","Sheet2","Arrear Sheet"],"not_rendered":{"charts":0,"images":0,"macros":1,"external_links":0,"defined_names":6,"comments":0,"pivot_tables":0},"unopened":[],"bounds":{"document_bytes":16777216,"sheet_cells":100000,"rows_first":2000,"rows_last":500,"rows_between":2000,"halvings":0,"cell_chars":16384,"cell_head_chars":4096},"cells_cut":0,"cells_raw":0,"read":"whole","date_system":"1900"}

{"sheet":"Info Sheet","index":0,"n_rows":77,"n_cols":17,"rows_kept":77,"cut":false,"hidden":false,"merged":[[1,1,1,16],[0,1,0,10],[3,7,3,8],[3,9,4,9],[3,10,4,10],[3,1,4,1],[3,2,4,2],[3,3,4,3],[3,4,3,6],[2,1,2,10],[2,12,2,16],[3,12,4,12],[3,13,3,15],[3,16,4,16]]}
[]
[null,"Automatic Arrear Calculator\nfrom January 01, 2021 to Today (31.12.2026)"]
[]
[null,"SN","Employee Name","Designation","Arrear Detail",null,null,"Basic Pay",null,"PF \nType","ITax/TDS",null,"Month\n/Year","DA Rate",null,null,"HRA\nRate"]
[null,null,null,null,"Type","From","To","Due","Drawn",null,null,null,null,"Due","Drawn","Diff"]
[null,{"$f":"IF(C6=\"\",\"\",COUNTA($C$6:C6))","v":1},"Pramod Kumar Saini","Teacher","Salary","2021-01-01","2021-11-01",47900,45100,"GPF 2004",0.1,null,"2021-01-01",17,17,{"$f":"N6-O6","v":0},8]
[null,{"$f":"IF(C7=\"\",\"\",COUNTA($C$6:C7))","v":""},null,null,null,null,null,null,null,null,null,null,"2021-02-01",17,17,0,8]
[null,{"$f":"IF(C8=\"\",\"\",COUNTA($C$6:C8))","v":""},null,null,null,null,null,null,null,null,null,null,"2021-03-01",17,17,0,8]
[null,{"$f":"IF(C9=\"\",\"\",COUNTA($C$6:C9))","v":""},null,null,null,null,null,null,null,null,null,null,"2021-04-01",17,17,0,8]
[null,{"$f":"IF(C10=\"\",\"\",COUNTA($C$6:C10))","v":""},null,null,null,null,null,null,null,null,null,null,"2021-05-01",17,17,0,8]
[null,{"$f":"IF(C11=\"\",\"\",COUNTA($C$6:C11))","v":""},null,null,null,null,null,null,null,null,null,null,"2021-06-01",17,17,0,8]
[null,{"$f":"IF(C12=\"\",\"\",COUNTA($C$6:C12))","v":""},null,null,null,null,null,null,null,null,null,null,"2021-07-01",31,17,14,9]
[null,{"$f":"IF(C13=\"\",\"\",COUNTA($C$6:C13))","v":""},null,null,null,null,null,null,null,null,null,null,"2021-08-01",31,17,14,9]
[null,{"$f":"IF(C14=\"\",\"\",COUNTA($C$6:C14))","v":""},null,null,null,null,null,null,null,null,null,null,"2021-09-01",31,17,14,9]
[null,{"$f":"IF(C15=\"\",\"\",COUNTA($C$6:C15))","v":""},null,null,null,null,null,null,null,null,null,null,"2021-10-01",31,31,0,9]
[null,{"$f":"IF(C16=\"\",\"\",COUNTA($C$6:C16))","v":""},null,null,null,null,null,null,null,null,null,null,"2021-11-01",31,31,0,9]
[null,{"$f":"IF(C17=\"\",\"\",COUNTA($C$6:C17))","v":""},null,null,null,null,null,null,null,null,null,null,"2021-12-01",31,31,0,9]
[null,{"$f":"IF(C18=\"\",\"\",COUNTA($C$6:C18))","v":""},null,null,null,null,null,null,null,null,null,null,"2022-01-01",34,31,3,9]
[null,{"$f":"IF(C19=\"\",\"\",COUNTA($C$6:C19))","v":""},null,null,null,null,null,null,null,null,null,null,"2022-02-01",34,31,3,9]
[null,{"$f":"IF(C20=\"\",\"\",COUNTA($C$6:C20))","v":""},null,null,null,null,null,null,null,null,null,null,"2022-03-01",34,31,3,9]
[null,null,null,null,null,null,null,null,null,null,null,null,"2022-04-01",34,34,0,9]
[null,null,null,null,null,null,null,null,null,null,null,null,"2022-05-01",34,34,0,9]
[null,null,null,null,null,null,null,null,null,null,null,null,"2022-06-01",34,34,0,9]
[null,null,null,null,null,null,null,null,null,null,null,null,"2022-07-01",38,34,4,9]
[null,null,null,null,null,null,null,null,null,null,null,null,"2022-08-01",38,34,4,9]
[null,null,null,null,null,null,null,null,null,null,null,null,"2022-09-01",38,34,4,9]
[null,null,null,null,null,null,null,null,null,null,null,null,"2022-10-01",38,38,0,9]
[null,null,null,null,null,null,null,null,null,null,null,null,"2022-11-01",38,38,0,9]
[null,null,null,null,null,null,null,null,null,null,null,null,"2022-12-01",38,38,0,9]
[null,null,null,null,null,null,null,null,null,null,null,null,"2023-01-01",42,38,4,9]
{"$rows_left_out":48}
{"sheet":"Sheet2","index":1,"n_rows":77,"n_cols":33,"rows_kept":77,"cut":false,"hidden":true,"merged":[]}
[]
[]
[]
[null,{"$f":"'Arrear Sheet'!B3","v":1},{"$f":"VLOOKUP(B4,'Info Sheet'!$B$6:$K$20,4,0)&\" Arrear from \"&TEXT(VLOOKUP(B4,'Info Sheet'!$B$6:$K$20,5,0),\"DD-MMM-YYYY\")& \" to \"&TEXT(VLOOKUP(B4,'Info Sheet'!$B$6:$K$20,6,0),\"MMM-YYYY\")","v":"Salary Arrear from 01-Jan-2021 to Nov-2021"},null,null,null,null,null,null,null,null,null,null,null,null,null,null,null,null,null,null,null,null,{"$f":"IFERROR(VLOOKUP(B4,'Info Sheet'!$B$6:$K$20,9,0),\"\")","v":"GPF 2004"},null,null,null,null,null,null,null,"RGHS"]
[null,{"$f":"IFERROR(VLOOKUP(B4,'Info Sheet'!$B$6:$K$20,2,0),\"\")","v":"Pramod Kumar Saini"},null,null,null,{"$f":"IFERROR(VLOOKUP(B4,'Info Sheet'!$B$6:$K$20,3,0),\"\")","v":"Teacher"},null,null,null,{"$f":"IFERROR(VLOOKUP($B$4,'Info Sheet'!$B$6:$K$20,10,0),\"\")","v":0.1}]
[null,{"$f":"T6","v":"1-2021"},{"$f":"IFERROR(IF(T6=\"\",0,IF($N$11=$R$6,$M$12,0)),\"\")","v":47900},{"$f":"ROUND(C6*'Info Sheet'!N6/100,0)","v":8143},{"$f":"ROUND(C6*'Info Sheet'!Q6/100,0)","v":3832},{"$f":"IFERROR(IF(T6=\"\",0,IF($N$11=$R$6,$N$12,0)),\"\")","v":45100},{"$f":"ROUND(F6*'Info Sheet'!N6/100,0)","v":7667},{"$f":"ROUND(F6*'Info Sheet'!Q6/100,0)","v":3608},null,{"$f":"ROUND((SUM(C6:E6)-SUM(F6:H6))*$J$5,0)","v":350},null,null,{"$f":"DAY(IFERROR(VLOOKUP($B$4,saini,5,0),\"Error\"))","v":1},{"$f":"VLOOKUP(N9,Q6:S77,3,0)","v":30},1,2021,{"$f":"O6&\"-\"&P6","v":"1-2021"},1,31,{"$f":"IFERROR(IF($N$10<R6,\"\",IF($N$11<=R6,Q6,\"\")),\"\")","v":"1-2021"},null,{"$f":"IF(C6>=$M$13,C6,0)","v":47900},{"$f":"IF(F6>=$N$13,F6,0)","v":45100},{"$f":"IF(V6>51500,3575,IF(V6>38500,2850,IF(V6>28500,2100,IF(V6>23000,1625,IF(V6>0,1450,0)))))","v":2850},{"$f":"IF(V6>167000,10500,IF(V6>116000,8900,IF(V6>80000,6150,IF(V6>72000,4800,IF(V6>62000,4200,X6)))))","v":2850},{"$f":"ROUND(C6*'Info Sheet'!P6/100,0)","v":0},{"$f":"Y6+Z6","v":2850},{"$f":"IF(W6>51500,3575,IF(W6>38500,2850,IF(W6>28500,2100,IF(W6>23000,1625,IF(W6>0,1450,0)))))","v":2850},{"$f":"IF(W6>167000,10500,IF(W6>116000,8900,IF(W6>80000,6150,IF(W6>72000,4800,IF(W6>62000,4200,AB6)))))","v":2850},{"$f":"ROUND(F6*'Info Sheet'!P6/100,0)","v":0},{"$f":"AC6+AD6","v":2850},{"$f":"IF(V6>54000,875,IF(V6>33500,658,IF(V6>18000,440,IF(V6>0,265,0))))","v":658},{"$f":"IF(W6>54000,875,IF(W6>33500,658,IF(W6>18000,440,IF(W6>0,265,0))))","v":658}]
[null,{"$f":"T7","v":"2-2021"},{"$f":"IFERROR(IF(T7=\"\",0,IF(C6>0,$M$13,$M$12)),\"\")","v":47900},{"$f":"ROUND(C7*'Info Sheet'!N7/100,0)","v":8143},{"$f":"ROUND(C7*'Info Sheet'!Q7/100,0)","v":3832},{"$f":"IFERROR(IF(T7=\"\",0,IF(F6>0,$N$13,$N$12)),\"\")","v":45100},{"$f":"ROUND(F7*'Info Sheet'!N7/100,0)","v":7667},{"$f":"ROUND(F7*'Info Sheet'!Q7/100,0)","v":3608},null,350,null,null,{"$f":"MONTH(IFERROR(VLOOKUP($B$4,saini,5,0),\"Error\"))","v":1},{"$f":"MONTH(IFERROR(VLOOKUP($B$4,saini,6,0),\"Error\"))","v":11},2,2021,{"$f":"O7&\"-\"&P7","v":"2-2021"},2,28,"2-2021",null,{"$f":"IF(C7>=$M$13,C7,0)","v":47900},{"$f":"IF(F7>=$N$13,F7,0)","v":45100},{"$f":"IF(V7>51500,3575,IF(V7>38500,2850,IF(V7>28500,2100,IF(V7>23000,1625,IF(V7>0,1450,0)))))","v":2850},{"$f":"IF(V7>167000,10500,IF(V7>116000,8900,IF(V7>80000,6150,IF(V7>72000,4800,IF(V7>62000,4200,X7)))))","v":2850},{"$f":"ROUND(C7*'Info Sheet'!P7/100,0)","v":0},{"$f":"Y7+Z7","v":2850},{"$f":"IF(W7>51500,3575,IF(W7>38500,2850,IF(W7>28500,2100,IF(W7>23000,1625,IF(W7>0,1450,0)))))","v":2850},{"$f":"IF(W7>167000,10500,IF(W7>116000,8900,IF(W7>80000,6150,IF(W7>72000,4800,IF(W7>62000,4200,AB7)))))","v":2850},{"$f":"ROUND(F7*'Info Sheet'!P7/100,0)","v":0},{"$f":"AC7+AD7","v":2850},{"$f":"IF(V7>54000,875,IF(V7>33500,658,IF(V7>18000,440,IF(V7>0,265,0))))","v":658},{"$f":"IF(W7>54000,875,IF(W7>33500,658,IF(W7>18000,440,IF(W7>0,265,0))))","v":658}]
[null,"3-2021",{"$f":"IFERROR(IF(T8=\"\",0,IF(C7>0,$M$13,$M$12)),\"\")","v":47900},{"$f":"ROUND(C8*'Info Sheet'!N8/100,0)","v":8143},{"$f":"ROUND(C8*'Info Sheet'!Q8/100,0)","v":3832},{"$f":"IFERROR(IF(T8=\"\",0,IF(F7>0,$N$13,$N$12)),\"\")","v":45100},{"$f":"ROUND(F8*'Info Sheet'!N8/100,0)","v":7667},{"$f":"ROUND(F8*'Info Sheet'!Q8/100,0)","v":3608},null,350,null,null,{"$f":"YEAR(IFERROR(VLOOKUP($B$4,saini,5,0),\"Error\"))","v":2021},{"$f":"YEAR(IFERROR(VLOOKUP($B$4,saini,6,0),\"Error\"))","v":2021},3,2021,"3-2021",3,31,"3-2021",null,47900,45100,2850,2850,{"$f":"ROUND(C8*'Info Sheet'!P8/100,0)","v":0},2850,2850,2850,{"$f":"ROUND(F8*'Info Sheet'!P8/100,0)","v":0},2850,658,658]
[null,"4-2021",{"$f":"IFERROR(IF(T9=\"\",0,IF(C8>0,$M$13,$M$12)),\"\")","v":47900},{"$f":"ROUND(C9*'Info Sheet'!N9/100,0)","v":8143},{"$f":"ROUND(C9*'Info Sheet'!Q9/100,0)","v":3832},{"$f":"IFERROR(IF(T9=\"\",0,IF(F8>0,$N$13,$N$12)),\"\")","v":45100},{"$f":"ROUND(F9*'Info Sheet'!N9/100,0)","v":7667},{"$f":"ROUND(F9*'Info Sheet'!Q9/100,0)","v":3608},null,350,null,null,{"$f":"M7&\"-\"&M8","v":"1-2021"},{"$f":"N7&\"-\"&N8","v":"11-2021"},4,2021,"4-2021",4,30,"4-2021",null,47900,45100,2850,2850,{"$f":"ROUND(C9*'Info Sheet'!P9/100,0)","v":0},2850,2850,2850,{"$f":"ROUND(F9*'Info Sheet'!P9/100,0)","v":0},2850,658,658]
[null,"5-2021",{"$f":"IFERROR(IF(T10=\"\",0,IF(C9>0,$M$13,$M$12)),\"\")","v":47900},{"$f":"ROUND(C10*'Info Sheet'!N10/100,0)","v":8143},{"$f":"ROUND(C10*'Info Sheet'!Q10/100,0)","v":3832},{"$f":"IFERROR(IF(T10=\"\",0,IF(F9>0,$N$13,$N$12)),\"\")","v":45100},{"$f":"ROUND(F10*'Info Sheet'!N10/100,0)","v":7667},{"$f":"ROUND(F10*'Info Sheet'!Q10/100,0)","v":3608},null,350,null,null,{"$f":"VLOOKUP(M9,Q6:S77,3,0)-M6+1","v":31},{"$f":"VLOOKUP(N9,Q6:S77,2,0)","v":11},5,2021,"5-2021",5,31,"5-2021",null,47900,45100,2850,2850,{"$f":"ROUND(C10*'Info Sheet'!P10/100,0)","v":0},2850,2850,2850,{"$f":"ROUND(F10*'Info Sheet'!P10/100,0)","v":0},2850,658,658]
[null,"6-2021",{"$f":"IFERROR(IF(T11=\"\",0,IF(C10>0,$M$13,$M$12)),\"\")","v":47900},{"$f":"ROUND(C11*'Info Sheet'!N11/100,0)","v":8143},{"$f":"ROUND(C11*'Info Sheet'!Q11/100,0)","v":3832},{"$f":"IFERROR(IF(T11=\"\",0,IF(F10>0,$N$13,$N$12)),\"\")","v":45100},{"$f":"ROUND(F11*'Info Sheet'!N11/100,0)","v":7667},{"$f":"ROUND(F11*'Info Sheet'!Q11/100,0)","v":3608},null,350,null,null,{"$f":"VLOOKUP(M9,Q6:S77,3,0)","v":31},{"$f":"VLOOKUP(M9,Q6:S77,2,0)","v":1},6,2021,"6-2021",6,30,"6-2021",null,47900,45100,2850,2850,{"$f":"ROUND(C11*'Info Sheet'!P11/100,0)","v":0},2850,2850,2850,{"$f":"ROUND(F11*'Info Sheet'!P11/100,0)","v":0},2850,658,658]
[null,"7-2021",{"$f":"IFERROR(IF(T12=\"\",0,IF($N$11<7,$M$14,IF(C11>0,$M$13,$M$12))),\"\")","v":49300},{"$f":"ROUND(C12*'Info Sheet'!N12/100,0)","v":15283},{"$f":"ROUND(C12*'Info Sheet'!Q12/100,0)","v":4437},{"$f":"IFERROR(IF(T12=\"\",0,IF($N$11<7,$N$14,IF(F11>0,$N$13,$N$12))),\"\")","v":46500},{"$f":"ROUND(F12*'Info Sheet'!N12/100,0)","v":14415},{"$f":"ROUND(F12*'Info Sheet'!Q12/100,0)","v":4185},null,392,null,null,{"$f":"ROUND((M13/M11)*M10,0)","v":47900},{"$f":"ROUND((N13/M11)*M10,0)","v":45100},7,2021,"7-2021",7,31,"7-2021",null,49300,46500,2850,2850,{"$f":"ROUND(C12*'Info Sheet'!P12/100,0)","v":6902},9752,2850,2850,{"$f":"ROUND(F12*'Info Sheet'!P12/100,0)","v":6510},9360,658,658]
[null,"8-2021",49300,{"$f":"ROUND(C13*'Info Sheet'!N13/100,0)","v":15283},{"$f":"ROUND(C13*'Info Sheet'!Q13/100,0)","v":4437},46500,{"$f":"ROUND(F13*'Info Sheet'!N13/100,0)","v":14415},{"$f":"ROUND(F13*'Info Sheet'!Q13/100,0)","v":4185},null,392,null,null,{"$f":"IFERROR(VLOOKUP($B$4,saini,7,0),\"Error\")","v":47900},{"$f":"IFERROR(VLOOKUP($B$4,saini,8,0),\"Error\")","v":45100},8,2021,"8-2021",8,31,"8-2021",null,49300,46500,2850,2850,{"$f":"ROUND(C13*'Info Sheet'!P13/100,0)","v":6902},9752,2850,2850,{"$f":"ROUND(F13*'Info Sheet'!P13/100,0)","v":6510},9360,658,658]
[null,"9-2021",49300,{"$f":"ROUND(C14*'Info Sheet'!N14/100,0)","v":15283},{"$f":"ROUND(C14*'Info Sheet'!Q14/100,0)","v":4437},46500,{"$f":"ROUND(F14*'Info Sheet'!N14/100,0)","v":14415},{"$f":"ROUND(F14*'Info Sheet'!Q14/100,0)","v":4185},null,392,null,null,{"$f":"MROUND(M13*103%,100)","v":49300},46500,9,2021,"9-2021",9,30,"9-2021",null,49300,46500,2850,2850,{"$f":"ROUND(C14*'Info Sheet'!P14/100,0)","v":6902},9752,2850,2850,{"$f":"ROUND(F14*'Info Sheet'!P14/100,0)","v":6510},9360,658,658]
[null,"10-2021",49300,{"$f":"ROUND(C15*'Info Sheet'!N15/100,0)","v":15283},{"$f":"ROUND(C15*'Info Sheet'!Q15/100,0)","v":4437},46500,{"$f":"ROUND(F15*'Info Sheet'!N15/100,0)","v":14415},{"$f":"ROUND(F15*'Info Sheet'!Q15/100,0)","v":4185},null,392,null,null,50800,47900,10,2021,"10-2021",10,31,"10-2021",null,49300,46500,2850,2850,{"$f":"ROUND(C15*'Info Sheet'!P15/100,0)","v":0},2850,2850,2850,{"$f":"ROUND(F15*'Info Sheet'!P15/100,0)","v":0},2850,658,658]
[null,"11-2021",49300,{"$f":"ROUND(C16*'Info Sheet'!N16/100,0)","v":15283},{"$f":"ROUND(C16*'Info Sheet'!Q16/100,0)","v":4437},46500,{"$f":"ROUND(F16*'Info Sheet'!N16/100,0)","v":14415},{"$f":"ROUND(F16*'Info Sheet'!Q16/100,0)","v":4185},null,392,null,null,52300,49300,11,2021,"11-2021",11,30,"11-2021",null,49300,46500,2850,2850,{"$f":"ROUND(C16*'Info Sheet'!P16/100,0)","v":0},2850,2850,2850,{"$f":"ROUND(F16*'Info Sheet'!P16/100,0)","v":0},2850,658,658]
[null,"",0,{"$f":"ROUND(C17*'Info Sheet'!N17/100,0)","v":0},{"$f":"ROUND(C17*'Info Sheet'!Q17/100,0)","v":0},0,{"$f":"ROUND(F17*'Info Sheet'!N17/100,0)","v":0},{"$f":"ROUND(F17*'Info Sheet'!Q17/100,0)","v":0},null,0,null,null,53900,50800,12,2021,"12-2021",12,31,"",null,0,0,0,0,{"$f":"ROUND(C17*'Info Sheet'!P17/100,0)","v":0},0,0,0,{"$f":"ROUND(F17*'Info Sheet'!P17/100,0)","v":0},0,0,0]
[null,"",0,{"$f":"ROUND(C18*'Info Sheet'!N18/100,0)","v":0},{"$f":"ROUND(C18*'Info Sheet'!Q18/100,0)","v":0},0,{"$f":"ROUND(F18*'Info Sheet'!N18/100,0)","v":0},{"$f":"ROUND(F18*'Info Sheet'!Q18/100,0)","v":0},null,0,null,null,55500,52300,1,2022,"1-2022",13,31,"",null,0,0,0,0,{"$f":"ROUND(C18*'Info Sheet'!P18/100,0)","v":0},0,0,0,{"$f":"ROUND(F18*'Info Sheet'!P18/100,0)","v":0},0,0,0]
[null,"",0,{"$f":"ROUND(C19*'Info Sheet'!N19/100,0)","v":0},{"$f":"ROUND(C19*'Info Sheet'!Q19/100,0)","v":0},0,{"$f":"ROUND(F19*'Info Sheet'!N19/100,0)","v":0},{"$f":"ROUND(F19*'Info Sheet'!Q19/100,0)","v":0},null,0,null,null,57200,53900,2,2022,"2-2022",14,28,"",null,0,0,0,0,{"$f":"ROUND(C19*'Info Sheet'!P19/100,0)","v":0},0,0,0,{"$f":"ROUND(F19*'Info Sheet'!P19/100,0)","v":0},0,0,0]
[null,"",0,{"$f":"ROUND(C20*'Info Sheet'!N20/100,0)","v":0},{"$f":"ROUND(C20*'Info Sheet'!Q20/100,0)","v":0},0,{"$f":"ROUND(F20*'Info Sheet'!N20/100,0)","v":0},{"$f":"ROUND(F20*'Info Sheet'!Q20/100,0)","v":0},null,0,null,null,null,null,3,2022,"3-2022",15,31,"",null,0,0,0,0,{"$f":"ROUND(C20*'Info Sheet'!P20/100,0)","v":0},0,0,0,{"$f":"ROUND(F20*'Info Sheet'!P20/100,0)","v":0},0,0,0]
[null,"",0,{"$f":"ROUND(C21*'Info Sheet'!N21/100,0)","v":0},{"$f":"ROUND(C21*'Info Sheet'!Q21/100,0)","v":0},0,{"$f":"ROUND(F21*'Info Sheet'!N21/100,0)","v":0},{"$f":"ROUND(F21*'Info Sheet'!Q21/100,0)","v":0},null,0,null,null,null,null,4,2022,"4-2022",16,30,"",null,0,0,0,0,{"$f":"ROUND(C21*'Info Sheet'!P21/100,0)","v":0},0,0,0,{"$f":"ROUND(F21*'Info Sheet'!P21/100,0)","v":0},0,0,0]
[null,"",0,{"$f":"ROUND(C22*'Info Sheet'!N22/100,0)","v":0},{"$f":"ROUND(C22*'Info Sheet'!Q22/100,0)","v":0},0,{"$f":"ROUND(F22*'Info Sheet'!N22/100,0)","v":0},{"$f":"ROUND(F22*'Info Sheet'!Q22/100,0)","v":0},null,0,null,null,null,null,5,2022,"5-2022",17,31,"",null,0,0,0,0,{"$f":"ROUND(C22*'Info Sheet'!P22/100,0)","v":0},0,0,0,{"$f":"ROUND(F22*'Info Sheet'!P22/100,0)","v":0},0,0,0]
[null,"",0,{"$f":"ROUND(C23*'Info Sheet'!N23/100,0)","v":0},{"$f":"ROUND(C23*'Info Sheet'!Q23/100,0)","v":0},0,{"$f":"ROUND(F23*'Info Sheet'!N23/100,0)","v":0},{"$f":"ROUND(F23*'Info Sheet'!Q23/100,0)","v":0},null,0,null,null,null,null,6,2022,"6-2022",18,30,"",null,0,0,0,0,{"$f":"ROUND(C23*'Info Sheet'!P23/100,0)","v":0},0,0,0,{"$f":"ROUND(F23*'Info Sheet'!P23/100,0)","v":0},0,0,0]
[null,"",{"$f":"IFERROR(IF(T24=\"\",0,IF($N$11<7,$M$15,IF(AND($N$11>6,$N$11<19),$M$14,IF($N$11=$R$24,$M$12)))),\"\")","v":0},{"$f":"ROUND(C24*'Info Sheet'!N24/100,0)","v":0},{"$f":"ROUND(C24*'Info Sheet'!Q24/100,0)","v":0},{"$f":"IFERROR(IF(T24=\"\",0,IF($N$11<7,$N$15,IF(AND($N$11>6,$N$11<19),$N$14,IF($N$11=$R$24,$N$12)))),\"\")","v":0},{"$f":"ROUND(F24*'Info Sheet'!N24/100,0)","v":0},{"$f":"ROUND(F24*'Info Sheet'!Q24/100,0)","v":0},null,0,null,null,null,null,7,2022,"7-2022",19,31,"",null,0,0,0,0,{"$f":"ROUND(C24*'Info Sheet'!P24/100,0)","v":0},0,0,0,{"$f":"ROUND(F24*'Info Sheet'!P24/100,0)","v":0},0,0,0]
[null,"",{"$f":"IFERROR(IF(T25=\"\",0,IF($N$11<7,$M$15,IF(AND($N$11>6,$N$11<19),$M$14,IF(C24>0,$M$13,$M$12)))),\"\")","v":0},{"$f":"ROUND(C25*'Info Sheet'!N25/100,0)","v":0},{"$f":"ROUND(C25*'Info Sheet'!Q25/100,0)","v":0},{"$f":"IFERROR(IF(T25=\"\",0,IF($N$11<7,$N$15,IF(AND($N$11>6,$N$11<19),$N$14,IF(F24>0,$N$13,$N$12)))),\"\")","v":0},{"$f":"ROUND(F25*'Info Sheet'!N25/100,0)","v":0},{"$f":"ROUND(F25*'Info Sheet'!Q25/100,0)","v":0},null,0,null,null,null,null,8,2022,"8-2022",20,31,"",null,0,0,0,0,{"$f":"ROUND(C25*'Info Sheet'!P25/100,0)","v":0},0,0,0,{"$f":"ROUND(F25*'Info Sheet'!P25/100,0)","v":0},0,0,0]
[null,"",0,{"$f":"ROUND(C26*'Info Sheet'!N26/100,0)","v":0},{"$f":"ROUND(C26*'Info Sheet'!Q26/100,0)","v":0},0,{"$f":"ROUND(F26*'Info Sheet'!N26/100,0)","v":0},{"$f":"ROUND(F26*'Info Sheet'!Q26/100,0)","v":0},null,0,null,null,null,null,9,2022,"9-2022",21,30,"",null,0,0,0,0,{"$f":"ROUND(C26*'Info Sheet'!P26/100,0)","v":0},0,0,0,{"$f":"ROUND(F26*'Info Sheet'!P26/100,0)","v":0},0,0,0]
[null,"",0,{"$f":"ROUND(C27*'Info Sheet'!N27/100,0)","v":0},{"$f":"ROUND(C27*'Info Sheet'!Q27/100,0)","v":0},0,{"$f":"ROUND(F27*'Info Sheet'!N27/100,0)","v":0},{"$f":"ROUND(F27*'Info Sheet'!Q27/100,0)","v":0},null,0,null,null,null,null,10,2022,"10-2022",22,31,"",null,0,0,0,0,{"$f":"ROUND(C27*'Info Sheet'!P27/100,0)","v":0},0,0,0,{"$f":"ROUND(F27*'Info Sheet'!P27/100,0)","v":0},0,0,0]
[null,"",0,{"$f":"ROUND(C28*'Info Sheet'!N28/100,0)","v":0},{"$f":"ROUND(C28*'Info Sheet'!Q28/100,0)","v":0},0,{"$f":"ROUND(F28*'Info Sheet'!N28/100,0)","v":0},{"$f":"ROUND(F28*'Info Sheet'!Q28/100,0)","v":0},null,0,null,null,null,null,11,2022,"11-2022",23,30,"",null,0,0,0,0,{"$f":"ROUND(C28*'Info Sheet'!P28/100,0)","v":0},0,0,0,{"$f":"ROUND(F28*'Info Sheet'!P28/100,0)","v":0},0,0,0]
[null,"",0,{"$f":"ROUND(C29*'Info Sheet'!N29/100,0)","v":0},{"$f":"ROUND(C29*'Info Sheet'!Q29/100,0)","v":0},0,{"$f":"ROUND(F29*'Info Sheet'!N29/100,0)","v":0},{"$f":"ROUND(F29*'Info Sheet'!Q29/100,0)","v":0},null,0,null,null,null,null,12,2022,"12-2022",24,31,"",null,0,0,0,0,{"$f":"ROUND(C29*'Info Sheet'!P29/100,0)","v":0},0,0,0,{"$f":"ROUND(F29*'Info Sheet'!P29/100,0)","v":0},0,0,0]
[null,"",0,{"$f":"ROUND(C30*'Info Sheet'!N30/100,0)","v":0},{"$f":"ROUND(C30*'Info Sheet'!Q30/100,0)","v":0},0,{"$f":"ROUND(F30*'Info Sheet'!N30/100,0)","v":0},{"$f":"ROUND(F30*'Info Sheet'!Q30/100,0)","v":0},null,0,null,null,null,null,1,2023,"1-2023",25,31,"",null,0,0,0,0,{"$f":"ROUND(C30*'Info Sheet'!P30/100,0)","v":0},0,0,0,{"$f":"ROUND(F30*'Info Sheet'!P30/100,0)","v":0},0,0,0]
{"$rows_left_out":48}
{"sheet":"Arrear Sheet","index":2,"n_rows":86,"n_cols":29,"rows_kept":86,"cut":false,"hidden":false,"merged":[[3,28,4,28],[0,1,0,28],[3,1,4,1],[3,2,3,5],[3,6,3,9],[3,10,3,13],[3,14,3,16],[3,20,3,22],[3,23,3,25],[3,26,4,26],[3,27,4,27],[3,17,3,19]]}
[null,"Office of the Principal, Govt Sr Sec School Malutana (Thanagazi) Alwar"]
[null,"Salary Arrear from 01-Jan-2021 to Nov-2021"]
[null,1,"Name : Pramod Kumar Saini",null,null,null,null,null,null,null,null,null,null,null,null,null,null,"Desination : Teacher"]
[null,"Month\n/\nYear","PAY DUE",null,null,null,"PAY DRAWN",null,null,null,"PAY DIFFERENCE",null,null,null,{"$f":"IFERROR(VLOOKUP(B3,'Info Sheet'!$B$6:$K$20,9,0),\"\")","v":"GPF 2004"},null,null,"SIP",null,null,"RGHS",null,null,"I TAX",null,null,"Total\nDedu","Net\nPay","TV\nNo"]
[null,null,"Basic","DA","HRA","Total","Basic","DA","HRA","Total","Basic","DA","HRA",{"$f":"IF(F5=\"\",\"\",F5)","v":"Total"},"Due","Dedu","Diff","Due","Dedu","Diff","Due","Dedu","Diff","Due","Dedu","Diff"]
[null,"2021-01-01",47900,8143,3832,{"$f":"SUM(C6:E6)","v":59875},45100,7667,3608,{"$f":"SUM(G6:I6)","v":56375},{"$f":"C6-G6","v":2800},{"$f":"D6-H6","v":476},{"$f":"E6-I6","v":224},{"$f":"SUM(K6:M6)","v":3500},2850,2850,{"$f":"O6-P6","v":0},0,0,{"$f":"R6-S6","v":0},658,658,{"$f":"U6-V6","v":0},350,0,{"$f":"X6-Y6","v":350},{"$f":"Q6+T6+W6+Z6","v":350},{"$f":"N6-AA6","v":3150}]
[null,"2021-02-01",47900,8143,3832,{"$f":"SUM(C7:E7)","v":59875},45100,7667,3608,{"$f":"SUM(G7:I7)","v":56375},{"$f":"C7-G7","v":2800},{"$f":"D7-H7","v":476},{"$f":"E7-I7","v":224},{"$f":"SUM(K7:M7)","v":3500},2850,2850,{"$f":"O7-P7","v":0},0,0,{"$f":"R7-S7","v":0},658,658,{"$f":"U7-V7","v":0},350,0,{"$f":"X7-Y7","v":350},{"$f":"Q7+T7+W7+Z7","v":350},{"$f":"N7-AA7","v":3150}]
[null,"2021-03-01",47900,8143,3832,{"$f":"SUM(C8:E8)","v":59875},45100,7667,3608,56375,2800,476,224,3500,2850,2850,0,0,0,0,658,658,0,350,0,350,350,3150]
[null,"2021-04-01",47900,8143,3832,59875,45100,7667,3608,56375,2800,476,224,3500,2850,2850,0,0,0,0,658,658,0,350,0,350,350,3150]
[null,"2021-05-01",47900,8143,3832,59875,45100,7667,3608,56375,2800,476,224,3500,2850,2850,0,0,0,0,658,658,0,350,0,350,350,3150]
[null,"2021-06-01",47900,8143,3832,59875,45100,7667,3608,56375,2800,476,224,3500,2850,2850,0,0,0,0,658,658,0,350,0,350,350,3150]
[null,"2021-07-01",49300,15283,4437,69020,46500,14415,4185,65100,2800,868,252,3920,9752,9360,392,0,0,0,658,658,0,392,0,392,784,3136]
[null,"2021-08-01",49300,15283,4437,69020,46500,14415,4185,65100,2800,868,252,3920,9752,9360,392,0,0,0,658,658,0,392,0,392,784,3136]
[null,"2021-09-01",49300,15283,4437,69020,46500,14415,4185,65100,2800,868,252,3920,9752,9360,392,0,0,0,658,658,0,392,0,392,784,3136]
[null,"2021-10-01",49300,15283,4437,69020,46500,14415,4185,65100,2800,868,252,3920,2850,2850,0,0,0,0,658,658,0,392,0,392,392,3528]
[null,"2021-11-01",49300,15283,4437,69020,46500,14415,4185,65100,2800,868,252,3920,2850,2850,0,0,0,0,658,658,0,392,0,392,392,3528]
[null,"2021-12-01",0,0,0,0,0,0,0,0,0,0,0,0,0,0,0,0,0,0,0,0,0,0,0,0,0,0]
[null,"2022-01-01",0,0,0,0,0,0,0,0,0,0,0,0,0,0,0,0,0,0,0,0,0,0,0,0,0,0]
[null,"2022-02-01",0,0,0,0,0,0,0,0,0,0,0,0,0,0,0,0,0,0,0,0,0,0,0,0,0,0]
[null,"2022-03-01",0,0,0,0,0,0,0,0,0,0,0,0,0,0,0,0,0,0,0,0,0,0,0,0,0,0]
[null,"2022-04-01",0,0,0,0,0,0,0,0,0,0,0,0,0,0,0,0,0,0,0,0,0,0,0,0,0,0]
[null,"2022-05-01",0,0,0,0,0,0,0,0,0,0,0,0,0,0,0,0,0,0,0,0,0,0,0,0,0,0]
[null,"2022-06-01",0,0,0,0,0,0,0,0,0,0,0,0,0,0,0,0,0,0,0,0,0,0,0,0,0,0]
[null,"2022-07-01",0,0,0,0,0,0,0,0,0,0,0,0,0,0,0,0,0,0,0,0,0,0,0,0,0,0]
[null,"2022-08-01",0,0,0,0,0,0,0,0,0,0,0,0,0,0,0,0,0,0,0,0,0,0,0,0,0,0]
[null,"2022-09-01",0,0,0,0,0,0,0,0,0,0,0,0,0,0,0,0,0,0,0,0,0,0,0,0,0,0]
[null,"2022-10-01",0,0,0,0,0,0,0,0,0,0,0,0,0,0,0,0,0,0,0,0,0,0,0,0,0,0]
[null,"2022-11-01",0,0,0,0,0,0,0,0,0,0,0,0,0,0,0,0,0,0,0,0,0,0,0,0,0,0]
[null,"2022-12-01",0,0,0,0,0,0,0,0,0,0,0,0,0,0,0,0,0,0,0,0,0,0,0,0,0,0]
[null,"2023-01-01",0,0,0,0,0,0,0,0,0,0,0,0,0,0,0,0,0,0,0,0,0,0,0,0,0,0]
{"$rows_left_out":56}