{"text_format":"1","workbook":"xlsx","n_sheets":5,"sheets":["School Info","Data Sheet","Admit Card","Single Admit Card","Admit Card With Photo"],"not_rendered":{"charts":0,"images":27,"macros":1,"external_links":0,"defined_names":9,"comments":0,"pivot_tables":0},"unopened":[],"bounds":{"document_bytes":16777216,"sheet_cells":100000,"rows_first":2000,"rows_last":500,"rows_between":2000,"halvings":0,"cell_chars":16384,"cell_head_chars":4096},"cells_cut":0,"cells_raw":0,"read":"whole","date_system":"1900"}

{"sheet":"School Info","index":0,"n_rows":21,"n_cols":20,"rows_kept":21,"cut":false,"hidden":false,"merged":[[19,4,19,5],[19,1,19,2],[20,0,20,3],[6,3,7,3],[6,4,7,4],[6,0,7,0],[14,0,18,3],[14,4,14,6],[15,4,15,6],[16,4,16,6],[4,0,5,0],[4,6,5,6],[17,6,20,7],[4,7,5,7],[0,9,1,14],[2,9,2,14],[0,8,20,8],[0,0,2,7],[8,0,13,7],[6,6,7,6],[4,3,5,4],[6,7,7,7],[6,1,7,2],[3,1,3,7],[4,1,5,2],[4,5,5,5]]}
["यहाँ अपने विद्यालय का विवरण भरे |\nFill your school details here.",null,null,null,null,null,null,null,null,"TIME TABLE "]
[]
[null,null,null,null,null,null,null,null,null,null,null,null,null,null,null,null,null,"CLASS","GENDER"]
["SCHOOL NAME","Mahatma Gandhi Government School Bar",null,null,null,null,null,null,null,"SUBJECT NAME","DATE","DAY NAME","TIME "]
["SCHOOL DISE CODE",123456890,null,"SCHOOL BOARD CODE :",null,123456,"EXAM NAME","HALF YEARLY EXAM",null,"HINDI","2001-01-01","MONDAY","10:00AM TO 12:00PM",null,null,null,null,"PP3","MALE","A"]
[null,null,null,null,null,null,null,null,null,"ENGLISH","2001-01-01","TUESDAY","10:00AM TO 12:00PM",null,null,null,null,"PP4","FEMALE","B"]
["CLASS",6,null,"MEDIUM","HINDI","SECTION","SESSION ","2025-26",null,"SCIENCE","2001-01-01","WEDNESDAY","10:00AM TO 12:00PM",null,null,null,null,"PP5",null,"C"]
[null,null,null,null,null,"A",null,null,null,"MATH","2001-01-01","THURSDAY","10:00AM TO 12:00PM",null,null,null,null,1,null,"D"]
["https://youtu.be/GJhVBFWW4c4",null,null,null,null,null,null,null,null,"SOCIAL SCIENCE","2001-01-01","FRIDAY","10:00AM TO 12:00PM",null,null,null,null,2,"HINDI"]
[null,null,null,null,null,null,null,null,null,"SANSKRIT","2001-01-01","SATURDAY","10:00AM TO 12:00PM",null,null,null,null,3,"ENGLISH"]
[null,null,null,null,null,null,null,null,null,null,"2001-01-02","SUNDAY","10:00AM TO 12:00PM",null,null,null,null,4]
[null,null,null,null,null,null,null,null,null,null,"2001-01-03","MONDAY","10:00AM TO 12:00PM"]
[null,null,null,null,null,null,null,null,null,null,"2001-01-04","TUESDAY","10:00AM TO 12:00PM"]
[null,null,null,null,null,null,null,null,null,null,null,null,null,null,null,null,null,5]
["\nProgramming & Designing By :\nHEERALAL JAT\nSenior Teacher\nMGGS BAR , (Beawar)\nV./P. - Chandawal Nagar, Sojat , Pali\n",null,null,null,"SCHOOL LOGO  :  ",null,null,null,null,null,null,null,null,null,null,null,null,6]
[null,null,null,null,"Sig. Principal  : ",null,null,null,null,null,null,null,null,null,null,null,null,7]
[null,null,null,null,"Sig. Exam Incharge  :",null,null,null,null,null,null,null,null,null,null,null,null,8]
[null,null,null,null,null,null,"https://youtu.be/GJhVBFWW4c4",null,null,null,null,null,null,null,null,null,null,9]
[null,null,null,null,null,null,null,null,null,null,null,null,null,null,null,null,null,10]
["PASSWORD :","Admitcard25",null,null,"Youtube Video Link :-",null,null,null,null,null,null,null,"जय गुरुदेव ",null,null,null,null,11]
["If you want , otherwise don't use password",null,null,null,null,null,null,null,null,null,null,null,null,null,null,null,null,12]

{"sheet":"Data Sheet","index":1,"n_rows":103,"n_cols":9,"rows_kept":103,"cut":false,"hidden":false,"merged":[[3,9,3,10],[0,0,0,8],[1,4,1,6]]}
[{"$f":"IF('School Info'!$B$4=\"\",\"\",'School Info'!$B$4)","v":"Mahatma Gandhi Government School Bar"}]
[null,null,null,null,"Student Data Entry"]
["S NO","SR NO","ROLL NO","DOB","GENDER","STUDENT NAME","FATHER NAME","MOTHER NAME","PHOTO"]
[1,755,101,"2001-01-01","MALE","RAJ GURUJI","RAJ","DEVI"]
[2,852,102,"2002-01-01","FEMALE","lala","RAAA","DDD"]
[3,901,103,"2003-01-01","FEMALE","SONU","AAA","DDS"]
[4,222,104,"2004-01-01","MALE","KARNA","BBB","SSDDF"]
[5,333,105,"2005-01-01","MALE","RAJA  ","DFD","GAG"]
[6,444,106,"2006-01-01","FEMALE","RAJ GURUJI","RAJ","DEVI"]
[7,555,107,"2007-01-01","MALE","MONU","RAAA","DDD"]
[8,666,108,"2008-01-01","FEMALE","SONU","AAA","DDS"]
[9,777,109,"2009-01-01","MALE","KARNA","BBB","SSDDF"]
[10,888,110,"2010-01-01","MALE","RAJA  ","DFD","GAG"]
[11,111,111,"2011-01-01","MALE","RAJ GURUJI","RAJ","DEVI"]
[12,123,112,"2012-01-01","MALE","MONU","RAAA","DDD"]
[13,"A",113,"2013-01-01","MALE","SONU","AAA","DDS"]
[14,"B",114,"2014-01-01","MALE","KARNA","BBB","SSDDF"]
[15,"A",115,"2015-01-01","MALE","RAJA  ","DFD","GAG"]
[16,"B",116,"2016-01-01","MALE","RAJ GURUJI","RAJ","DEVI"]
[17,"A",117,"2017-01-01","MALE","MONU","RAAA","DDD"]
[18,"B",118,"2018-01-01","MALE","SONU","AAA","DDS"]
[19,null,119,"2019-01-01","MALE","KARNA","BBB","SSDDF"]
[20,null,120,"2020-01-01","MALE","RAJA  ","DFD","GAG"]
[21,null,121,"2021-01-01","MALE","RAJ GURUJI","RAJ","DEVI"]
[22,null,122,"2022-01-01","MALE","MONU","RAAA","DDD"]
[23,null,123,"2023-01-01","MALE","SONU","AAA","DDS"]
[24,null,124,"2024-01-01","MALE","KARNA","BBB","SSDDF"]
[25,null,125,"2025-01-01","MALE","RAJA  ","DFD","GAG"]
[26,null,126,"2026-01-01","MALE","RAJ GURUJI","RAJ","DEVI"]
[27,null,127,"2027-01-01","MALE","ggggggggg","RAAA","DDD"]
[28,null,128,"2028-01-01","MALE","SONU","AAA","DDS"]
[29,null,129,"2029-01-01","MALE","KARNA","BBB","SSDDF"]
[30,null,130,"2030-01-01","MALE","RAJA  ","DFD","GAG"]
[31,null,131,"2031-01-01","MALE","RAJ GURUJI","RAJ","DEVI"]
[32,null,132,"2032-01-01","MALE","MONU","RAAA","DDD"]
[33,null,133,"2033-01-01","MALE","SONU","AAA","DDS"]
[34,null,134,"2034-01-01","MALE","KARNA","BBB","SSDDF"]
[35,null,135,"2035-01-01","MALE","RAJA  ","DFD","GAG"]
[36,null,136,"2036-01-01","MALE","RAJ GURUJI","RAJ","DEVI"]
[37,null,137,"2037-01-01","MALE","MONU","RAAA","DDD"]
[38,null,138,"2038-01-01","MALE","SONU","AAA","DDS"]
[39,null,139,"2039-01-01","MALE","KARNA","BBB","SSDDF"]
[40,null,140,"2040-01-01","MALE","RAJA  ","DFD","GAG"]
[41,null,141,"2041-01-01","MALE","RAJ GURUJI","RAJ","DEVI"]
[42,null,142,"2042-01-01","MALE","MONU","RAAA","DDD"]
[43,null,143,"2043-01-01","MALE","SONU","AAA","DDS"]
[44,null,144,"2044-01-01","MALE","KARNA","BBB","SSDDF"]
[45,null,145,"2045-01-01","MALE","RAJA  ","DFD","GAG"]
[46,null,146,"2046-01-01","MALE","RAJ GURUJI","RAJ","DEVI"]
[47,null,147,"2047-01-01","MALE","MONU","RAAA","DDD"]
[48,null,148,"2048-01-01","MALE","SONU","AAA","DDS"]
[49,null,149,"2049-01-01","MALE","KARNA","BBB","SSDDF"]
[50,null,150,"2050-01-01","MALE","RAJA  ","DFD","GAG"]
[51,null,151,"2051-01-01","MALE","RAJ GURUJI","RAJ","DEVI"]
[52,null,152,"2052-01-01","MALE","MONU","RAAA","DDD"]
[53,null,153,"2053-01-01","MALE","SONU","AAA","DDS"]
[54,null,154,"2054-01-01","MALE","KARNA","BBB","SSDDF"]
[55,null,155,"2055-01-01","MALE","RAJA  ","DFD","GAG"]
[56,null,156,"2056-01-01","MALE","RAJ GURUJI","RAJ","DEVI"]
[57,null,157,"2057-01-01","MALE","MONU","RAAA","DDD"]
[58,null,158,"2058-01-01","MALE","SONU","AAA","DDS"]
[59,null,159,"2059-01-01","MALE","KARNA","BBB","SSDDF"]
[60,null,160,"2060-01-01","MALE","RAJA  ","DFD","GAG"]
[61,null,161,"2061-01-01","MALE","RAJ GURUJI","RAJ","DEVI"]
[62,null,162,"2062-01-01","MALE","MONU","RAAA","DDD"]
[63,null,163,"2063-01-01","MALE","SONU","AAA","DDS"]
[64,null,164,"2064-01-01","MALE","KARNA","BBB","SSDDF"]
[65,null,165,"2065-01-01","MALE","RAJA  ","DFD","GAG"]
[66,null,166,"2066-01-01","MALE","RAJ GURUJI","RAJ","DEVI"]
[67,null,167,"2067-01-01","MALE","MONU","RAAA","DDD"]
[68,null,168,"2068-01-01","MALE","SONU","AAA","DDS"]
[69,null,169,"2069-01-01","MALE","KARNA","BBB","SSDDF"]
[70,null,170,"2070-01-01","MALE","RAJA  ","DFD","GAG"]
[71,null,171,"2071-01-01","MALE","RAJ GURUJI","RAJ","DEVI"]
[72,null,172,"2072-01-01","MALE","MONU","RAAA","DDD"]
[73,null,173,"2073-01-01","MALE","SONU","AAA","DDS"]
[74,null,174,"2074-01-01","MALE","KARNA","BBB","SSDDF"]
[75,null,175,"2075-01-01","MALE","RAJA  ","DFD","GAG"]
[76,null,176,"2076-01-01","MALE","RAJ GURUJI","RAJ","DEVI"]
[77,null,177,"2077-01-01","MALE","MONU","RAAA","DDD"]
[78,null,178,"2078-01-01","MALE","SONU","AAA","DDS"]
[79,null,179,"2079-01-01","MALE","KARNA","BBB","SSDDF"]
[80,null,180,"2080-01-01","MALE","RAJA  ","DFD","GAG"]
[81,null,181,"2081-01-01","MALE","RAJ GURUJI","RAJ","DEVI"]
[82,null,182,"2082-01-01","MALE","MONU","RAAA","DDD"]
[83,null,183,"2083-01-01","MALE","SONU","AAA","DDS"]
[84,null,184,"2084-01-01","MALE","KARNA","BBB","SSDDF"]
[85,null,185,"2085-01-01","MALE","RAJA  ","DFD","GAG"]
[86,null,186,"2086-01-01","MALE","RAJ GURUJI","RAJ","DEVI"]
[87,null,187,"2087-01-01","MALE","MONU","RAAA","DDD"]
[88,null,188,"2088-01-01","MALE","SONU","AAA","DDS"]
[89,null,189,"2089-01-01","MALE","KARNA","BBB","SSDDF"]
[90,null,190,"2090-01-01","MALE","RAJA  ","DFD","GAG"]
[91,null,191,"2091-01-01","MALE","RAJ GURUJI","RAJ","DEVI"]
[92,null,192,"2092-01-01","MALE","MONU","RAAA","DDD"]
[93,null,193,"2093-01-01","MALE","SONU","AAA","DDS"]
[94,null,194,"2094-01-01","MALE","KARNA","BBB","SSDDF"]
[95,null,195,"2095-01-01","MALE","RAJA  ","DFD","GAG"]
[96,null,196,"2096-01-01","MALE","RAJ GURUJI","RAJ","DEVI"]
[97,null,197,"2097-01-01","MALE","MONU","RAAA","DDD"]
[98,null,198,"2098-01-01","MALE","SONU","AAA","DDS"]
[99,null,199,"2099-01-01","MALE","KARNA","BBB","SSDDF"]
[100,null,200,"2100-01-01","MALE","RAJA  ","DFD","GAG"]

{"sheet":"Admit Card","index":2,"n_rows":3066,"n_cols":9,"rows_kept":3066,"cut":false,"hidden":false,"merged":[[1207,3,1207,4],[1237,3,1237,4],[1238,3,1238,4],[1239,3,1239,4],[1240,3,1240,4],[1270,3,1270,4],[1271,3,1271,4],[1272,3,1272,4],[1273,3,1273,4],[1303,3,1303,4],[1304,3,1304,4],[1305,3,1305,4],[1306,3,1306,4],[1336,3,1336,4],[1337,3,1337,4],[1338,3,1338,4],[1339,3,1339,4],[1319,0,1319,7],[1320,2,1320,3],[1320,6,1320,7],[1321,2,1321,3],[1321,6,1321,7],[1322,2,1322,4],[1324,6,1324,7],[1325,1,1325,2],[1325,6,1325,7],[1326,1,1326,2],[1327,1,1327,2],[1327,3,1327,4],[1327,5,1327,7],[1329,3,1329,4],[1329,5,1335,7],[1074,3,1074,4],[1075,3,1075,4],[1105,3,1105,4],[1106,3,1106,4],[1107,3,1107,4],[1108,3,1108,4],[1138,3,1138,4],[1139,3,1139,4],[1140,3,1140,4],[1141,3,1141,4],[1171,3,1171,4],[1172,3,1172,4],[1173,3,1173,4],[1174,3,1174,4],[1204,3,1204,4],[1205,3,1205,4],[1206,3,1206,4],[1187,0,1187,7],[1188,2,1188,3],[1188,6,1188,7],[1189,2,1189,3],[1189,6,1189,7],[1190,2,1190,4],[1192,6,1192,7],[1193,1,1193,2],[1193,6,1193,7],[1194,1,1194,2],[1195,1,1195,2],[1195,3,1195,4],[1195,5,1195,7],[1197,3,1197,4],[1197,5,1203,7],[941,3,941,4],[942,3,942,4],[943,3,943,4],[973,3,973,4],[974,3,974,4],[975,3,975,4],[976,3,976,4],[1006,3,1006,4],[1007,3,1007,4],[1008,3,1008,4],[1009,3,1009,4],[1039,3,1039,4],[1040,3,1040,4],[1041,3,1041,4],[1042,3,1042,4],[1072,3,1072,4],[1073,3,1073,4],[1055,0,1055,7],[1056,2,1056,3],[1056,6,1056,7],[1057,2,1057,3],[1057,6,1057,7],[1058,2,1058,4],[1060,6,1060,7],[1061,1,1061,2],[1061,6,1061,7],[1062,1,1062,2],[1063,1,1063,2],[1063,3,1063,4],[1063,5,1063,7],[1065,3,1065,4],[1065,5,1071,7],[808,3,808,4],[809,3,809,4],[810,3,810,4],[811,3,811,4],[841,3,841,4],[842,3,842,4],[843,3,843,4],[844,3,844,4],[874,3,874,4],[875,3,875,4],[876,3,876,4],[877,3,877,4],[907,3,907,4],[908,3,908,4],[909,3,909,4],[910,3,910,4],[940,3,940,4],[923,0,923,7],[924,2,924,3],[924,6,924,7],[925,2,925,3],[925,6,925,7],[926,2,926,4],[928,6,928,7],[929,1,929,2],[929,6,929,7],[930,1,930,2],[931,1,931,2],[931,3,931,4],[931,5,931,7],[933,3,933,4],[933,5,939,7],[547,3,547,4],[577,3,577,4],[578,3,578,4],[579,3,579,4],[580,3,580,4],[610,3,610,4],[611,3,611,4],[612,3,612,4],[613,3,613,4],[643,3,643,4],[644,3,644,4],[645,3,645,4],[646,3,646,4],[676,3,676,4],[677,3,677,4],[678,3,678,4],[679,3,679,4],[659,0,659,7],[660,2,660,3],[660,6,660,7],[661,2,661,3],[661,6,661,7],[662,2,662,4],[664,6,664,7],[665,1,665,2],[665,6,665,7],[666,1,666,2],[667,1,667,2],[667,3,667,4],[667,5,667,7],[669,3,669,4],[669,5,675,7],[414,3,414,4],[415,3,415,4],[445,3,445,4],[446,3,446,4],[447,3,447,4],[448,3,448,4],[478,3,478,4],[479,3,479,4],[480,3,480,4],[481,3,481,4],[511,3,511,4],[512,3,512,4],[513,3,513,4],[514,3,514,4],[544,3,544,4],[545,3,545,4],[546,3,546,4],[527,0,527,7],[528,2,528,3],[528,6,528,7],[529,2,529,3],[529,6,529,7],[530,2,530,4],[532,6,532,7],[533,1,533,2],[533,6,533,7],[534,1,534,2],[535,1,535,2],[535,3,535,4],[535,5,535,7],[537,3,537,4],[537,5,543,7],[281,3,281,4],[282,3,282,4],[283,3,283,4],[313,3,313,4],[314,3,314,4],[315,3,315,4],[316,3,316,4],[346,3,346,4],[347,3,347,4],[348,3,348,4],[349,3,349,4],[379,3,379,4],[380,3,380,4],[381,3,381,4],[382,3,382,4],[412,3,412,4],[413,3,413,4],[395,0,395,7],[396,2,396,3],[396,6,396,7],[397,2,397,3],[397,6,397,7],[398,2,398,4],[400,6,400,7],[401,1,401,2],[401,6,401,7],[402,1,402,2],[403,1,403,2],[403,3,403,4],[403,5,403,7],[405,3,405,4],[405,5,411,7],[148,3,148,4],[149,3,149,4],[150,3,150,4],[151,3,151,4],[181,3,181,4],[182,3,182,4],[183,3,183,4],[184,3,184,4],[214,3,214,4],[215,3,215,4],[216,3,216,4],[217,3,217,4],[247,3,247,4],[248,3,248,4],[249,3,249,4],[250,3,250,4],[280,3,280,4],[263,0,263,7],[264,2,264,3],[264,6,264,7],[265,2,265,3],[265,6,265,7],[266,2,266,4],[268,6,268,7],[269,1,269,2],[269,6,269,7],[270,1,270,2],[271,1,271,2],[271,3,271,4],[271,5,271,7],[273,3,273,4],[273,5,279,7],[3047,0,3047,7],[3048,3,3048,4],[3048,5,3054,7],[3049,3,3049,4],[3050,3,3050,4],[3051,3,3051,4],[3052,3,3052,4],[3053,3,3053,4],[3054,3,3054,4],[3055,0,3055,7],[3056,0,3056,7],[3057,0,3057,7],[3058,0,3058,7],[3059,0,3059,7],[3060,0,3060,7],[3061,2,3064,5],[3065,2,3065,5],[3065,6,3065,7],[3032,2,3035,5],[3036,2,3036,5],[3036,6,3036,7],[3037,0,3037,7],[3038,0,3038,7],[3039,2,3039,3],[3039,6,3039,7],[3040,2,3040,3],[3040,6,3040,7],[3041,2,3041,4],[3043,6,3043,7],[3044,1,3044,2],[3044,6,3044,7],[3045,1,3045,2],[3046,1,3046,2],[3046,3,3046,4],[3046,5,3046,7],[3045,6,3045,7],[3017,1,3017,2],[3017,3,3017,4],[3017,5,3017,7],[3019,3,3019,4],[3019,5,3025,7],[3020,3,3020,4],[3021,3,3021,4],[3022,3,3022,4],[3023,3,3023,4],[3024,3,3024,4],[3025,3,3025,4],[3026,0,3026,7],[3027,0,3027,7],[3028,0,3028,7],[3029,0,3029,7],[3030,0,3030,7],[3031,0,3031,7],[2999,0,2999,7],[3000,0,3000,7],[3001,0,3001,7],[3002,0,3002,7],[3003,2,3006,5],[3007,2,3007,5],[3007,6,3007,7],[3009,0,3009,7],[3010,2,3010,3],[3010,6,3010,7],[3011,2,3011,3],[3011,6,3011,7],[3012,2,3012,4],[3014,6,3014,7],[3015,1,3015,2],[3015,6,3015,7],[3016,1,3016,2],[3016,6,3016,7],[2986,1,2986,2],[2986,6,2986,7],[2987,1,2987,2],[2988,1,2988,2],[2988,3,2988,4],[2988,5,2988,7],[2989,0,2989,7],[2990,3,2990,4],[2990,5,2996,7],[2991,3,2991,4],[2992,3,2992,4],[2993,3,2993,4],[2994,3,2994,4],[2995,3,2995,4],[2996,3,2996,4],[2997,0,2997,7],[2998,0,2998,7],[2987,6,2987,7],[2968,0,2968,7],[2969,0,2969,7],[2970,0,2970,7],[2971,0,2971,7],[2972,0,2972,7],[2973,0,2973,7],[2974,2,2977,5],[2978,2,2978,5],[2978,6,2978,7],[2979,0,2979,7],[2980,0,2980,7],[2981,2,2981,3],[2981,6,2981,7],[2982,2,2982,3],[2982,6,2982,7],[2983,2,2983,4],[2985,6,2985,7],[2951,0,2951,7],[2952,2,2952,3],[2952,6,2952,7],[2953,2,2953,3],[2953,6,2953,7],[2954,2,2954,4],[2956,6,2956,7],[2957,1,2957,2],[2957,6,2957,7],[2958,1,2958,2],[2959,1,2959,2],[2959,3,2959,4],[2959,5,2959,7],[2961,3,2961,4],[2961,5,2967,7],[2962,3,2962,4],[2963,3,2963,4],[2964,3,2964,4],[2965,3,2965,4],[2966,3,2966,4],[2967,3,2967,4],[2958,6,2958,7],[2931,0,2931,7],[2932,3,2932,4],[2932,5,2938,7],[2933,3,2933,4],[2934,3,2934,4],[2935,3,2935,4],[2936,3,2936,4],[2937,3,2937,4],[2938,3,2938,4],[2939,0,2939,7],[2940,0,2940,7],[2941,0,2941,7],[2942,0,2942,7],[2943,0,2943,7],[2944,0,2944,7],[2945,2,2948,5],[2949,2,2949,5],[2949,6,2949,7],[2916,2,2919,5],[2920,2,2920,5],[2920,6,2920,7],[2921,0,2921,7],[2922,0,2922,7],[2923,2,2923,3],[2923,6,2923,7],[2924,2,2924,3],[2924,6,2924,7],[2925,2,2925,4],[2927,6,2927,7],[2928,1,2928,2],[2928,6,2928,7],[2929,1,2929,2],[2930,1,2930,2],[2930,3,2930,4],[2930,5,2930,7],[2929,6,2929,7],[2901,1,2901,2],[2901,3,2901,4],[2901,5,2901,7],[2903,3,2903,4],[2903,5,2909,7],[2904,3,2904,4],[2905,3,2905,4],[2906,3,2906,4],[2907,3,2907,4],[2908,3,2908,4],[2909,3,2909,4],[2910,0,2910,7],[2911,0,2911,7],[2912,0,2912,7],[2913,0,2913,7],[2914,0,2914,7],[2915,0,2915,7],[2883,0,2883,7],[2884,0,2884,7],[2885,0,2885,7],[2886,0,2886,7],[2887,2,2890,5],[2891,2,2891,5],[2891,6,2891,7],[2893,0,2893,7],[2894,2,2894,3],[2894,6,2894,7],[2895,2,2895,3],[2895,6,2895,7],[2896,2,2896,4],[2898,6,2898,7],[2899,1,2899,2],[2899,6,2899,7],[2900,1,2900,2],[2900,6,2900,7],[2870,1,2870,2],[2870,6,2870,7],[2871,1,2871,2],[2872,1,2872,2],[2872,3,2872,4],[2872,5,2872,7],[2873,0,2873,7],[2874,3,2874,4],[2874,5,2880,7],[2875,3,2875,4],[2876,3,2876,4],[2877,3,2877,4],[2878,3,2878,4],[2879,3,2879,4],[2880,3,2880,4],[2881,0,2881,7],[2882,0,2882,7],[2871,6,2871,7],[2852,0,2852,7],[2853,0,2853,7],[2854,0,2854,7],[2855,0,2855,7],[2856,0,2856,7],[2857,0,2857,7],[2858,2,2861,5],[2862,2,2862,5],[2862,6,2862,7],[2863,0,2863,7],[2864,0,2864,7],[2865,2,2865,3],[2865,6,2865,7],[2866,2,2866,3],[2866,6,2866,7],[2867,2,2867,4],[2869,6,2869,7],[2835,0,2835,7],[2836,2,2836,3],[2836,6,2836,7],[2837,2,2837,3],[2837,6,2837,7],[2838,2,2838,4],[2840,6,2840,7],[2841,1,2841,2],[2841,6,2841,7],[2842,1,2842,2],[2843,1,2843,2],[2843,3,2843,4],[2843,5,2843,7],[2845,3,2845,4],[2845,5,2851,7],[2846,3,2846,4],[2847,3,2847,4],[2848,3,2848,4],[2849,3,2849,4],[2850,3,2850,4],[2851,3,2851,4],[2842,6,2842,7],[2815,0,2815,7],[2816,3,2816,4],[2816,5,2822,7],[2817,3,2817,4],[2818,3,2818,4],[2819,3,2819,4],[2820,3,2820,4],[2821,3,2821,4],[2822,3,2822,4],[2823,0,2823,7],[2824,0,2824,7],[2825,0,2825,7],[2826,0,2826,7],[2827,0,2827,7],[2828,0,2828,7],[2829,2,2832,5],[2833,2,2833,5],[2833,6,2833,7],[2800,2,2803,5],[2804,2,2804,5],[2804,6,2804,7],[2805,0,2805,7],[2806,0,2806,7],[2807,2,2807,3],[2807,6,2807,7],[2808,2,2808,3],[2808,6,2808,7],[2809,2,2809,4],[2811,6,2811,7],[2812,1,2812,2],[2812,6,2812,7],[2813,1,2813,2],[2814,1,2814,2],[2814,3,2814,4],[2814,5,2814,7],[2813,6,2813,7],[2785,1,2785,2],[2785,3,2785,4],[2785,5,2785,7],[2787,3,2787,4],[2787,5,2793,7],[2788,3,2788,4],[2789,3,2789,4],[2790,3,2790,4],[2791,3,2791,4],[2792,3,2792,4],[2793,3,2793,4],[2794,0,2794,7],[2795,0,2795,7],[2796,0,2796,7],[2797,0,2797,7],[2798,0,2798,7],[2799,0,2799,7],[2767,0,2767,7],[2768,0,2768,7],[2769,0,2769,7],[2770,0,2770,7],[2771,2,2774,5],[2775,2,2775,5],[2775,6,2775,7],[2777,0,2777,7],[2778,2,2778,3],[2778,6,2778,7],[2779,2,2779,3],[2779,6,2779,7],[2780,2,2780,4],[2782,6,2782,7],[2783,1,2783,2],[2783,6,2783,7],[2784,1,2784,2],[2784,6,2784,7],[2754,1,2754,2],[2754,6,2754,7],[2755,1,2755,2],[2756,1,2756,2],[2756,3,2756,4],[2756,5,2756,7],[2757,0,2757,7],[2758,3,2758,4],[2758,5,2764,7],[2759,3,2759,4],[2760,3,2760,4],[2761,3,2761,4],[2762,3,2762,4],[2763,3,2763,4],[2764,3,2764,4],[2765,0,2765,7],[2766,0,2766,7],[2755,6,2755,7],[2736,0,2736,7],[2737,0,2737,7],[2738,0,2738,7],[2739,0,2739,7],[2740,0,2740,7],[2741,0,2741,7],[2742,2,2745,5],[2746,2,2746,5],[2746,6,2746,7],[2747,0,2747,7],[2748,0,2748,7],[2749,2,2749,3],[2749,6,2749,7],[2750,2,2750,3],[2750,6,2750,7],[2751,2,2751,4],[2753,6,2753,7],[2719,0,2719,7],[2720,2,2720,3],[2720,6,2720,7],[2721,2,2721,3],[2721,6,2721,7],[2722,2,2722,4],[2724,6,2724,7],[2725,1,2725,2],[2725,6,2725,7],[2726,1,2726,2],[2727,1,2727,2],[2727,3,2727,4],[2727,5,2727,7],[2729,3,2729,4],[2729,5,2735,7],[2730,3,2730,4],[2731,3,2731,4],[2732,3,2732,4],[2733,3,2733,4],[2734,3,2734,4],[2735,3,2735,4],[2726,6,2726,7],[2699,0,2699,7],[2700,3,2700,4],[2700,5,2706,7],[2701,3,2701,4],[2702,3,2702,4],[2703,3,2703,4],[2704,3,2704,4],[2705,3,2705,4],[2706,3,2706,4],[2707,0,2707,7],[2708,0,2708,7],[2709,0,2709,7],[2710,0,2710,7],[2711,0,2711,7],[2712,0,2712,7],[2713,2,2716,5],[2717,2,2717,5],[2717,6,2717,7],[2684,2,2687,5],[2688,2,2688,5],[2688,6,2688,7],[2689,0,2689,7],[2690,0,2690,7],[2691,2,2691,3],[2691,6,2691,7],[2692,2,2692,3],[2692,6,2692,7],[2693,2,2693,4],[2695,6,2695,7],[2696,1,2696,2],[2696,6,2696,7],[2697,1,2697,2],[2698,1,2698,2],[2698,3,2698,4],[2698,5,2698,7],[2697,6,2697,7],[2669,1,2669,2],[2669,3,2669,4],[2669,5,2669,7],[2671,3,2671,4],[2671,5,2677,7],[2672,3,2672,4],[2673,3,2673,4],[2674,3,2674,4],[2675,3,2675,4],[2676,3,2676,4],[2677,3,2677,4],[2678,0,2678,7],[2679,0,2679,7],[2680,0,2680,7],[2681,0,2681,7],[2682,0,2682,7],[2683,0,2683,7],[2651,0,2651,7],[2652,0,2652,7],[2653,0,2653,7],[2654,0,2654,7],[2655,2,2658,5],[2659,2,2659,5],[2659,6,2659,7],[2661,0,2661,7],[2662,2,2662,3],[2662,6,2662,7],[2663,2,2663,3],[2663,6,2663,7],[2664,2,2664,4],[2666,6,2666,7],[2667,1,2667,2],[2667,6,2667,7],[2668,1,2668,2],[2668,6,2668,7],[2638,1,2638,2],[2638,6,2638,7],[2639,1,2639,2],[2640,1,2640,2],[2640,3,2640,4],[2640,5,2640,7],[2641,0,2641,7],[2642,3,2642,4],[2642,5,2648,7],[2643,3,2643,4],[2644,3,2644,4],[2645,3,2645,4],[2646,3,2646,4],[2647,3,2647,4],[2648,3,2648,4],[2649,0,2649,7],[2650,0,2650,7],[2639,6,2639,7],[2620,0,2620,7],[2621,0,2621,7],[2622,0,2622,7],[2623,0,2623,7],[2624,0,2624,7],[2625,0,2625,7],[2626,2,2629,5],[2630,2,2630,5],[2630,6,2630,7],[2631,0,2631,7],[2632,0,2632,7],[2633,2,2633,3],[2633,6,2633,7],[2634,2,2634,3],[2634,6,2634,7],[2635,2,2635,4],[2637,6,2637,7],[2603,0,2603,7],[2604,2,2604,3],[2604,6,2604,7],[2605,2,2605,3],[2605,6,2605,7],[2606,2,2606,4],[2608,6,2608,7],[2609,1,2609,2],[2609,6,2609,7],[2610,1,2610,2],[2611,1,2611,2],[2611,3,2611,4],[2611,5,2611,7],[2613,3,2613,4],[2613,5,2619,7],[2614,3,2614,4],[2615,3,2615,4],[2616,3,2616,4],[2617,3,2617,4],[2618,3,2618,4],[2619,3,2619,4],[2610,6,2610,7],[2583,0,2583,7],[2584,3,2584,4],[2584,5,2590,7],[2585,3,2585,4],[2586,3,2586,4],[2587,3,2587,4],[2588,3,2588,4],[2589,3,2589,4],[2590,3,2590,4],[2591,0,2591,7],[2592,0,2592,7],[2593,0,2593,7],[2594,0,2594,7],[2595,0,2595,7],[2596,0,2596,7],[2597,2,2600,5],[2601,2,2601,5],[2601,6,2601,7],[2568,2,2571,5],[2572,2,2572,5],[2572,6,2572,7],[2573,0,2573,7],[2574,0,2574,7],[2575,2,2575,3],[2575,6,2575,7],[2576,2,2576,3],[2576,6,2576,7],[2577,2,2577,4],[2579,6,2579,7],[2580,1,2580,2],[2580,6,2580,7],[2581,1,2581,2],[2582,1,2582,2],[2582,3,2582,4],[2582,5,2582,7],[2581,6,2581,7],[2553,1,2553,2],[2553,3,2553,4],[2553,5,2553,7],[2555,3,2555,4],[2555,5,2561,7],[2556,3,2556,4],[2557,3,2557,4],[2558,3,2558,4],[2559,3,2559,4],[2560,3,2560,4],[2561,3,2561,4],[2562,0,2562,7],[2563,0,2563,7],[2564,0,2564,7],[2565,0,2565,7],[2566,0,2566,7],[2567,0,2567,7],[2535,0,2535,7],[2536,0,2536,7],[2537,0,2537,7],[2538,0,2538,7],[2539,2,2542,5],[2543,2,2543,5],[2543,6,2543,7],[2545,0,2545,7],[2546,2,2546,3],[2546,6,2546,7],[2547,2,2547,3],[2547,6,2547,7],[2548,2,2548,4],[2550,6,2550,7],[2551,1,2551,2],[2551,6,2551,7],[2552,1,2552,2],[2552,6,2552,7],[2522,1,2522,2],[2522,6,2522,7],[2523,1,2523,2],[2524,1,2524,2],[2524,3,2524,4],[2524,5,2524,7],[2525,0,2525,7],[2526,3,2526,4],[2526,5,2532,7],[2527,3,2527,4],[2528,3,2528,4],[2529,3,2529,4],[2530,3,2530,4],[2531,3,2531,4],[2532,3,2532,4],[2533,0,2533,7],[2534,0,2534,7],[2523,6,2523,7],[2504,0,2504,7],[2505,0,2505,7],[2506,0,2506,7],[2507,0,2507,7],[2508,0,2508,7],[2509,0,2509,7],[2510,2,2513,5],[2514,2,2514,5],[2514,6,2514,7],[2515,0,2515,7],[2516,0,2516,7],[2517,2,2517,3],[2517,6,2517,7],[2518,2,2518,3],[2518,6,2518,7],[2519,2,2519,4],[2521,6,2521,7],[2487,0,2487,7],[2488,2,2488,3],[2488,6,2488,7],[2489,2,2489,3],[2489,6,2489,7],[2490,2,2490,4],[2492,6,2492,7],[2493,1,2493,2],[2493,6,2493,7],[2494,1,2494,2],[2495,1,2495,2],[2495,3,2495,4],[2495,5,2495,7],[2497,3,2497,4],[2497,5,2503,7],[2498,3,2498,4],[2499,3,2499,4],[2500,3,2500,4],[2501,3,2501,4],[2502,3,2502,4],[2503,3,2503,4],[2494,6,2494,7],[2467,0,2467,7],[2468,3,2468,4],[2468,5,2474,7],[2469,3,2469,4],[2470,3,2470,4],[2471,3,2471,4],[2472,3,2472,4],[2473,3,2473,4],[2474,3,2474,4],[2475,0,2475,7],[2476,0,2476,7],[2477,0,2477,7],[2478,0,2478,7],[2479,0,2479,7],[2480,0,2480,7],[2481,2,2484,5],[2485,2,2485,5],[2485,6,2485,7],[2452,2,2455,5],[2456,2,2456,5],[2456,6,2456,7],[2457,0,2457,7],[2458,0,2458,7],[2459,2,2459,3],[2459,6,2459,7],[2460,2,2460,3],[2460,6,2460,7],[2461,2,2461,4],[2463,6,2463,7],[2464,1,2464,2],[2464,6,2464,7],[2465,1,2465,2],[2466,1,2466,2],[2466,3,2466,4],[2466,5,2466,7],[2465,6,2465,7],[2437,1,2437,2],[2437,3,2437,4],[2437,5,2437,7],[2439,3,2439,4],[2439,5,2445,7],[2440,3,2440,4],[2441,3,2441,4],[2442,3,2442,4],[2443,3,2443,4],[2444,3,2444,4],[2445,3,2445,4],[2446,0,2446,7],[2447,0,2447,7],[2448,0,2448,7],[2449,0,2449,7],[2450,0,2450,7],[2451,0,2451,7],[2419,0,2419,7],[2420,0,2420,7],[2421,0,2421,7],[2422,0,2422,7],[2423,2,2426,5],[2427,2,2427,5],[2427,6,2427,7],[2429,0,2429,7],[2430,2,2430,3],[2430,6,2430,7],[2431,2,2431,3],[2431,6,2431,7],[2432,2,2432,4],[2434,6,2434,7],[2435,1,2435,2],[2435,6,2435,7],[2436,1,2436,2],[2436,6,2436,7],[2406,1,2406,2],[2406,6,2406,7],[2407,1,2407,2],[2408,1,2408,2],[2408,3,2408,4],[2408,5,2408,7],[2409,0,2409,7],[2410,3,2410,4],[2410,5,2416,7],[2411,3,2411,4],[2412,3,2412,4],[2413,3,2413,4],[2414,3,2414,4],[2415,3,2415,4],[2416,3,2416,4],[2417,0,2417,7],[2418,0,2418,7],[2407,6,2407,7],[2388,0,2388,7],[2389,0,2389,7],[2390,0,2390,7],[2391,0,2391,7],[2392,0,2392,7],[2393,0,2393,7],[2394,2,2397,5],[2398,2,2398,5],[2398,6,2398,7],[2399,0,2399,7],[2400,0,2400,7],[2401,2,2401,3],[2401,6,2401,7],[2402,2,2402,3],[2402,6,2402,7]],"merged_total":3367,"flags":["merged_cut"]}
[{"$f":"IF('School Info'!$B$4=\"\",\"\",'School Info'!$B$4)","v":"Mahatma Gandhi Government School Bar"}]
[null,null,"School Aff. Code :",null,{"$f":"IF('School Info'!$F$5=\"\",\"\",'School Info'!$F$5)","v":123456}]
[null,null,{"$f":"IF('School Info'!$H$5=\"\",\"\",'School Info'!$H$5)","v":"HALF YEARLY EXAM"},null,{"$f":"IF('School Info'!$H$7=\"\",\"\",'School Info'!$H$7)","v":"2025-26"}]
[null,null,"ADMIT CARD",null,null,null,null,null,1]
[]
["ROLL NO :  ",{"$f":"VLOOKUP(I4,Student_data,3,0)","v":101},null,"CLASS : ",{"$f":"IF('School Info'!$B$7=\"\",\"\",'School Info'!$B$7)","v":6},"DOB :",{"$f":"VLOOKUP(I4,Student_data,4,0)","v":"2001-01-01"}]
["NAME :  ",{"$f":"VLOOKUP(I4,Student_data,6,0)","v":"RAJ GURUJI"},null,"MEDUIM : ",{"$f":"IF('School Info'!$E$7=\"\",\"\",'School Info'!$E$7)","v":"HINDI"},"GENDER :",{"$f":"VLOOKUP(I4,Student_data,5,0)","v":"MALE"}]
["FATHER :  ",{"$f":"VLOOKUP(I4,Student_data,7,0)","v":"RAJ"},null,"SECTION : ",{"$f":"IF('School Info'!$F$8=\"\",\"\",'School Info'!$F$8)","v":"A"},"S.No. : ",{"$f":"VLOOKUP(I4,Student_data,2,0)","v":755}]
["MOTHER :  ",{"$f":"VLOOKUP(I4,Student_data,8,0)","v":"DEVI"},null,"School DISE Code :",null,{"$f":"IF('School Info'!$B$5=\"\",\"\",'School Info'!$B$5)","v":123456890}]
[]
["SUBJECT","DATE","DAY","TIME "]
[{"$f":"IF('School Info'!$J$5=\"\",\"\",'School Info'!$J$5)","v":"HINDI"},{"$f":"IF('School Info'!$K$5=\"\",\"\",'School Info'!$K$5)","v":"2001-01-01"},{"$f":"IF('School Info'!$L$5=\"\",\"\",'School Info'!$L$5)","v":"MONDAY"},{"$f":"IF('School Info'!$M$5=\"\",\"\",'School Info'!$M$5)","v":"10:00AM TO 12:00PM"}]
[{"$f":"IF('School Info'!$J$6=\"\",\"\",'School Info'!$J$6)","v":"ENGLISH"},{"$f":"IF('School Info'!$K$6=\"\",\"\",'School Info'!$K$6)","v":"2001-01-01"},{"$f":"IF('School Info'!$L$6=\"\",\"\",'School Info'!$L$6)","v":"TUESDAY"},{"$f":"IF('School Info'!$M$6=\"\",\"\",'School Info'!$M$6)","v":"10:00AM TO 12:00PM"}]
[{"$f":"IF('School Info'!$J$7=\"\",\"\",'School Info'!$J$7)","v":"SCIENCE"},{"$f":"IF('School Info'!$K$7=\"\",\"\",'School Info'!$K$7)","v":"2001-01-01"},{"$f":"IF('School Info'!$L$7=\"\",\"\",'School Info'!$L$7)","v":"WEDNESDAY"},{"$f":"IF('School Info'!$M$7=\"\",\"\",'School Info'!$M$7)","v":"10:00AM TO 12:00PM"}]
[{"$f":"IF('School Info'!$J$8=\"\",\"\",'School Info'!$J$8)","v":"MATH"},{"$f":"IF('School Info'!$K$8=\"\",\"\",'School Info'!$K$8)","v":"2001-01-01"},{"$f":"IF('School Info'!$L$8=\"\",\"\",'School Info'!$L$8)","v":"THURSDAY"},{"$f":"IF('School Info'!$M$8=\"\",\"\",'School Info'!$M$8)","v":"10:00AM TO 12:00PM"}]
[{"$f":"IF('School Info'!$J$9=\"\",\"\",'School Info'!$J$9)","v":"SOCIAL SCIENCE"},{"$f":"IF('School Info'!$K$9=\"\",\"\",'School Info'!$K$9)","v":"2001-01-01"},{"$f":"IF('School Info'!$L$9=\"\",\"\",'School Info'!$L$9)","v":"FRIDAY"},{"$f":"IF('School Info'!$M$9=\"\",\"\",'School Info'!$M$9)","v":"10:00AM TO 12:00PM"}]
[{"$f":"IF('School Info'!$J$10=\"\",\"\",'School Info'!$J$10)","v":"SANSKRIT"},{"$f":"IF('School Info'!$K$10=\"\",\"\",'School Info'!$K$10)","v":"2001-01-01"},{"$f":"IF('School Info'!$L$10=\"\",\"\",'School Info'!$L$10)","v":"SATURDAY"},{"$f":"IF('School Info'!$M$10=\"\",\"\",'School Info'!$M$10)","v":"10:00AM TO 12:00PM"}]
[{"$f":"IF('School Info'!$J$11=\"\",\"\",'School Info'!$J$11)","v":""},{"$f":"IF('School Info'!$K$11=\"\",\"\",'School Info'!$K$11)","v":"2001-01-02"},{"$f":"IF('School Info'!$L$11=\"\",\"\",'School Info'!$L$11)","v":"SUNDAY"},{"$f":"IF('School Info'!$M$11=\"\",\"\",'School Info'!$M$11)","v":"10:00AM TO 12:00PM"}]
[{"$f":"IF('School Info'!$J$12=\"\",\"\",'School Info'!$J$12)","v":""},{"$f":"IF('School Info'!$K$12=\"\",\"\",'School Info'!$K$12)","v":"2001-01-03"},{"$f":"IF('School Info'!$L$12=\"\",\"\",'School Info'!$L$12)","v":"MONDAY"},{"$f":"IF('School Info'!$M$12=\"\",\"\",'School Info'!$M$12)","v":"10:00AM TO 12:00PM"}]
[{"$f":"IF('School Info'!$J$13=\"\",\"\",'School Info'!$J$13)","v":""},{"$f":"IF('School Info'!$K$13=\"\",\"\",'School Info'!$K$13)","v":"2001-01-04"},{"$f":"IF('School Info'!$L$13=\"\",\"\",'School Info'!$L$13)","v":"TUESDAY"},{"$f":"IF('School Info'!$M$13=\"\",\"\",'School Info'!$M$13)","v":"10:00AM TO 12:00PM"}]
[{"$f":"IF('School Info'!$J$14=\"\",\"\",'School Info'!$J$14)","v":""},{"$f":"IF('School Info'!$K$14=\"\",\"\",'School Info'!$K$14)","v":""},{"$f":"IF('School Info'!$L$14=\"\",\"\",'School Info'!$L$14)","v":""},{"$f":"IF('School Info'!$M$14=\"\",\"\",'School Info'!$M$14)","v":""}]
[]
["Note :"]
["1. परीक्षार्थी अपना प्रवेश पत्र रोजाना साथ लेकर आये | (Candidates should bring their admit card with them daily.)"]
["2. परीक्षार्थी परीक्षा केंद्र पर आधा घंटे पहले पहुचें | (Candidates should reach the examination center half an hour before.)"]
["3. परीक्षार्थी परीक्षा हेतु आवश्यक सामग्री साथ लेकर आवें | (Candidates should bring with them the necessary materials for the examination.)"]
[]
[]
[]
[]
[]
["Sig. Exam Incharge",null,null,null,null,null,"Sig. Principal "]
[".------------------------------------------------------- Cut Here------------------------------------------------------"]
[{"$f":"IF('School Info'!$B$4=\"\",\"\",'School Info'!$B$4)","v":"Mahatma Gandhi Government School Bar"}]
[null,null,"School Aff. Code :",null,{"$f":"IF('School Info'!$F$5=\"\",\"\",'School Info'!$F$5)","v":123456}]
[null,null,{"$f":"IF('School Info'!$H$5=\"\",\"\",'School Info'!$H$5)","v":"HALF YEARLY EXAM"},null,{"$f":"IF('School Info'!$H$7=\"\",\"\",'School Info'!$H$7)","v":"2025-26"}]
[null,null,"ADMIT CARD",null,null,null,null,null,{"$f":"I4+1","v":2}]
[]
["ROLL NO :  ",{"$f":"VLOOKUP(I37,Student_data,3,0)","v":102},null,"CLASS : ",{"$f":"IF('School Info'!$B$7=\"\",\"\",'School Info'!$B$7)","v":6},"DOB :",{"$f":"VLOOKUP(I37,Student_data,4,0)","v":"2002-01-01"}]
["NAME :  ",{"$f":"VLOOKUP(I37,Student_data,6,0)","v":"lala"},null,"MEDUIM : ",{"$f":"IF('School Info'!$E$7=\"\",\"\",'School Info'!$E$7)","v":"HINDI"},"GENDER :",{"$f":"VLOOKUP(I37,Student_data,5,0)","v":"FEMALE"}]
["FATHER :  ",{"$f":"VLOOKUP(I37,Student_data,7,0)","v":"RAAA"},null,"SECTION : ",{"$f":"IF('School Info'!$F$8=\"\",\"\",'School Info'!$F$8)","v":"A"},"S.No. : ",{"$f":"VLOOKUP(I37,Student_data,2,0)","v":852}]
["MOTHER :  ",{"$f":"VLOOKUP(I37,Student_data,8,0)","v":"DDD"},null,"School DISE Code :",null,{"$f":"IF('School Info'!$B$5=\"\",\"\",'School Info'!$B$5)","v":123456890}]
[]
["SUBJECT","DATE","DAY","TIME "]
[{"$f":"IF('School Info'!$J$5=\"\",\"\",'School Info'!$J$5)","v":"HINDI"},{"$f":"IF('School Info'!$K$5=\"\",\"\",'School Info'!$K$5)","v":"2001-01-01"},{"$f":"IF('School Info'!$L$5=\"\",\"\",'School Info'!$L$5)","v":"MONDAY"},{"$f":"IF('School Info'!$M$5=\"\",\"\",'School Info'!$M$5)","v":"10:00AM TO 12:00PM"}]
[{"$f":"IF('School Info'!$J$6=\"\",\"\",'School Info'!$J$6)","v":"ENGLISH"},{"$f":"IF('School Info'!$K$6=\"\",\"\",'School Info'!$K$6)","v":"2001-01-01"},{"$f":"IF('School Info'!$L$6=\"\",\"\",'School Info'!$L$6)","v":"TUESDAY"},{"$f":"IF('School Info'!$M$6=\"\",\"\",'School Info'!$M$6)","v":"10:00AM TO 12:00PM"}]
[{"$f":"IF('School Info'!$J$7=\"\",\"\",'School Info'!$J$7)","v":"SCIENCE"},{"$f":"IF('School Info'!$K$7=\"\",\"\",'School Info'!$K$7)","v":"2001-01-01"},{"$f":"IF('School Info'!$L$7=\"\",\"\",'School Info'!$L$7)","v":"WEDNESDAY"},{"$f":"IF('School Info'!$M$7=\"\",\"\",'School Info'!$M$7)","v":"10:00AM TO 12:00PM"}]
[{"$f":"IF('School Info'!$J$8=\"\",\"\",'School Info'!$J$8)","v":"MATH"},{"$f":"IF('School Info'!$K$8=\"\",\"\",'School Info'!$K$8)","v":"2001-01-01"},{"$f":"IF('School Info'!$L$8=\"\",\"\",'School Info'!$L$8)","v":"THURSDAY"},{"$f":"IF('School Info'!$M$8=\"\",\"\",'School Info'!$M$8)","v":"10:00AM TO 12:00PM"}]
[{"$f":"IF('School Info'!$J$9=\"\",\"\",'School Info'!$J$9)","v":"SOCIAL SCIENCE"},{"$f":"IF('School Info'!$K$9=\"\",\"\",'School Info'!$K$9)","v":"2001-01-01"},{"$f":"IF('School Info'!$L$9=\"\",\"\",'School Info'!$L$9)","v":"FRIDAY"},{"$f":"IF('School Info'!$M$9=\"\",\"\",'School Info'!$M$9)","v":"10:00AM TO 12:00PM"}]
[{"$f":"IF('School Info'!$J$10=\"\",\"\",'School Info'!$J$10)","v":"SANSKRIT"},{"$f":"IF('School Info'!$K$10=\"\",\"\",'School Info'!$K$10)","v":"2001-01-01"},{"$f":"IF('School Info'!$L$10=\"\",\"\",'School Info'!$L$10)","v":"SATURDAY"},{"$f":"IF('School Info'!$M$10=\"\",\"\",'School Info'!$M$10)","v":"10:00AM TO 12:00PM"}]
[{"$f":"IF('School Info'!$J$11=\"\",\"\",'School Info'!$J$11)","v":""},{"$f":"IF('School Info'!$K$11=\"\",\"\",'School Info'!$K$11)","v":"2001-01-02"},{"$f":"IF('School Info'!$L$11=\"\",\"\",'School Info'!$L$11)","v":"SUNDAY"},{"$f":"IF('School Info'!$M$11=\"\",\"\",'School Info'!$M$11)","v":"10:00AM TO 12:00PM"}]
[{"$f":"IF('School Info'!$J$12=\"\",\"\",'School Info'!$J$12)","v":""},{"$f":"IF('School Info'!$K$12=\"\",\"\",'School Info'!$K$12)","v":"2001-01-03"},{"$f":"IF('School Info'!$L$12=\"\",\"\",'School Info'!$L$12)","v":"MONDAY"},{"$f":"IF('School Info'!$M$12=\"\",\"\",'School Info'!$M$12)","v":"10:00AM TO 12:00PM"}]
[{"$f":"IF('School Info'!$J$13=\"\",\"\",'School Info'!$J$13)","v":""},{"$f":"IF('School Info'!$K$13=\"\",\"\",'School Info'!$K$13)","v":"2001-01-04"},{"$f":"IF('School Info'!$L$13=\"\",\"\",'School Info'!$L$13)","v":"TUESDAY"},{"$f":"IF('School Info'!$M$13=\"\",\"\",'School Info'!$M$13)","v":"10:00AM TO 12:00PM"}]
[{"$f":"IF('School Info'!$J$14=\"\",\"\",'School Info'!$J$14)","v":""},{"$f":"IF('School Info'!$K$14=\"\",\"\",'School Info'!$K$14)","v":""},{"$f":"IF('School Info'!$L$14=\"\",\"\",'School Info'!$L$14)","v":""},{"$f":"IF('School Info'!$M$14=\"\",\"\",'School Info'!$M$14)","v":""}]
[]
["Note :"]
["1. परीक्षार्थी अपना प्रवेश पत्र रोजाना साथ लेकर आये | (Candidates should bring their admit card with them daily.)"]
["2. परीक्षार्थी परीक्षा केंद्र पर आधा घंटे पहले पहुचें | (Candidates should reach the examination center half an hour before.)"]
["3. परीक्षार्थी परीक्षा हेतु आवश्यक सामग्री साथ लेकर आवें | (Candidates should bring with them the necessary materials for the examination.)"]
[]
[]
[]
[]
[]
["Sig. Exam Incharge",null,null,null,null,null,"Sig. Principal "]
[]
[{"$f":"IF('School Info'!$B$4=\"\",\"\",'School Info'!$B$4)","v":"Mahatma Gandhi Government School Bar"}]
[null,null,"School Aff. Code :",null,{"$f":"IF('School Info'!$F$5=\"\",\"\",'School Info'!$F$5)","v":123456}]
[null,null,{"$f":"IF('School Info'!$H$5=\"\",\"\",'School Info'!$H$5)","v":"HALF YEARLY EXAM"},null,{"$f":"IF('School Info'!$H$7=\"\",\"\",'School Info'!$H$7)","v":"2025-26"}]
[null,null,"ADMIT CARD",null,null,null,null,null,{"$f":"I37+1","v":3}]
[]
["ROLL NO :  ",{"$f":"VLOOKUP(I70,Student_data,3,0)","v":103},null,"CLASS : ",{"$f":"IF('School Info'!$B$7=\"\",\"\",'School Info'!$B$7)","v":6},"DOB :",{"$f":"VLOOKUP(I70,Student_data,4,0)","v":"2003-01-01"}]
["NAME :  ",{"$f":"VLOOKUP(I70,Student_data,6,0)","v":"SONU"},null,"MEDUIM : ",{"$f":"IF('School Info'!$E$7=\"\",\"\",'School Info'!$E$7)","v":"HINDI"},"GENDER :",{"$f":"VLOOKUP(I70,Student_data,5,0)","v":"FEMALE"}]
["FATHER :  ",{"$f":"VLOOKUP(I70,Student_data,7,0)","v":"AAA"},null,"SECTION : ",{"$f":"IF('School Info'!$F$8=\"\",\"\",'School Info'!$F$8)","v":"A"},"S.No. : ",{"$f":"VLOOKUP(I70,Student_data,2,0)","v":901}]
["MOTHER :  ",{"$f":"VLOOKUP(I70,Student_data,8,0)","v":"DDS"},null,"School DISE Code :",null,{"$f":"IF('School Info'!$B$5=\"\",\"\",'School Info'!$B$5)","v":123456890}]
[]
["SUBJECT","DATE","DAY","TIME "]
[{"$f":"IF('School Info'!$J$5=\"\",\"\",'School Info'!$J$5)","v":"HINDI"},{"$f":"IF('School Info'!$K$5=\"\",\"\",'School Info'!$K$5)","v":"2001-01-01"},{"$f":"IF('School Info'!$L$5=\"\",\"\",'School Info'!$L$5)","v":"MONDAY"},{"$f":"IF('School Info'!$M$5=\"\",\"\",'School Info'!$M$5)","v":"10:00AM TO 12:00PM"}]
[{"$f":"IF('School Info'!$J$6=\"\",\"\",'School Info'!$J$6)","v":"ENGLISH"},{"$f":"IF('School Info'!$K$6=\"\",\"\",'School Info'!$K$6)","v":"2001-01-01"},{"$f":"IF('School Info'!$L$6=\"\",\"\",'School Info'!$L$6)","v":"TUESDAY"},{"$f":"IF('School Info'!$M$6=\"\",\"\",'School Info'!$M$6)","v":"10:00AM TO 12:00PM"}]
[{"$f":"IF('School Info'!$J$7=\"\",\"\",'School Info'!$J$7)","v":"SCIENCE"},{"$f":"IF('School Info'!$K$7=\"\",\"\",'School Info'!$K$7)","v":"2001-01-01"},{"$f":"IF('School Info'!$L$7=\"\",\"\",'School Info'!$L$7)","v":"WEDNESDAY"},{"$f":"IF('School Info'!$M$7=\"\",\"\",'School Info'!$M$7)","v":"10:00AM TO 12:00PM"}]
[{"$f":"IF('School Info'!$J$8=\"\",\"\",'School Info'!$J$8)","v":"MATH"},{"$f":"IF('School Info'!$K$8=\"\",\"\",'School Info'!$K$8)","v":"2001-01-01"},{"$f":"IF('School Info'!$L$8=\"\",\"\",'School Info'!$L$8)","v":"THURSDAY"},{"$f":"IF('School Info'!$M$8=\"\",\"\",'School Info'!$M$8)","v":"10:00AM TO 12:00PM"}]
[{"$f":"IF('School Info'!$J$9=\"\",\"\",'School Info'!$J$9)","v":"SOCIAL SCIENCE"},{"$f":"IF('School Info'!$K$9=\"\",\"\",'School Info'!$K$9)","v":"2001-01-01"},{"$f":"IF('School Info'!$L$9=\"\",\"\",'School Info'!$L$9)","v":"FRIDAY"},{"$f":"IF('School Info'!$M$9=\"\",\"\",'School Info'!$M$9)","v":"10:00AM TO 12:00PM"}]
[{"$f":"IF('School Info'!$J$10=\"\",\"\",'School Info'!$J$10)","v":"SANSKRIT"},{"$f":"IF('School Info'!$K$10=\"\",\"\",'School Info'!$K$10)","v":"2001-01-01"},{"$f":"IF('School Info'!$L$10=\"\",\"\",'School Info'!$L$10)","v":"SATURDAY"},{"$f":"IF('School Info'!$M$10=\"\",\"\",'School Info'!$M$10)","v":"10:00AM TO 12:00PM"}]
[{"$f":"IF('School Info'!$J$11=\"\",\"\",'School Info'!$J$11)","v":""},{"$f":"IF('School Info'!$K$11=\"\",\"\",'School Info'!$K$11)","v":"2001-01-02"},{"$f":"IF('School Info'!$L$11=\"\",\"\",'School Info'!$L$11)","v":"SUNDAY"},{"$f":"IF('School Info'!$M$11=\"\",\"\",'School Info'!$M$11)","v":"10:00AM TO 12:00PM"}]
[{"$f":"IF('School Info'!$J$12=\"\",\"\",'School Info'!$J$12)","v":""},{"$f":"IF('School Info'!$K$12=\"\",\"\",'School Info'!$K$12)","v":"2001-01-03"},{"$f":"IF('School Info'!$L$12=\"\",\"\",'School Info'!$L$12)","v":"MONDAY"},{"$f":"IF('School Info'!$M$12=\"\",\"\",'School Info'!$M$12)","v":"10:00AM TO 12:00PM"}]
[{"$f":"IF('School Info'!$J$13=\"\",\"\",'School Info'!$J$13)","v":""},{"$f":"IF('School Info'!$K$13=\"\",\"\",'School Info'!$K$13)","v":"2001-01-04"},{"$f":"IF('School Info'!$L$13=\"\",\"\",'School Info'!$L$13)","v":"TUESDAY"},{"$f":"IF('School Info'!$M$13=\"\",\"\",'School Info'!$M$13)","v":"10:00AM TO 12:00PM"}]
[{"$f":"IF('School Info'!$J$14=\"\",\"\",'School Info'!$J$14)","v":""},{"$f":"IF('School Info'!$K$14=\"\",\"\",'School Info'!$K$14)","v":""},{"$f":"IF('School Info'!$L$14=\"\",\"\",'School Info'!$L$14)","v":""},{"$f":"IF('School Info'!$M$14=\"\",\"\",'School Info'!$M$14)","v":""}]
[]
["Note :"]
["1. परीक्षार्थी अपना प्रवेश पत्र रोजाना साथ लेकर आये | (Candidates should bring their admit card with them daily.)"]
["2. परीक्षार्थी परीक्षा केंद्र पर आधा घंटे पहले पहुचें | (Candidates should reach the examination center half an hour before.)"]
["3. परीक्षार्थी परीक्षा हेतु आवश्यक सामग्री साथ लेकर आवें | (Candidates should bring with them the necessary materials for the examination.)"]
[]
[]
[]
[]
[]
["Sig. Exam Incharge",null,null,null,null,null,"Sig. Principal "]
[".------------------------------------------------------- Cut Here------------------------------------------------------"]
[{"$f":"IF('School Info'!$B$4=\"\",\"\",'School Info'!$B$4)","v":"Mahatma Gandhi Government School Bar"}]
[null,null,"School Aff. Code :",null,{"$f":"IF('School Info'!$F$5=\"\",\"\",'School Info'!$F$5)","v":123456}]
[null,null,{"$f":"IF('School Info'!$H$5=\"\",\"\",'School Info'!$H$5)","v":"HALF YEARLY EXAM"},null,{"$f":"IF('School Info'!$H$7=\"\",\"\",'School Info'!$H$7)","v":"2025-26"}]
[null,null,"ADMIT CARD",null,null,null,null,null,{"$f":"I70+1","v":4}]
[]
["ROLL NO :  ",{"$f":"VLOOKUP(I103,Student_data,3,0)","v":104},null,"CLASS : ",{"$f":"IF('School Info'!$B$7=\"\",\"\",'School Info'!$B$7)","v":6},"DOB :",{"$f":"VLOOKUP(I103,Student_data,4,0)","v":"2004-01-01"}]
["NAME :  ",{"$f":"VLOOKUP(I103,Student_data,6,0)","v":"KARNA"},null,"MEDUIM : ",{"$f":"IF('School Info'!$E$7=\"\",\"\",'School Info'!$E$7)","v":"HINDI"},"GENDER :",{"$f":"VLOOKUP(I103,Student_data,5,0)","v":"MALE"}]
["FATHER :  ",{"$f":"VLOOKUP(I103,Student_data,7,0)","v":"BBB"},null,"SECTION : ",{"$f":"IF('School Info'!$F$8=\"\",\"\",'School Info'!$F$8)","v":"A"},"S.No. : ",{"$f":"VLOOKUP(I103,Student_data,2,0)","v":222}]
["MOTHER :  ",{"$f":"VLOOKUP(I103,Student_data,8,0)","v":"SSDDF"},null,"School DISE Code :",null,{"$f":"IF('School Info'!$B$5=\"\",\"\",'School Info'!$B$5)","v":123456890}]
[]
["SUBJECT","DATE","DAY","TIME "]
[{"$f":"IF('School Info'!$J$5=\"\",\"\",'School Info'!$J$5)","v":"HINDI"},{"$f":"IF('School Info'!$K$5=\"\",\"\",'School Info'!$K$5)","v":"2001-01-01"},{"$f":"IF('School Info'!$L$5=\"\",\"\",'School Info'!$L$5)","v":"MONDAY"},{"$f":"IF('School Info'!$M$5=\"\",\"\",'School Info'!$M$5)","v":"10:00AM TO 12:00PM"}]
[{"$f":"IF('School Info'!$J$6=\"\",\"\",'School Info'!$J$6)","v":"ENGLISH"},{"$f":"IF('School Info'!$K$6=\"\",\"\",'School Info'!$K$6)","v":"2001-01-01"},{"$f":"IF('School Info'!$L$6=\"\",\"\",'School Info'!$L$6)","v":"TUESDAY"},{"$f":"IF('School Info'!$M$6=\"\",\"\",'School Info'!$M$6)","v":"10:00AM TO 12:00PM"}]
[{"$f":"IF('School Info'!$J$7=\"\",\"\",'School Info'!$J$7)","v":"SCIENCE"},{"$f":"IF('School Info'!$K$7=\"\",\"\",'School Info'!$K$7)","v":"2001-01-01"},{"$f":"IF('School Info'!$L$7=\"\",\"\",'School Info'!$L$7)","v":"WEDNESDAY"},{"$f":"IF('School Info'!$M$7=\"\",\"\",'School Info'!$M$7)","v":"10:00AM TO 12:00PM"}]
[{"$f":"IF('School Info'!$J$8=\"\",\"\",'School Info'!$J$8)","v":"MATH"},{"$f":"IF('School Info'!$K$8=\"\",\"\",'School Info'!$K$8)","v":"2001-01-01"},{"$f":"IF('School Info'!$L$8=\"\",\"\",'School Info'!$L$8)","v":"THURSDAY"},{"$f":"IF('School Info'!$M$8=\"\",\"\",'School Info'!$M$8)","v":"10:00AM TO 12:00PM"}]
[{"$f":"IF('School Info'!$J$9=\"\",\"\",'School Info'!$J$9)","v":"SOCIAL SCIENCE"},{"$f":"IF('School Info'!$K$9=\"\",\"\",'School Info'!$K$9)","v":"2001-01-01"},{"$f":"IF('School Info'!$L$9=\"\",\"\",'School Info'!$L$9)","v":"FRIDAY"},{"$f":"IF('School Info'!$M$9=\"\",\"\",'School Info'!$M$9)","v":"10:00AM TO 12:00PM"}]
[{"$f":"IF('School Info'!$J$10=\"\",\"\",'School Info'!$J$10)","v":"SANSKRIT"},{"$f":"IF('School Info'!$K$10=\"\",\"\",'School Info'!$K$10)","v":"2001-01-01"},{"$f":"IF('School Info'!$L$10=\"\",\"\",'School Info'!$L$10)","v":"SATURDAY"},{"$f":"IF('School Info'!$M$10=\"\",\"\",'School Info'!$M$10)","v":"10:00AM TO 12:00PM"}]
[{"$f":"IF('School Info'!$J$11=\"\",\"\",'School Info'!$J$11)","v":""},{"$f":"IF('School Info'!$K$11=\"\",\"\",'School Info'!$K$11)","v":"2001-01-02"},{"$f":"IF('School Info'!$L$11=\"\",\"\",'School Info'!$L$11)","v":"SUNDAY"},{"$f":"IF('School Info'!$M$11=\"\",\"\",'School Info'!$M$11)","v":"10:00AM TO 12:00PM"}]
[{"$f":"IF('School Info'!$J$12=\"\",\"\",'School Info'!$J$12)","v":""},{"$f":"IF('School Info'!$K$12=\"\",\"\",'School Info'!$K$12)","v":"2001-01-03"},{"$f":"IF('School Info'!$L$12=\"\",\"\",'School Info'!$L$12)","v":"MONDAY"},{"$f":"IF('School Info'!$M$12=\"\",\"\",'School Info'!$M$12)","v":"10:00AM TO 12:00PM"}]
[{"$f":"IF('School Info'!$J$13=\"\",\"\",'School Info'!$J$13)","v":""},{"$f":"IF('School Info'!$K$13=\"\",\"\",'School Info'!$K$13)","v":"2001-01-04"},{"$f":"IF('School Info'!$L$13=\"\",\"\",'School Info'!$L$13)","v":"TUESDAY"},{"$f":"IF('School Info'!$M$13=\"\",\"\",'School Info'!$M$13)","v":"10:00AM TO 12:00PM"}]
[{"$f":"IF('School Info'!$J$14=\"\",\"\",'School Info'!$J$14)","v":""},{"$f":"IF('School Info'!$K$14=\"\",\"\",'School Info'!$K$14)","v":""},{"$f":"IF('School Info'!$L$14=\"\",\"\",'School Info'!$L$14)","v":""},{"$f":"IF('School Info'!$M$14=\"\",\"\",'School Info'!$M$14)","v":""}]
["Note :"]
["1. परीक्षार्थी अपना प्रवेश पत्र रोजाना साथ लेकर आये | (Candidates should bring their admit card with them daily.)"]
["2. परीक्षार्थी परीक्षा केंद्र पर आधा घंटे पहले पहुचें | (Candidates should reach the examination center half an hour before.)"]
["3. परीक्षार्थी परीक्षा हेतु आवश्यक सामग्री साथ लेकर आवें | (Candidates should bring with them the necessary materials for the examination.)"]
[]
[]
[]
[]
[]
["Sig. Exam Incharge",null,null,null,null,null,"Sig. Principal "]
[]
[{"$f":"IF('School Info'!$B$4=\"\",\"\",'School Info'!$B$4)","v":"Mahatma Gandhi Government School Bar"}]
[null,null,"School Aff. Code :",null,{"$f":"IF('School Info'!$F$5=\"\",\"\",'School Info'!$F$5)","v":123456}]
[null,null,{"$f":"IF('School Info'!$H$5=\"\",\"\",'School Info'!$H$5)","v":"HALF YEARLY EXAM"},null,{"$f":"IF('School Info'!$H$7=\"\",\"\",'School Info'!$H$7)","v":"2025-26"}]
[null,null,"ADMIT CARD",null,null,null,null,null,{"$f":"I103+1","v":5}]
[]
["ROLL NO :  ",{"$f":"VLOOKUP(I135,Student_data,3,0)","v":105},null,"CLASS : ",{"$f":"IF('School Info'!$B$7=\"\",\"\",'School Info'!$B$7)","v":6},"DOB :",{"$f":"VLOOKUP(I135,Student_data,4,0)","v":"2005-01-01"}]
["NAME :  ",{"$f":"VLOOKUP(I135,Student_data,6,0)","v":"RAJA  "},null,"MEDUIM : ",{"$f":"IF('School Info'!$E$7=\"\",\"\",'School Info'!$E$7)","v":"HINDI"},"GENDER :",{"$f":"VLOOKUP(I135,Student_data,5,0)","v":"MALE"}]
["FATHER :  ",{"$f":"VLOOKUP(I135,Student_data,7,0)","v":"DFD"},null,"SECTION : ",{"$f":"IF('School Info'!$F$8=\"\",\"\",'School Info'!$F$8)","v":"A"},"S.No. : ",{"$f":"VLOOKUP(I135,Student_data,2,0)","v":333}]
["MOTHER :  ",{"$f":"VLOOKUP(I135,Student_data,8,0)","v":"GAG"},null,"School DISE Code :",null,{"$f":"IF('School Info'!$B$5=\"\",\"\",'School Info'!$B$5)","v":123456890}]
[]
["SUBJECT","DATE","DAY","TIME "]
[{"$f":"IF('School Info'!$J$5=\"\",\"\",'School Info'!$J$5)","v":"HINDI"},{"$f":"IF('School Info'!$K$5=\"\",\"\",'School Info'!$K$5)","v":"2001-01-01"},{"$f":"IF('School Info'!$L$5=\"\",\"\",'School Info'!$L$5)","v":"MONDAY"},{"$f":"IF('School Info'!$M$5=\"\",\"\",'School Info'!$M$5)","v":"10:00AM TO 12:00PM"}]
[{"$f":"IF('School Info'!$J$6=\"\",\"\",'School Info'!$J$6)","v":"ENGLISH"},{"$f":"IF('School Info'!$K$6=\"\",\"\",'School Info'!$K$6)","v":"2001-01-01"},{"$f":"IF('School Info'!$L$6=\"\",\"\",'School Info'!$L$6)","v":"TUESDAY"},{"$f":"IF('School Info'!$M$6=\"\",\"\",'School Info'!$M$6)","v":"10:00AM TO 12:00PM"}]
[{"$f":"IF('School Info'!$J$7=\"\",\"\",'School Info'!$J$7)","v":"SCIENCE"},{"$f":"IF('School Info'!$K$7=\"\",\"\",'School Info'!$K$7)","v":"2001-01-01"},{"$f":"IF('School Info'!$L$7=\"\",\"\",'School Info'!$L$7)","v":"WEDNESDAY"},{"$f":"IF('School Info'!$M$7=\"\",\"\",'School Info'!$M$7)","v":"10:00AM TO 12:00PM"}]
[{"$f":"IF('School Info'!$J$8=\"\",\"\",'School Info'!$J$8)","v":"MATH"},{"$f":"IF('School Info'!$K$8=\"\",\"\",'School Info'!$K$8)","v":"2001-01-01"},{"$f":"IF('School Info'!$L$8=\"\",\"\",'School Info'!$L$8)","v":"THURSDAY"},{"$f":"IF('School Info'!$M$8=\"\",\"\",'School Info'!$M$8)","v":"10:00AM TO 12:00PM"}]
[{"$f":"IF('School Info'!$J$9=\"\",\"\",'School Info'!$J$9)","v":"SOCIAL SCIENCE"},{"$f":"IF('School Info'!$K$9=\"\",\"\",'School Info'!$K$9)","v":"2001-01-01"},{"$f":"IF('School Info'!$L$9=\"\",\"\",'School Info'!$L$9)","v":"FRIDAY"},{"$f":"IF('School Info'!$M$9=\"\",\"\",'School Info'!$M$9)","v":"10:00AM TO 12:00PM"}]
[{"$f":"IF('School Info'!$J$10=\"\",\"\",'School Info'!$J$10)","v":"SANSKRIT"},{"$f":"IF('School Info'!$K$10=\"\",\"\",'School Info'!$K$10)","v":"2001-01-01"},{"$f":"IF('School Info'!$L$10=\"\",\"\",'School Info'!$L$10)","v":"SATURDAY"},{"$f":"IF('School Info'!$M$10=\"\",\"\",'School Info'!$M$10)","v":"10:00AM TO 12:00PM"}]
[{"$f":"IF('School Info'!$J$11=\"\",\"\",'School Info'!$J$11)","v":""},{"$f":"IF('School Info'!$K$11=\"\",\"\",'School Info'!$K$11)","v":"2001-01-02"},{"$f":"IF('School Info'!$L$11=\"\",\"\",'School Info'!$L$11)","v":"SUNDAY"},{"$f":"IF('School Info'!$M$11=\"\",\"\",'School Info'!$M$11)","v":"10:00AM TO 12:00PM"}]
[{"$f":"IF('School Info'!$J$12=\"\",\"\",'School Info'!$J$12)","v":""},{"$f":"IF('School Info'!$K$12=\"\",\"\",'School Info'!$K$12)","v":"2001-01-03"},{"$f":"IF('School Info'!$L$12=\"\",\"\",'School Info'!$L$12)","v":"MONDAY"},{"$f":"IF('School Info'!$M$12=\"\",\"\",'School Info'!$M$12)","v":"10:00AM TO 12:00PM"}]
[{"$f":"IF('School Info'!$J$13=\"\",\"\",'School Info'!$J$13)","v":""},{"$f":"IF('School Info'!$K$13=\"\",\"\",'School Info'!$K$13)","v":"2001-01-04"},{"$f":"IF('School Info'!$L$13=\"\",\"\",'School Info'!$L$13)","v":"TUESDAY"},{"$f":"IF('School Info'!$M$13=\"\",\"\",'School Info'!$M$13)","v":"10:00AM TO 12:00PM"}]
[{"$f":"IF('School Info'!$J$14=\"\",\"\",'School Info'!$J$14)","v":""},{"$f":"IF('School Info'!$K$14=\"\",\"\",'School Info'!$K$14)","v":""},{"$f":"IF('School Info'!$L$14=\"\",\"\",'School Info'!$L$14)","v":""},{"$f":"IF('School Info'!$M$14=\"\",\"\",'School Info'!$M$14)","v":""}]
[]
["Note :"]
["1. परीक्षार्थी अपना प्रवेश पत्र रोजाना साथ लेकर आये | (Candidates should bring their admit card with them daily.)"]
["2. परीक्षार्थी परीक्षा केंद्र पर आधा घंटे पहले पहुचें | (Candidates should reach the examination center half an hour before.)"]
["3. परीक्षार्थी परीक्षा हेतु आवश्यक सामग्री साथ लेकर आवें | (Candidates should bring with them the necessary materials for the examination.)"]
[]
[]
[]
[]
[]
["Sig. Exam Incharge",null,null,null,null,null,"Sig. Principal "]
[".------------------------------------------------------- Cut Here------------------------------------------------------"]
[{"$f":"IF('School Info'!$B$4=\"\",\"\",'School Info'!$B$4)","v":"Mahatma Gandhi Government School Bar"}]
[null,null,"School Aff. Code :",null,{"$f":"IF('School Info'!$F$5=\"\",\"\",'School Info'!$F$5)","v":123456}]
[null,null,{"$f":"IF('School Info'!$H$5=\"\",\"\",'School Info'!$H$5)","v":"HALF YEARLY EXAM"},null,{"$f":"IF('School Info'!$H$7=\"\",\"\",'School Info'!$H$7)","v":"2025-26"}]
[null,null,"ADMIT CARD",null,null,null,null,null,{"$f":"I135+1","v":6}]
[]
["ROLL NO :  ",{"$f":"VLOOKUP(I168,Student_data,3,0)","v":106},null,"CLASS : ",{"$f":"IF('School Info'!$B$7=\"\",\"\",'School Info'!$B$7)","v":6},"DOB :",{"$f":"VLOOKUP(I168,Student_data,4,0)","v":"2006-01-01"}]
["NAME :  ",{"$f":"VLOOKUP(I168,Student_data,6,0)","v":"RAJ GURUJI"},null,"MEDUIM : ",{"$f":"IF('School Info'!$E$7=\"\",\"\",'School Info'!$E$7)","v":"HINDI"},"GENDER :",{"$f":"VLOOKUP(I168,Student_data,5,0)","v":"FEMALE"}]
["FATHER :  ",{"$f":"VLOOKUP(I168,Student_data,7,0)","v":"RAJ"},null,"SECTION : ",{"$f":"IF('School Info'!$F$8=\"\",\"\",'School Info'!$F$8)","v":"A"},"S.No. : ",{"$f":"VLOOKUP(I168,Student_data,2,0)","v":444}]
["MOTHER :  ",{"$f":"VLOOKUP(I168,Student_data,8,0)","v":"DEVI"},null,"School DISE Code :",null,{"$f":"IF('School Info'!$B$5=\"\",\"\",'School Info'!$B$5)","v":123456890}]
[]
["SUBJECT","DATE","DAY","TIME "]
[{"$f":"IF('School Info'!$J$5=\"\",\"\",'School Info'!$J$5)","v":"HINDI"},{"$f":"IF('School Info'!$K$5=\"\",\"\",'School Info'!$K$5)","v":"2001-01-01"},{"$f":"IF('School Info'!$L$5=\"\",\"\",'School Info'!$L$5)","v":"MONDAY"},{"$f":"IF('School Info'!$M$5=\"\",\"\",'School Info'!$M$5)","v":"10:00AM TO 12:00PM"}]
[{"$f":"IF('School Info'!$J$6=\"\",\"\",'School Info'!$J$6)","v":"ENGLISH"},{"$f":"IF('School Info'!$K$6=\"\",\"\",'School Info'!$K$6)","v":"2001-01-01"},{"$f":"IF('School Info'!$L$6=\"\",\"\",'School Info'!$L$6)","v":"TUESDAY"},{"$f":"IF('School Info'!$M$6=\"\",\"\",'School Info'!$M$6)","v":"10:00AM TO 12:00PM"}]
[{"$f":"IF('School Info'!$J$7=\"\",\"\",'School Info'!$J$7)","v":"SCIENCE"},{"$f":"IF('School Info'!$K$7=\"\",\"\",'School Info'!$K$7)","v":"2001-01-01"},{"$f":"IF('School Info'!$L$7=\"\",\"\",'School Info'!$L$7)","v":"WEDNESDAY"},{"$f":"IF('School Info'!$M$7=\"\",\"\",'School Info'!$M$7)","v":"10:00AM TO 12:00PM"}]
[{"$f":"IF('School Info'!$J$8=\"\",\"\",'School Info'!$J$8)","v":"MATH"},{"$f":"IF('School Info'!$K$8=\"\",\"\",'School Info'!$K$8)","v":"2001-01-01"},{"$f":"IF('School Info'!$L$8=\"\",\"\",'School Info'!$L$8)","v":"THURSDAY"},{"$f":"IF('School Info'!$M$8=\"\",\"\",'School Info'!$M$8)","v":"10:00AM TO 12:00PM"}]
[{"$f":"IF('School Info'!$J$9=\"\",\"\",'School Info'!$J$9)","v":"SOCIAL SCIENCE"},{"$f":"IF('School Info'!$K$9=\"\",\"\",'School Info'!$K$9)","v":"2001-01-01"},{"$f":"IF('School Info'!$L$9=\"\",\"\",'School Info'!$L$9)","v":"FRIDAY"},{"$f":"IF('School Info'!$M$9=\"\",\"\",'School Info'!$M$9)","v":"10:00AM TO 12:00PM"}]
[{"$f":"IF('School Info'!$J$10=\"\",\"\",'School Info'!$J$10)","v":"SANSKRIT"},{"$f":"IF('School Info'!$K$10=\"\",\"\",'School Info'!$K$10)","v":"2001-01-01"},{"$f":"IF('School Info'!$L$10=\"\",\"\",'School Info'!$L$10)","v":"SATURDAY"},{"$f":"IF('School Info'!$M$10=\"\",\"\",'School Info'!$M$10)","v":"10:00AM TO 12:00PM"}]
[{"$f":"IF('School Info'!$J$11=\"\",\"\",'School Info'!$J$11)","v":""},{"$f":"IF('School Info'!$K$11=\"\",\"\",'School Info'!$K$11)","v":"2001-01-02"},{"$f":"IF('School Info'!$L$11=\"\",\"\",'School Info'!$L$11)","v":"SUNDAY"},{"$f":"IF('School Info'!$M$11=\"\",\"\",'School Info'!$M$11)","v":"10:00AM TO 12:00PM"}]
[{"$f":"IF('School Info'!$J$12=\"\",\"\",'School Info'!$J$12)","v":""},{"$f":"IF('School Info'!$K$12=\"\",\"\",'School Info'!$K$12)","v":"2001-01-03"},{"$f":"IF('School Info'!$L$12=\"\",\"\",'School Info'!$L$12)","v":"MONDAY"},{"$f":"IF('School Info'!$M$12=\"\",\"\",'School Info'!$M$12)","v":"10:00AM TO 12:00PM"}]
[{"$f":"IF('School Info'!$J$13=\"\",\"\",'School Info'!$J$13)","v":""},{"$f":"IF('School Info'!$K$13=\"\",\"\",'School Info'!$K$13)","v":"2001-01-04"},{"$f":"IF('School Info'!$L$13=\"\",\"\",'School Info'!$L$13)","v":"TUESDAY"},{"$f":"IF('School Info'!$M$13=\"\",\"\",'School Info'!$M$13)","v":"10:00AM TO 12:00PM"}]
[{"$f":"IF('School Info'!$J$14=\"\",\"\",'School Info'!$J$14)","v":""},{"$f":"IF('School Info'!$K$14=\"\",\"\",'School Info'!$K$14)","v":""},{"$f":"IF('School Info'!$L$14=\"\",\"\",'School Info'!$L$14)","v":""},{"$f":"IF('School Info'!$M$14=\"\",\"\",'School Info'!$M$14)","v":""}]
[]
["Note :"]
["1. परीक्षार्थी अपना प्रवेश पत्र रोजाना साथ लेकर आये | (Candidates should bring their admit card with them daily.)"]
["2. परीक्षार्थी परीक्षा केंद्र पर आधा घंटे पहले पहुचें | (Candidates should reach the examination center half an hour before.)"]
["3. परीक्षार्थी परीक्षा हेतु आवश्यक सामग्री साथ लेकर आवें | (Candidates should bring with them the necessary materials for the examination.)"]
[]
[]
[]
[]
[]
["Sig. Exam Incharge",null,null,null,null,null,"Sig. Principal "]
[]
[{"$f":"IF('School Info'!$B$4=\"\",\"\",'School Info'!$B$4)","v":"Mahatma Gandhi Government School Bar"}]
[null,null,"School Aff. Code :",null,{"$f":"IF('School Info'!$F$5=\"\",\"\",'School Info'!$F$5)","v":123456}]
[null,null,{"$f":"IF('School Info'!$H$5=\"\",\"\",'School Info'!$H$5)","v":"HALF YEARLY EXAM"},null,{"$f":"IF('School Info'!$H$7=\"\",\"\",'School Info'!$H$7)","v":"2025-26"}]
[null,null,"ADMIT CARD",null,null,null,null,null,{"$f":"I168+1","v":7}]
[]
["ROLL NO :  ",{"$f":"VLOOKUP(I201,Student_data,3,0)","v":107},null,"CLASS : ",{"$f":"IF('School Info'!$B$7=\"\",\"\",'School Info'!$B$7)","v":6},"DOB :",{"$f":"VLOOKUP(I201,Student_data,4,0)","v":"2007-01-01"}]
["NAME :  ",{"$f":"VLOOKUP(I201,Student_data,6,0)","v":"MONU"},null,"MEDUIM : ",{"$f":"IF('School Info'!$E$7=\"\",\"\",'School Info'!$E$7)","v":"HINDI"},"GENDER :",{"$f":"VLOOKUP(I201,Student_data,5,0)","v":"MALE"}]
["FATHER :  ",{"$f":"VLOOKUP(I201,Student_data,7,0)","v":"RAAA"},null,"SECTION : ",{"$f":"IF('School Info'!$F$8=\"\",\"\",'School Info'!$F$8)","v":"A"},"S.No. : ",{"$f":"VLOOKUP(I201,Student_data,2,0)","v":555}]
["MOTHER :  ",{"$f":"VLOOKUP(I201,Student_data,8,0)","v":"DDD"},null,"School DISE Code :",null,{"$f":"IF('School Info'!$B$5=\"\",\"\",'School Info'!$B$5)","v":123456890}]
[]
["SUBJECT","DATE","DAY","TIME "]
[{"$f":"IF('School Info'!$J$5=\"\",\"\",'School Info'!$J$5)","v":"HINDI"},{"$f":"IF('School Info'!$K$5=\"\",\"\",'School Info'!$K$5)","v":"2001-01-01"},{"$f":"IF('School Info'!$L$5=\"\",\"\",'School Info'!$L$5)","v":"MONDAY"},{"$f":"IF('School Info'!$M$5=\"\",\"\",'School Info'!$M$5)","v":"10:00AM TO 12:00PM"}]
[{"$f":"IF('School Info'!$J$6=\"\",\"\",'School Info'!$J$6)","v":"ENGLISH"},{"$f":"IF('School Info'!$K$6=\"\",\"\",'School Info'!$K$6)","v":"2001-01-01"},{"$f":"IF('School Info'!$L$6=\"\",\"\",'School Info'!$L$6)","v":"TUESDAY"},{"$f":"IF('School Info'!$M$6=\"\",\"\",'School Info'!$M$6)","v":"10:00AM TO 12:00PM"}]
[{"$f":"IF('School Info'!$J$7=\"\",\"\",'School Info'!$J$7)","v":"SCIENCE"},{"$f":"IF('School Info'!$K$7=\"\",\"\",'School Info'!$K$7)","v":"2001-01-01"},{"$f":"IF('School Info'!$L$7=\"\",\"\",'School Info'!$L$7)","v":"WEDNESDAY"},{"$f":"IF('School Info'!$M$7=\"\",\"\",'School Info'!$M$7)","v":"10:00AM TO 12:00PM"}]
[{"$f":"IF('School Info'!$J$8=\"\",\"\",'School Info'!$J$8)","v":"MATH"},{"$f":"IF('School Info'!$K$8=\"\",\"\",'School Info'!$K$8)","v":"2001-01-01"},{"$f":"IF('School Info'!$L$8=\"\",\"\",'School Info'!$L$8)","v":"THURSDAY"},{"$f":"IF('School Info'!$M$8=\"\",\"\",'School Info'!$M$8)","v":"10:00AM TO 12:00PM"}]
[{"$f":"IF('School Info'!$J$9=\"\",\"\",'School Info'!$J$9)","v":"SOCIAL SCIENCE"},{"$f":"IF('School Info'!$K$9=\"\",\"\",'School Info'!$K$9)","v":"2001-01-01"},{"$f":"IF('School Info'!$L$9=\"\",\"\",'School Info'!$L$9)","v":"FRIDAY"},{"$f":"IF('School Info'!$M$9=\"\",\"\",'School Info'!$M$9)","v":"10:00AM TO 12:00PM"}]
[{"$f":"IF('School Info'!$J$10=\"\",\"\",'School Info'!$J$10)","v":"SANSKRIT"},{"$f":"IF('School Info'!$K$10=\"\",\"\",'School Info'!$K$10)","v":"2001-01-01"},{"$f":"IF('School Info'!$L$10=\"\",\"\",'School Info'!$L$10)","v":"SATURDAY"},{"$f":"IF('School Info'!$M$10=\"\",\"\",'School Info'!$M$10)","v":"10:00AM TO 12:00PM"}]
[{"$f":"IF('School Info'!$J$11=\"\",\"\",'School Info'!$J$11)","v":""},{"$f":"IF('School Info'!$K$11=\"\",\"\",'School Info'!$K$11)","v":"2001-01-02"},{"$f":"IF('School Info'!$L$11=\"\",\"\",'School Info'!$L$11)","v":"SUNDAY"},{"$f":"IF('School Info'!$M$11=\"\",\"\",'School Info'!$M$11)","v":"10:00AM TO 12:00PM"}]
[{"$f":"IF('School Info'!$J$12=\"\",\"\",'School Info'!$J$12)","v":""},{"$f":"IF('School Info'!$K$12=\"\",\"\",'School Info'!$K$12)","v":"2001-01-03"},{"$f":"IF('School Info'!$L$12=\"\",\"\",'School Info'!$L$12)","v":"MONDAY"},{"$f":"IF('School Info'!$M$12=\"\",\"\",'School Info'!$M$12)","v":"10:00AM TO 12:00PM"}]
[{"$f":"IF('School Info'!$J$13=\"\",\"\",'School Info'!$J$13)","v":""},{"$f":"IF('School Info'!$K$13=\"\",\"\",'School Info'!$K$13)","v":"2001-01-04"},{"$f":"IF('School Info'!$L$13=\"\",\"\",'School Info'!$L$13)","v":"TUESDAY"},{"$f":"IF('School Info'!$M$13=\"\",\"\",'School Info'!$M$13)","v":"10:00AM TO 12:00PM"}]
[{"$f":"IF('School Info'!$J$14=\"\",\"\",'School Info'!$J$14)","v":""},{"$f":"IF('School Info'!$K$14=\"\",\"\",'School Info'!$K$14)","v":""},{"$f":"IF('School Info'!$L$14=\"\",\"\",'School Info'!$L$14)","v":""},{"$f":"IF('School Info'!$M$14=\"\",\"\",'School Info'!$M$14)","v":""}]
[]
["Note :"]
["1. परीक्षार्थी अपना प्रवेश पत्र रोजाना साथ लेकर आये | (Candidates should bring their admit card with them daily.)"]
["2. परीक्षार्थी परीक्षा केंद्र पर आधा घंटे पहले पहुचें | (Candidates should reach the examination center half an hour before.)"]
["3. परीक्षार्थी परीक्षा हेतु आवश्यक सामग्री साथ लेकर आवें | (Candidates should bring with them the necessary materials for the examination.)"]
[]
[]
[]
[]
[]
["Sig. Exam Incharge",null,null,null,null,null,"Sig. Principal "]
[".------------------------------------------------------- Cut Here------------------------------------------------------"]
[{"$f":"IF('School Info'!$B$4=\"\",\"\",'School Info'!$B$4)","v":"Mahatma Gandhi Government School Bar"}]
[null,null,"School Aff. Code :",null,{"$f":"IF('School Info'!$F$5=\"\",\"\",'School Info'!$F$5)","v":123456}]
[null,null,{"$f":"IF('School Info'!$H$5=\"\",\"\",'School Info'!$H$5)","v":"HALF YEARLY EXAM"},null,{"$f":"IF('School Info'!$H$7=\"\",\"\",'School Info'!$H$7)","v":"2025-26"}]
[null,null,"ADMIT CARD",null,null,null,null,null,{"$f":"I201+1","v":8}]
[]
["ROLL NO :  ",{"$f":"VLOOKUP(I234,Student_data,3,0)","v":108},null,"CLASS : ",{"$f":"IF('School Info'!$B$7=\"\",\"\",'School Info'!$B$7)","v":6},"DOB :",{"$f":"VLOOKUP(I234,Student_data,4,0)","v":"2008-01-01"}]
["NAME :  ",{"$f":"VLOOKUP(I234,Student_data,6,0)","v":"SONU"},null,"MEDUIM : ",{"$f":"IF('School Info'!$E$7=\"\",\"\",'School Info'!$E$7)","v":"HINDI"},"GENDER :",{"$f":"VLOOKUP(I234,Student_data,5,0)","v":"FEMALE"}]
["FATHER :  ",{"$f":"VLOOKUP(I234,Student_data,7,0)","v":"AAA"},null,"SECTION : ",{"$f":"IF('School Info'!$F$8=\"\",\"\",'School Info'!$F$8)","v":"A"},"S.No. : ",{"$f":"VLOOKUP(I234,Student_data,2,0)","v":666}]
["MOTHER :  ",{"$f":"VLOOKUP(I234,Student_data,8,0)","v":"DDS"},null,"School DISE Code :",null,{"$f":"IF('School Info'!$B$5=\"\",\"\",'School Info'!$B$5)","v":123456890}]
[]
["SUBJECT","DATE","DAY","TIME "]
[{"$f":"IF('School Info'!$J$5=\"\",\"\",'School Info'!$J$5)","v":"HINDI"},{"$f":"IF('School Info'!$K$5=\"\",\"\",'School Info'!$K$5)","v":"2001-01-01"},{"$f":"IF('School Info'!$L$5=\"\",\"\",'School Info'!$L$5)","v":"MONDAY"},{"$f":"IF('School Info'!$M$5=\"\",\"\",'School Info'!$M$5)","v":"10:00AM TO 12:00PM"}]
[{"$f":"IF('School Info'!$J$6=\"\",\"\",'School Info'!$J$6)","v":"ENGLISH"},{"$f":"IF('School Info'!$K$6=\"\",\"\",'School Info'!$K$6)","v":"2001-01-01"},{"$f":"IF('School Info'!$L$6=\"\",\"\",'School Info'!$L$6)","v":"TUESDAY"},{"$f":"IF('School Info'!$M$6=\"\",\"\",'School Info'!$M$6)","v":"10:00AM TO 12:00PM"}]
[{"$f":"IF('School Info'!$J$7=\"\",\"\",'School Info'!$J$7)","v":"SCIENCE"},{"$f":"IF('School Info'!$K$7=\"\",\"\",'School Info'!$K$7)","v":"2001-01-01"},{"$f":"IF('School Info'!$L$7=\"\",\"\",'School Info'!$L$7)","v":"WEDNESDAY"},{"$f":"IF('School Info'!$M$7=\"\",\"\",'School Info'!$M$7)","v":"10:00AM TO 12:00PM"}]
[{"$f":"IF('School Info'!$J$8=\"\",\"\",'School Info'!$J$8)","v":"MATH"},{"$f":"IF('School Info'!$K$8=\"\",\"\",'School Info'!$K$8)","v":"2001-01-01"},{"$f":"IF('School Info'!$L$8=\"\",\"\",'School Info'!$L$8)","v":"THURSDAY"},{"$f":"IF('School Info'!$M$8=\"\",\"\",'School Info'!$M$8)","v":"10:00AM TO 12:00PM"}]
[{"$f":"IF('School Info'!$J$9=\"\",\"\",'School Info'!$J$9)","v":"SOCIAL SCIENCE"},{"$f":"IF('School Info'!$K$9=\"\",\"\",'School Info'!$K$9)","v":"2001-01-01"},{"$f":"IF('School Info'!$L$9=\"\",\"\",'School Info'!$L$9)","v":"FRIDAY"},{"$f":"IF('School Info'!$M$9=\"\",\"\",'School Info'!$M$9)","v":"10:00AM TO 12:00PM"}]
[{"$f":"IF('School Info'!$J$10=\"\",\"\",'School Info'!$J$10)","v":"SANSKRIT"},{"$f":"IF('School Info'!$K$10=\"\",\"\",'School Info'!$K$10)","v":"2001-01-01"},{"$f":"IF('School Info'!$L$10=\"\",\"\",'School Info'!$L$10)","v":"SATURDAY"},{"$f":"IF('School Info'!$M$10=\"\",\"\",'School Info'!$M$10)","v":"10:00AM TO 12:00PM"}]
[{"$f":"IF('School Info'!$J$11=\"\",\"\",'School Info'!$J$11)","v":""},{"$f":"IF('School Info'!$K$11=\"\",\"\",'School Info'!$K$11)","v":"2001-01-02"},{"$f":"IF('School Info'!$L$11=\"\",\"\",'School Info'!$L$11)","v":"SUNDAY"},{"$f":"IF('School Info'!$M$11=\"\",\"\",'School Info'!$M$11)","v":"10:00AM TO 12:00PM"}]
[{"$f":"IF('School Info'!$J$12=\"\",\"\",'School Info'!$J$12)","v":""},{"$f":"IF('School Info'!$K$12=\"\",\"\",'School Info'!$K$12)","v":"2001-01-03"},{"$f":"IF('School Info'!$L$12=\"\",\"\",'School Info'!$L$12)","v":"MONDAY"},{"$f":"IF('School Info'!$M$12=\"\",\"\",'School Info'!$M$12)","v":"10:00AM TO 12:00PM"}]
[{"$f":"IF('School Info'!$J$13=\"\",\"\",'School Info'!$J$13)","v":""},{"$f":"IF('School Info'!$K$13=\"\",\"\",'School Info'!$K$13)","v":"2001-01-04"},{"$f":"IF('School Info'!$L$13=\"\",\"\",'School Info'!$L$13)","v":"TUESDAY"},{"$f":"IF('School Info'!$M$13=\"\",\"\",'School Info'!$M$13)","v":"10:00AM TO 12:00PM"}]
[{"$f":"IF('School Info'!$J$14=\"\",\"\",'School Info'!$J$14)","v":""},{"$f":"IF('School Info'!$K$14=\"\",\"\",'School Info'!$K$14)","v":""},{"$f":"IF('School Info'!$L$14=\"\",\"\",'School Info'!$L$14)","v":""},{"$f":"IF('School Info'!$M$14=\"\",\"\",'School Info'!$M$14)","v":""}]
[]
["Note :"]
["1. परीक्षार्थी अपना प्रवेश पत्र रोजाना साथ लेकर आये | (Candidates should bring their admit card with them daily.)"]
["2. परीक्षार्थी परीक्षा केंद्र पर आधा घंटे पहले पहुचें | (Candidates should reach the examination center half an hour before.)"]
["3. परीक्षार्थी परीक्षा हेतु आवश्यक सामग्री साथ लेकर आवें | (Candidates should bring with them the necessary materials for the examination.)"]
[]
[]
[]
[]
[]
["Sig. Exam Incharge",null,null,null,null,null,"Sig. Principal "]
[]
[{"$f":"IF('School Info'!$B$4=\"\",\"\",'School Info'!$B$4)","v":"Mahatma Gandhi Government School Bar"}]
[null,null,"School Aff. Code :",null,{"$f":"IF('School Info'!$F$5=\"\",\"\",'School Info'!$F$5)","v":123456}]
[null,null,{"$f":"IF('School Info'!$H$5=\"\",\"\",'School Info'!$H$5)","v":"HALF YEARLY EXAM"},null,{"$f":"IF('School Info'!$H$7=\"\",\"\",'School Info'!$H$7)","v":"2025-26"}]
[null,null,"ADMIT CARD",null,null,null,null,null,{"$f":"I234+1","v":9}]
[]
["ROLL NO :  ",{"$f":"VLOOKUP(I267,Student_data,3,0)","v":109},null,"CLASS : ",{"$f":"IF('School Info'!$B$7=\"\",\"\",'School Info'!$B$7)","v":6},"DOB :",{"$f":"VLOOKUP(I267,Student_data,4,0)","v":"2009-01-01"}]
["NAME :  ",{"$f":"VLOOKUP(I267,Student_data,6,0)","v":"KARNA"},null,"MEDUIM : ",{"$f":"IF('School Info'!$E$7=\"\",\"\",'School Info'!$E$7)","v":"HINDI"},"GENDER :",{"$f":"VLOOKUP(I267,Student_data,5,0)","v":"MALE"}]
["FATHER :  ",{"$f":"VLOOKUP(I267,Student_data,7,0)","v":"BBB"},null,"SECTION : ",{"$f":"IF('School Info'!$F$8=\"\",\"\",'School Info'!$F$8)","v":"A"},"S.No. : ",{"$f":"VLOOKUP(I267,Student_data,2,0)","v":777}]
["MOTHER :  ",{"$f":"VLOOKUP(I267,Student_data,8,0)","v":"SSDDF"},null,"School DISE Code :",null,{"$f":"IF('School Info'!$B$5=\"\",\"\",'School Info'!$B$5)","v":123456890}]
[]
["SUBJECT","DATE","DAY","TIME "]
[{"$f":"IF('School Info'!$J$5=\"\",\"\",'School Info'!$J$5)","v":"HINDI"},{"$f":"IF('School Info'!$K$5=\"\",\"\",'School Info'!$K$5)","v":"2001-01-01"},{"$f":"IF('School Info'!$L$5=\"\",\"\",'School Info'!$L$5)","v":"MONDAY"},{"$f":"IF('School Info'!$M$5=\"\",\"\",'School Info'!$M$5)","v":"10:00AM TO 12:00PM"}]
[{"$f":"IF('School Info'!$J$6=\"\",\"\",'School Info'!$J$6)","v":"ENGLISH"},{"$f":"IF('School Info'!$K$6=\"\",\"\",'School Info'!$K$6)","v":"2001-01-01"},{"$f":"IF('School Info'!$L$6=\"\",\"\",'School Info'!$L$6)","v":"TUESDAY"},{"$f":"IF('School Info'!$M$6=\"\",\"\",'School Info'!$M$6)","v":"10:00AM TO 12:00PM"}]
[{"$f":"IF('School Info'!$J$7=\"\",\"\",'School Info'!$J$7)","v":"SCIENCE"},{"$f":"IF('School Info'!$K$7=\"\",\"\",'School Info'!$K$7)","v":"2001-01-01"},{"$f":"IF('School Info'!$L$7=\"\",\"\",'School Info'!$L$7)","v":"WEDNESDAY"},{"$f":"IF('School Info'!$M$7=\"\",\"\",'School Info'!$M$7)","v":"10:00AM TO 12:00PM"}]
[{"$f":"IF('School Info'!$J$8=\"\",\"\",'School Info'!$J$8)","v":"MATH"},{"$f":"IF('School Info'!$K$8=\"\",\"\",'School Info'!$K$8)","v":"2001-01-01"},{"$f":"IF('School Info'!$L$8=\"\",\"\",'School Info'!$L$8)","v":"THURSDAY"},{"$f":"IF('School Info'!$M$8=\"\",\"\",'School Info'!$M$8)","v":"10:00AM TO 12:00PM"}]
[{"$f":"IF('School Info'!$J$9=\"\",\"\",'School Info'!$J$9)","v":"SOCIAL SCIENCE"},{"$f":"IF('School Info'!$K$9=\"\",\"\",'School Info'!$K$9)","v":"2001-01-01"},{"$f":"IF('School Info'!$L$9=\"\",\"\",'School Info'!$L$9)","v":"FRIDAY"},{"$f":"IF('School Info'!$M$9=\"\",\"\",'School Info'!$M$9)","v":"10:00AM TO 12:00PM"}]
[{"$f":"IF('School Info'!$J$10=\"\",\"\",'School Info'!$J$10)","v":"SANSKRIT"},{"$f":"IF('School Info'!$K$10=\"\",\"\",'School Info'!$K$10)","v":"2001-01-01"},{"$f":"IF('School Info'!$L$10=\"\",\"\",'School Info'!$L$10)","v":"SATURDAY"},{"$f":"IF('School Info'!$M$10=\"\",\"\",'School Info'!$M$10)","v":"10:00AM TO 12:00PM"}]
[{"$f":"IF('School Info'!$J$11=\"\",\"\",'School Info'!$J$11)","v":""},{"$f":"IF('School Info'!$K$11=\"\",\"\",'School Info'!$K$11)","v":"2001-01-02"},{"$f":"IF('School Info'!$L$11=\"\",\"\",'School Info'!$L$11)","v":"SUNDAY"},{"$f":"IF('School Info'!$M$11=\"\",\"\",'School Info'!$M$11)","v":"10:00AM TO 12:00PM"}]
[{"$f":"IF('School Info'!$J$12=\"\",\"\",'School Info'!$J$12)","v":""},{"$f":"IF('School Info'!$K$12=\"\",\"\",'School Info'!$K$12)","v":"2001-01-03"},{"$f":"IF('School Info'!$L$12=\"\",\"\",'School Info'!$L$12)","v":"MONDAY"},{"$f":"IF('School Info'!$M$12=\"\",\"\",'School Info'!$M$12)","v":"10:00AM TO 12:00PM"}]
[{"$f":"IF('School Info'!$J$13=\"\",\"\",'School Info'!$J$13)","v":""},{"$f":"IF('School Info'!$K$13=\"\",\"\",'School Info'!$K$13)","v":"2001-01-04"},{"$f":"IF('School Info'!$L$13=\"\",\"\",'School Info'!$L$13)","v":"TUESDAY"},{"$f":"IF('School Info'!$M$13=\"\",\"\",'School Info'!$M$13)","v":"10:00AM TO 12:00PM"}]
[{"$f":"IF('School Info'!$J$14=\"\",\"\",'School Info'!$J$14)","v":""},{"$f":"IF('School Info'!$K$14=\"\",\"\",'School Info'!$K$14)","v":""},{"$f":"IF('School Info'!$L$14=\"\",\"\",'School Info'!$L$14)","v":""},{"$f":"IF('School Info'!$M$14=\"\",\"\",'School Info'!$M$14)","v":""}]
[]
["Note :"]
["1. परीक्षार्थी अपना प्रवेश पत्र रोजाना साथ लेकर आये | (Candidates should bring their admit card with them daily.)"]
["2. परीक्षार्थी परीक्षा केंद्र पर आधा घंटे पहले पहुचें | (Candidates should reach the examination center half an hour before.)"]
["3. परीक्षार्थी परीक्षा हेतु आवश्यक सामग्री साथ लेकर आवें | (Candidates should bring with them the necessary materials for the examination.)"]
[]
[]
[]
[]
[]
["Sig. Exam Incharge",null,null,null,null,null,"Sig. Principal "]
[".------------------------------------------------------- Cut Here------------------------------------------------------"]
[{"$f":"IF('School Info'!$B$4=\"\",\"\",'School Info'!$B$4)","v":"Mahatma Gandhi Government School Bar"}]
[null,null,"School Aff. Code :",null,{"$f":"IF('School Info'!$F$5=\"\",\"\",'School Info'!$F$5)","v":123456}]
[null,null,{"$f":"IF('School Info'!$H$5=\"\",\"\",'School Info'!$H$5)","v":"HALF YEARLY EXAM"},null,{"$f":"IF('School Info'!$H$7=\"\",\"\",'School Info'!$H$7)","v":"2025-26"}]
[null,null,"ADMIT CARD",null,null,null,null,null,{"$f":"I267+1","v":10}]
[]
["ROLL NO :  ",{"$f":"VLOOKUP(I300,Student_data,3,0)","v":110},null,"CLASS : ",{"$f":"IF('School Info'!$B$7=\"\",\"\",'School Info'!$B$7)","v":6},"DOB :",{"$f":"VLOOKUP(I300,Student_data,4,0)","v":"2010-01-01"}]
["NAME :  ",{"$f":"VLOOKUP(I300,Student_data,6,0)","v":"RAJA  "},null,"MEDUIM : ",{"$f":"IF('School Info'!$E$7=\"\",\"\",'School Info'!$E$7)","v":"HINDI"},"GENDER :",{"$f":"VLOOKUP(I300,Student_data,5,0)","v":"MALE"}]
["FATHER :  ",{"$f":"VLOOKUP(I300,Student_data,7,0)","v":"DFD"},null,"SECTION : ",{"$f":"IF('School Info'!$F$8=\"\",\"\",'School Info'!$F$8)","v":"A"},"S.No. : ",{"$f":"VLOOKUP(I300,Student_data,2,0)","v":888}]
["MOTHER :  ",{"$f":"VLOOKUP(I300,Student_data,8,0)","v":"GAG"},null,"School DISE Code :",null,{"$f":"IF('School Info'!$B$5=\"\",\"\",'School Info'!$B$5)","v":123456890}]
[]
["SUBJECT","DATE","DAY","TIME "]
[{"$f":"IF('School Info'!$J$5=\"\",\"\",'School Info'!$J$5)","v":"HINDI"},{"$f":"IF('School Info'!$K$5=\"\",\"\",'School Info'!$K$5)","v":"2001-01-01"},{"$f":"IF('School Info'!$L$5=\"\",\"\",'School Info'!$L$5)","v":"MONDAY"},{"$f":"IF('School Info'!$M$5=\"\",\"\",'School Info'!$M$5)","v":"10:00AM TO 12:00PM"}]
[{"$f":"IF('School Info'!$J$6=\"\",\"\",'School Info'!$J$6)","v":"ENGLISH"},{"$f":"IF('School Info'!$K$6=\"\",\"\",'School Info'!$K$6)","v":"2001-01-01"},{"$f":"IF('School Info'!$L$6=\"\",\"\",'School Info'!$L$6)","v":"TUESDAY"},{"$f":"IF('School Info'!$M$6=\"\",\"\",'School Info'!$M$6)","v":"10:00AM TO 12:00PM"}]
[{"$f":"IF('School Info'!$J$7=\"\",\"\",'School Info'!$J$7)","v":"SCIENCE"},{"$f":"IF('School Info'!$K$7=\"\",\"\",'School Info'!$K$7)","v":"2001-01-01"},{"$f":"IF('School Info'!$L$7=\"\",\"\",'School Info'!$L$7)","v":"WEDNESDAY"},{"$f":"IF('School Info'!$M$7=\"\",\"\",'School Info'!$M$7)","v":"10:00AM TO 12:00PM"}]
[{"$f":"IF('School Info'!$J$8=\"\",\"\",'School Info'!$J$8)","v":"MATH"},{"$f":"IF('School Info'!$K$8=\"\",\"\",'School Info'!$K$8)","v":"2001-01-01"},{"$f":"IF('School Info'!$L$8=\"\",\"\",'School Info'!$L$8)","v":"THURSDAY"},{"$f":"IF('School Info'!$M$8=\"\",\"\",'School Info'!$M$8)","v":"10:00AM TO 12:00PM"}]
[{"$f":"IF('School Info'!$J$9=\"\",\"\",'School Info'!$J$9)","v":"SOCIAL SCIENCE"},{"$f":"IF('School Info'!$K$9=\"\",\"\",'School Info'!$K$9)","v":"2001-01-01"},{"$f":"IF('School Info'!$L$9=\"\",\"\",'School Info'!$L$9)","v":"FRIDAY"},{"$f":"IF('School Info'!$M$9=\"\",\"\",'School Info'!$M$9)","v":"10:00AM TO 12:00PM"}]
[{"$f":"IF('School Info'!$J$10=\"\",\"\",'School Info'!$J$10)","v":"SANSKRIT"},{"$f":"IF('School Info'!$K$10=\"\",\"\",'School Info'!$K$10)","v":"2001-01-01"},{"$f":"IF('School Info'!$L$10=\"\",\"\",'School Info'!$L$10)","v":"SATURDAY"},{"$f":"IF('School Info'!$M$10=\"\",\"\",'School Info'!$M$10)","v":"10:00AM TO 12:00PM"}]
[{"$f":"IF('School Info'!$J$11=\"\",\"\",'School Info'!$J$11)","v":""},{"$f":"IF('School Info'!$K$11=\"\",\"\",'School Info'!$K$11)","v":"2001-01-02"},{"$f":"IF('School Info'!$L$11=\"\",\"\",'School Info'!$L$11)","v":"SUNDAY"},{"$f":"IF('School Info'!$M$11=\"\",\"\",'School Info'!$M$11)","v":"10:00AM TO 12:00PM"}]
[{"$f":"IF('School Info'!$J$12=\"\",\"\",'School Info'!$J$12)","v":""},{"$f":"IF('School Info'!$K$12=\"\",\"\",'School Info'!$K$12)","v":"2001-01-03"},{"$f":"IF('School Info'!$L$12=\"\",\"\",'School Info'!$L$12)","v":"MONDAY"},{"$f":"IF('School Info'!$M$12=\"\",\"\",'School Info'!$M$12)","v":"10:00AM TO 12:00PM"}]
[{"$f":"IF('School Info'!$J$13=\"\",\"\",'School Info'!$J$13)","v":""},{"$f":"IF('School Info'!$K$13=\"\",\"\",'School Info'!$K$13)","v":"2001-01-04"},{"$f":"IF('School Info'!$L$13=\"\",\"\",'School Info'!$L$13)","v":"TUESDAY"},{"$f":"IF('School Info'!$M$13=\"\",\"\",'School Info'!$M$13)","v":"10:00AM TO 12:00PM"}]
[{"$f":"IF('School Info'!$J$14=\"\",\"\",'School Info'!$J$14)","v":""},{"$f":"IF('School Info'!$K$14=\"\",\"\",'School Info'!$K$14)","v":""},{"$f":"IF('School Info'!$L$14=\"\",\"\",'School Info'!$L$14)","v":""},{"$f":"IF('School Info'!$M$14=\"\",\"\",'School Info'!$M$14)","v":""}]
[]
["Note :"]
["1. परीक्षार्थी अपना प्रवेश पत्र रोजाना साथ लेकर आये | (Candidates should bring their admit card with them daily.)"]
["2. परीक्षार्थी परीक्षा केंद्र पर आधा घंटे पहले पहुचें | (Candidates should reach the examination center half an hour before.)"]
["3. परीक्षार्थी परीक्षा हेतु आवश्यक सामग्री साथ लेकर आवें | (Candidates should bring with them the necessary materials for the examination.)"]
[]
[]
[]
[]
[]
["Sig. Exam Incharge",null,null,null,null,null,"Sig. Principal "]
[]
[{"$f":"IF('School Info'!$B$4=\"\",\"\",'School Info'!$B$4)","v":"Mahatma Gandhi Government School Bar"}]
[null,null,"School Aff. Code :",null,{"$f":"IF('School Info'!$F$5=\"\",\"\",'School Info'!$F$5)","v":123456}]
[null,null,{"$f":"IF('School Info'!$H$5=\"\",\"\",'School Info'!$H$5)","v":"HALF YEARLY EXAM"},null,{"$f":"IF('School Info'!$H$7=\"\",\"\",'School Info'!$H$7)","v":"2025-26"}]
[null,null,"ADMIT CARD",null,null,null,null,null,{"$f":"I300+1","v":11}]
[]
["ROLL NO :  ",{"$f":"VLOOKUP(I333,Student_data,3,0)","v":111},null,"CLASS : ",{"$f":"IF('School Info'!$B$7=\"\",\"\",'School Info'!$B$7)","v":6},"DOB :",{"$f":"VLOOKUP(I333,Student_data,4,0)","v":"2011-01-01"}]
["NAME :  ",{"$f":"VLOOKUP(I333,Student_data,6,0)","v":"RAJ GURUJI"},null,"MEDUIM : ",{"$f":"IF('School Info'!$E$7=\"\",\"\",'School Info'!$E$7)","v":"HINDI"},"GENDER :",{"$f":"VLOOKUP(I333,Student_data,5,0)","v":"MALE"}]
["FATHER :  ",{"$f":"VLOOKUP(I333,Student_data,7,0)","v":"RAJ"},null,"SECTION : ",{"$f":"IF('School Info'!$F$8=\"\",\"\",'School Info'!$F$8)","v":"A"},"S.No. : ",{"$f":"VLOOKUP(I333,Student_data,2,0)","v":111}]
["MOTHER :  ",{"$f":"VLOOKUP(I333,Student_data,8,0)","v":"DEVI"},null,"School DISE Code :",null,{"$f":"IF('School Info'!$B$5=\"\",\"\",'School Info'!$B$5)","v":123456890}]
[]
["SUBJECT","DATE","DAY","TIME "]
[{"$f":"IF('School Info'!$J$5=\"\",\"\",'School Info'!$J$5)","v":"HINDI"},{"$f":"IF('School Info'!$K$5=\"\",\"\",'School Info'!$K$5)","v":"2001-01-01"},{"$f":"IF('School Info'!$L$5=\"\",\"\",'School Info'!$L$5)","v":"MONDAY"},{"$f":"IF('School Info'!$M$5=\"\",\"\",'School Info'!$M$5)","v":"10:00AM TO 12:00PM"}]
[{"$f":"IF('School Info'!$J$6=\"\",\"\",'School Info'!$J$6)","v":"ENGLISH"},{"$f":"IF('School Info'!$K$6=\"\",\"\",'School Info'!$K$6)","v":"2001-01-01"},{"$f":"IF('School Info'!$L$6=\"\",\"\",'School Info'!$L$6)","v":"TUESDAY"},{"$f":"IF('School Info'!$M$6=\"\",\"\",'School Info'!$M$6)","v":"10:00AM TO 12:00PM"}]
[{"$f":"IF('School Info'!$J$7=\"\",\"\",'School Info'!$J$7)","v":"SCIENCE"},{"$f":"IF('School Info'!$K$7=\"\",\"\",'School Info'!$K$7)","v":"2001-01-01"},{"$f":"IF('School Info'!$L$7=\"\",\"\",'School Info'!$L$7)","v":"WEDNESDAY"},{"$f":"IF('School Info'!$M$7=\"\",\"\",'School Info'!$M$7)","v":"10:00AM TO 12:00PM"}]
[{"$f":"IF('School Info'!$J$8=\"\",\"\",'School Info'!$J$8)","v":"MATH"},{"$f":"IF('School Info'!$K$8=\"\",\"\",'School Info'!$K$8)","v":"2001-01-01"},{"$f":"IF('School Info'!$L$8=\"\",\"\",'School Info'!$L$8)","v":"THURSDAY"},{"$f":"IF('School Info'!$M$8=\"\",\"\",'School Info'!$M$8)","v":"10:00AM TO 12:00PM"}]
[{"$f":"IF('School Info'!$J$9=\"\",\"\",'School Info'!$J$9)","v":"SOCIAL SCIENCE"},{"$f":"IF('School Info'!$K$9=\"\",\"\",'School Info'!$K$9)","v":"2001-01-01"},{"$f":"IF('School Info'!$L$9=\"\",\"\",'School Info'!$L$9)","v":"FRIDAY"},{"$f":"IF('School Info'!$M$9=\"\",\"\",'School Info'!$M$9)","v":"10:00AM TO 12:00PM"}]
[{"$f":"IF('School Info'!$J$10=\"\",\"\",'School Info'!$J$10)","v":"SANSKRIT"},{"$f":"IF('School Info'!$K$10=\"\",\"\",'School Info'!$K$10)","v":"2001-01-01"},{"$f":"IF('School Info'!$L$10=\"\",\"\",'School Info'!$L$10)","v":"SATURDAY"},{"$f":"IF('School Info'!$M$10=\"\",\"\",'School Info'!$M$10)","v":"10:00AM TO 12:00PM"}]
[{"$f":"IF('School Info'!$J$11=\"\",\"\",'School Info'!$J$11)","v":""},{"$f":"IF('School Info'!$K$11=\"\",\"\",'School Info'!$K$11)","v":"2001-01-02"},{"$f":"IF('School Info'!$L$11=\"\",\"\",'School Info'!$L$11)","v":"SUNDAY"},{"$f":"IF('School Info'!$M$11=\"\",\"\",'School Info'!$M$11)","v":"10:00AM TO 12:00PM"}]
[{"$f":"IF('School Info'!$J$12=\"\",\"\",'School Info'!$J$12)","v":""},{"$f":"IF('School Info'!$K$12=\"\",\"\",'School Info'!$K$12)","v":"2001-01-03"},{"$f":"IF('School Info'!$L$12=\"\",\"\",'School Info'!$L$12)","v":"MONDAY"},{"$f":"IF('School Info'!$M$12=\"\",\"\",'School Info'!$M$12)","v":"10:00AM TO 12:00PM"}]
[{"$f":"IF('School Info'!$J$13=\"\",\"\",'School Info'!$J$13)","v":""},{"$f":"IF('School Info'!$K$13=\"\",\"\",'School Info'!$K$13)","v":"2001-01-04"},{"$f":"IF('School Info'!$L$13=\"\",\"\",'School Info'!$L$13)","v":"TUESDAY"},{"$f":"IF('School Info'!$M$13=\"\",\"\",'School Info'!$M$13)","v":"10:00AM TO 12:00PM"}]
[{"$f":"IF('School Info'!$J$14=\"\",\"\",'School Info'!$J$14)","v":""},{"$f":"IF('School Info'!$K$14=\"\",\"\",'School Info'!$K$14)","v":""},{"$f":"IF('School Info'!$L$14=\"\",\"\",'School Info'!$L$14)","v":""},{"$f":"IF('School Info'!$M$14=\"\",\"\",'School Info'!$M$14)","v":""}]
[]
["Note :"]
["1. परीक्षार्थी अपना प्रवेश पत्र रोजाना साथ लेकर आये | (Candidates should bring their admit card with them daily.)"]
["2. परीक्षार्थी परीक्षा केंद्र पर आधा घंटे पहले पहुचें | (Candidates should reach the examination center half an hour before.)"]
["3. परीक्षार्थी परीक्षा हेतु आवश्यक सामग्री साथ लेकर आवें | (Candidates should bring with them the necessary materials for the examination.)"]
[]
[]
[]
[]
[]
["Sig. Exam Incharge",null,null,null,null,null,"Sig. Principal "]
[".------------------------------------------------------- Cut Here------------------------------------------------------"]
[{"$f":"IF('School Info'!$B$4=\"\",\"\",'School Info'!$B$4)","v":"Mahatma Gandhi Government School Bar"}]
[null,null,"School Aff. Code :",null,{"$f":"IF('School Info'!$F$5=\"\",\"\",'School Info'!$F$5)","v":123456}]
[null,null,{"$f":"IF('School Info'!$H$5=\"\",\"\",'School Info'!$H$5)","v":"HALF YEARLY EXAM"},null,{"$f":"IF('School Info'!$H$7=\"\",\"\",'School Info'!$H$7)","v":"2025-26"}]
[null,null,"ADMIT CARD",null,null,null,null,null,{"$f":"I333+1","v":12}]
[]
["ROLL NO :  ",{"$f":"VLOOKUP(I366,Student_data,3,0)","v":112},null,"CLASS : ",{"$f":"IF('School Info'!$B$7=\"\",\"\",'School Info'!$B$7)","v":6},"DOB :",{"$f":"VLOOKUP(I366,Student_data,4,0)","v":"2012-01-01"}]
["NAME :  ",{"$f":"VLOOKUP(I366,Student_data,6,0)","v":"MONU"},null,"MEDUIM : ",{"$f":"IF('School Info'!$E$7=\"\",\"\",'School Info'!$E$7)","v":"HINDI"},"GENDER :",{"$f":"VLOOKUP(I366,Student_data,5,0)","v":"MALE"}]
["FATHER :  ",{"$f":"VLOOKUP(I366,Student_data,7,0)","v":"RAAA"},null,"SECTION : ",{"$f":"IF('School Info'!$F$8=\"\",\"\",'School Info'!$F$8)","v":"A"},"S.No. : ",{"$f":"VLOOKUP(I366,Student_data,2,0)","v":123}]
["MOTHER :  ",{"$f":"VLOOKUP(I366,Student_data,8,0)","v":"DDD"},null,"School DISE Code :",null,{"$f":"IF('School Info'!$B$5=\"\",\"\",'School Info'!$B$5)","v":123456890}]
[]
["SUBJECT","DATE","DAY","TIME "]
[{"$f":"IF('School Info'!$J$5=\"\",\"\",'School Info'!$J$5)","v":"HINDI"},{"$f":"IF('School Info'!$K$5=\"\",\"\",'School Info'!$K$5)","v":"2001-01-01"},{"$f":"IF('School Info'!$L$5=\"\",\"\",'School Info'!$L$5)","v":"MONDAY"},{"$f":"IF('School Info'!$M$5=\"\",\"\",'School Info'!$M$5)","v":"10:00AM TO 12:00PM"}]
[{"$f":"IF('School Info'!$J$6=\"\",\"\",'School Info'!$J$6)","v":"ENGLISH"},{"$f":"IF('School Info'!$K$6=\"\",\"\",'School Info'!$K$6)","v":"2001-01-01"},{"$f":"IF('School Info'!$L$6=\"\",\"\",'School Info'!$L$6)","v":"TUESDAY"},{"$f":"IF('School Info'!$M$6=\"\",\"\",'School Info'!$M$6)","v":"10:00AM TO 12:00PM"}]
[{"$f":"IF('School Info'!$J$7=\"\",\"\",'School Info'!$J$7)","v":"SCIENCE"},{"$f":"IF('School Info'!$K$7=\"\",\"\",'School Info'!$K$7)","v":"2001-01-01"},{"$f":"IF('School Info'!$L$7=\"\",\"\",'School Info'!$L$7)","v":"WEDNESDAY"},{"$f":"IF('School Info'!$M$7=\"\",\"\",'School Info'!$M$7)","v":"10:00AM TO 12:00PM"}]
[{"$f":"IF('School Info'!$J$8=\"\",\"\",'School Info'!$J$8)","v":"MATH"},{"$f":"IF('School Info'!$K$8=\"\",\"\",'School Info'!$K$8)","v":"2001-01-01"},{"$f":"IF('School Info'!$L$8=\"\",\"\",'School Info'!$L$8)","v":"THURSDAY"},{"$f":"IF('School Info'!$M$8=\"\",\"\",'School Info'!$M$8)","v":"10:00AM TO 12:00PM"}]
[{"$f":"IF('School Info'!$J$9=\"\",\"\",'School Info'!$J$9)","v":"SOCIAL SCIENCE"},{"$f":"IF('School Info'!$K$9=\"\",\"\",'School Info'!$K$9)","v":"2001-01-01"},{"$f":"IF('School Info'!$L$9=\"\",\"\",'School Info'!$L$9)","v":"FRIDAY"},{"$f":"IF('School Info'!$M$9=\"\",\"\",'School Info'!$M$9)","v":"10:00AM TO 12:00PM"}]
[{"$f":"IF('School Info'!$J$10=\"\",\"\",'School Info'!$J$10)","v":"SANSKRIT"},{"$f":"IF('School Info'!$K$10=\"\",\"\",'School Info'!$K$10)","v":"2001-01-01"},{"$f":"IF('School Info'!$L$10=\"\",\"\",'School Info'!$L$10)","v":"SATURDAY"},{"$f":"IF('School Info'!$M$10=\"\",\"\",'School Info'!$M$10)","v":"10:00AM TO 12:00PM"}]
[{"$f":"IF('School Info'!$J$11=\"\",\"\",'School Info'!$J$11)","v":""},{"$f":"IF('School Info'!$K$11=\"\",\"\",'School Info'!$K$11)","v":"2001-01-02"},{"$f":"IF('School Info'!$L$11=\"\",\"\",'School Info'!$L$11)","v":"SUNDAY"},{"$f":"IF('School Info'!$M$11=\"\",\"\",'School Info'!$M$11)","v":"10:00AM TO 12:00PM"}]
[{"$f":"IF('School Info'!$J$12=\"\",\"\",'School Info'!$J$12)","v":""},{"$f":"IF('School Info'!$K$12=\"\",\"\",'School Info'!$K$12)","v":"2001-01-03"},{"$f":"IF('School Info'!$L$12=\"\",\"\",'School Info'!$L$12)","v":"MONDAY"},{"$f":"IF('School Info'!$M$12=\"\",\"\",'School Info'!$M$12)","v":"10:00AM TO 12:00PM"}]
[{"$f":"IF('School Info'!$J$13=\"\",\"\",'School Info'!$J$13)","v":""},{"$f":"IF('School Info'!$K$13=\"\",\"\",'School Info'!$K$13)","v":"2001-01-04"},{"$f":"IF('School Info'!$L$13=\"\",\"\",'School Info'!$L$13)","v":"TUESDAY"},{"$f":"IF('School Info'!$M$13=\"\",\"\",'School Info'!$M$13)","v":"10:00AM TO 12:00PM"}]
[{"$f":"IF('School Info'!$J$14=\"\",\"\",'School Info'!$J$14)","v":""},{"$f":"IF('School Info'!$K$14=\"\",\"\",'School Info'!$K$14)","v":""},{"$f":"IF('School Info'!$L$14=\"\",\"\",'School Info'!$L$14)","v":""},{"$f":"IF('School Info'!$M$14=\"\",\"\",'School Info'!$M$14)","v":""}]
[]
["Note :"]
["1. परीक्षार्थी अपना प्रवेश पत्र रोजाना साथ लेकर आये | (Candidates should bring their admit card with them daily.)"]
["2. परीक्षार्थी परीक्षा केंद्र पर आधा घंटे पहले पहुचें | (Candidates should reach the examination center half an hour before.)"]
["3. परीक्षार्थी परीक्षा हेतु आवश्यक सामग्री साथ लेकर आवें | (Candidates should bring with them the necessary materials for the examination.)"]
[]
[]
[]
[]
[]
["Sig. Exam Incharge",null,null,null,null,null,"Sig. Principal "]
[]
[{"$f":"IF('School Info'!$B$4=\"\",\"\",'School Info'!$B$4)","v":"Mahatma Gandhi Government School Bar"}]
[null,null,"School Aff. Code :",null,{"$f":"IF('School Info'!$F$5=\"\",\"\",'School Info'!$F$5)","v":123456}]
[null,null,{"$f":"IF('School Info'!$H$5=\"\",\"\",'School Info'!$H$5)","v":"HALF YEARLY EXAM"},null,{"$f":"IF('School Info'!$H$7=\"\",\"\",'School Info'!$H$7)","v":"2025-26"}]
[null,null,"ADMIT CARD",null,null,null,null,null,{"$f":"I366+1","v":13}]
[]
["ROLL NO :  ",{"$f":"VLOOKUP(I399,Student_data,3,0)","v":113},null,"CLASS : ",{"$f":"IF('School Info'!$B$7=\"\",\"\",'School Info'!$B$7)","v":6},"DOB :",{"$f":"VLOOKUP(I399,Student_data,4,0)","v":"2013-01-01"}]
["NAME :  ",{"$f":"VLOOKUP(I399,Student_data,6,0)","v":"SONU"},null,"MEDUIM : ",{"$f":"IF('School Info'!$E$7=\"\",\"\",'School Info'!$E$7)","v":"HINDI"},"GENDER :",{"$f":"VLOOKUP(I399,Student_data,5,0)","v":"MALE"}]
["FATHER :  ",{"$f":"VLOOKUP(I399,Student_data,7,0)","v":"AAA"},null,"SECTION : ",{"$f":"IF('School Info'!$F$8=\"\",\"\",'School Info'!$F$8)","v":"A"},"S.No. : ",{"$f":"VLOOKUP(I399,Student_data,2,0)","v":"A"}]
["MOTHER :  ",{"$f":"VLOOKUP(I399,Student_data,8,0)","v":"DDS"},null,"School DISE Code :",null,{"$f":"IF('School Info'!$B$5=\"\",\"\",'School Info'!$B$5)","v":123456890}]
[]
["SUBJECT","DATE","DAY","TIME "]
[{"$f":"IF('School Info'!$J$5=\"\",\"\",'School Info'!$J$5)","v":"HINDI"},{"$f":"IF('School Info'!$K$5=\"\",\"\",'School Info'!$K$5)","v":"2001-01-01"},{"$f":"IF('School Info'!$L$5=\"\",\"\",'School Info'!$L$5)","v":"MONDAY"},{"$f":"IF('School Info'!$M$5=\"\",\"\",'School Info'!$M$5)","v":"10:00AM TO 12:00PM"}]
[{"$f":"IF('School Info'!$J$6=\"\",\"\",'School Info'!$J$6)","v":"ENGLISH"},{"$f":"IF('School Info'!$K$6=\"\",\"\",'School Info'!$K$6)","v":"2001-01-01"},{"$f":"IF('School Info'!$L$6=\"\",\"\",'School Info'!$L$6)","v":"TUESDAY"},{"$f":"IF('School Info'!$M$6=\"\",\"\",'School Info'!$M$6)","v":"10:00AM TO 12:00PM"}]
[{"$f":"IF('School Info'!$J$7=\"\",\"\",'School Info'!$J$7)","v":"SCIENCE"},{"$f":"IF('School Info'!$K$7=\"\",\"\",'School Info'!$K$7)","v":"2001-01-01"},{"$f":"IF('School Info'!$L$7=\"\",\"\",'School Info'!$L$7)","v":"WEDNESDAY"},{"$f":"IF('School Info'!$M$7=\"\",\"\",'School Info'!$M$7)","v":"10:00AM TO 12:00PM"}]
[{"$f":"IF('School Info'!$J$8=\"\",\"\",'School Info'!$J$8)","v":"MATH"},{"$f":"IF('School Info'!$K$8=\"\",\"\",'School Info'!$K$8)","v":"2001-01-01"},{"$f":"IF('School Info'!$L$8=\"\",\"\",'School Info'!$L$8)","v":"THURSDAY"},{"$f":"IF('School Info'!$M$8=\"\",\"\",'School Info'!$M$8)","v":"10:00AM TO 12:00PM"}]
[{"$f":"IF('School Info'!$J$9=\"\",\"\",'School Info'!$J$9)","v":"SOCIAL SCIENCE"},{"$f":"IF('School Info'!$K$9=\"\",\"\",'School Info'!$K$9)","v":"2001-01-01"},{"$f":"IF('School Info'!$L$9=\"\",\"\",'School Info'!$L$9)","v":"FRIDAY"},{"$f":"IF('School Info'!$M$9=\"\",\"\",'School Info'!$M$9)","v":"10:00AM TO 12:00PM"}]
[{"$f":"IF('School Info'!$J$10=\"\",\"\",'School Info'!$J$10)","v":"SANSKRIT"},{"$f":"IF('School Info'!$K$10=\"\",\"\",'School Info'!$K$10)","v":"2001-01-01"},{"$f":"IF('School Info'!$L$10=\"\",\"\",'School Info'!$L$10)","v":"SATURDAY"},{"$f":"IF('School Info'!$M$10=\"\",\"\",'School Info'!$M$10)","v":"10:00AM TO 12:00PM"}]
[{"$f":"IF('School Info'!$J$11=\"\",\"\",'School Info'!$J$11)","v":""},{"$f":"IF('School Info'!$K$11=\"\",\"\",'School Info'!$K$11)","v":"2001-01-02"},{"$f":"IF('School Info'!$L$11=\"\",\"\",'School Info'!$L$11)","v":"SUNDAY"},{"$f":"IF('School Info'!$M$11=\"\",\"\",'School Info'!$M$11)","v":"10:00AM TO 12:00PM"}]
[{"$f":"IF('School Info'!$J$12=\"\",\"\",'School Info'!$J$12)","v":""},{"$f":"IF('School Info'!$K$12=\"\",\"\",'School Info'!$K$12)","v":"2001-01-03"},{"$f":"IF('School Info'!$L$12=\"\",\"\",'School Info'!$L$12)","v":"MONDAY"},{"$f":"IF('School Info'!$M$12=\"\",\"\",'School Info'!$M$12)","v":"10:00AM TO 12:00PM"}]
[{"$f":"IF('School Info'!$J$13=\"\",\"\",'School Info'!$J$13)","v":""},{"$f":"IF('School Info'!$K$13=\"\",\"\",'School Info'!$K$13)","v":"2001-01-04"},{"$f":"IF('School Info'!$L$13=\"\",\"\",'School Info'!$L$13)","v":"TUESDAY"},{"$f":"IF('School Info'!$M$13=\"\",\"\",'School Info'!$M$13)","v":"10:00AM TO 12:00PM"}]
[{"$f":"IF('School Info'!$J$14=\"\",\"\",'School Info'!$J$14)","v":""},{"$f":"IF('School Info'!$K$14=\"\",\"\",'School Info'!$K$14)","v":""},{"$f":"IF('School Info'!$L$14=\"\",\"\",'School Info'!$L$14)","v":""},{"$f":"IF('School Info'!$M$14=\"\",\"\",'School Info'!$M$14)","v":""}]
[]
["Note :"]
["1. परीक्षार्थी अपना प्रवेश पत्र रोजाना साथ लेकर आये | (Candidates should bring their admit card with them daily.)"]
["2. परीक्षार्थी परीक्षा केंद्र पर आधा घंटे पहले पहुचें | (Candidates should reach the examination center half an hour before.)"]
["3. परीक्षार्थी परीक्षा हेतु आवश्यक सामग्री साथ लेकर आवें | (Candidates should bring with them the necessary materials for the examination.)"]
[]
[]
[]
[]
[]
["Sig. Exam Incharge",null,null,null,null,null,"Sig. Principal "]
[".------------------------------------------------------- Cut Here------------------------------------------------------"]
[{"$f":"IF('School Info'!$B$4=\"\",\"\",'School Info'!$B$4)","v":"Mahatma Gandhi Government School Bar"}]
[null,null,"School Aff. Code :",null,{"$f":"IF('School Info'!$F$5=\"\",\"\",'School Info'!$F$5)","v":123456}]
[null,null,{"$f":"IF('School Info'!$H$5=\"\",\"\",'School Info'!$H$5)","v":"HALF YEARLY EXAM"},null,{"$f":"IF('School Info'!$H$7=\"\",\"\",'School Info'!$H$7)","v":"2025-26"}]
[null,null,"ADMIT CARD",null,null,null,null,null,{"$f":"I399+1","v":14}]
[]
["ROLL NO :  ",{"$f":"VLOOKUP(I432,Student_data,3,0)","v":114},null,"CLASS : ",{"$f":"IF('School Info'!$B$7=\"\",\"\",'School Info'!$B$7)","v":6},"DOB :",{"$f":"VLOOKUP(I432,Student_data,4,0)","v":"2014-01-01"}]
["NAME :  ",{"$f":"VLOOKUP(I432,Student_data,6,0)","v":"KARNA"},null,"MEDUIM : ",{"$f":"IF('School Info'!$E$7=\"\",\"\",'School Info'!$E$7)","v":"HINDI"},"GENDER :",{"$f":"VLOOKUP(I432,Student_data,5,0)","v":"MALE"}]
["FATHER :  ",{"$f":"VLOOKUP(I432,Student_data,7,0)","v":"BBB"},null,"SECTION : ",{"$f":"IF('School Info'!$F$8=\"\",\"\",'School Info'!$F$8)","v":"A"},"S.No. : ",{"$f":"VLOOKUP(I432,Student_data,2,0)","v":"B"}]
["MOTHER :  ",{"$f":"VLOOKUP(I432,Student_data,8,0)","v":"SSDDF"},null,"School DISE Code :",null,{"$f":"IF('School Info'!$B$5=\"\",\"\",'School Info'!$B$5)","v":123456890}]
[]
["SUBJECT","DATE","DAY","TIME "]
[{"$f":"IF('School Info'!$J$5=\"\",\"\",'School Info'!$J$5)","v":"HINDI"},{"$f":"IF('School Info'!$K$5=\"\",\"\",'School Info'!$K$5)","v":"2001-01-01"},{"$f":"IF('School Info'!$L$5=\"\",\"\",'School Info'!$L$5)","v":"MONDAY"},{"$f":"IF('School Info'!$M$5=\"\",\"\",'School Info'!$M$5)","v":"10:00AM TO 12:00PM"}]
[{"$f":"IF('School Info'!$J$6=\"\",\"\",'School Info'!$J$6)","v":"ENGLISH"},{"$f":"IF('School Info'!$K$6=\"\",\"\",'School Info'!$K$6)","v":"2001-01-01"},{"$f":"IF('School Info'!$L$6=\"\",\"\",'School Info'!$L$6)","v":"TUESDAY"},{"$f":"IF('School Info'!$M$6=\"\",\"\",'School Info'!$M$6)","v":"10:00AM TO 12:00PM"}]
[{"$f":"IF('School Info'!$J$7=\"\",\"\",'School Info'!$J$7)","v":"SCIENCE"},{"$f":"IF('School Info'!$K$7=\"\",\"\",'School Info'!$K$7)","v":"2001-01-01"},{"$f":"IF('School Info'!$L$7=\"\",\"\",'School Info'!$L$7)","v":"WEDNESDAY"},{"$f":"IF('School Info'!$M$7=\"\",\"\",'School Info'!$M$7)","v":"10:00AM TO 12:00PM"}]
[{"$f":"IF('School Info'!$J$8=\"\",\"\",'School Info'!$J$8)","v":"MATH"},{"$f":"IF('School Info'!$K$8=\"\",\"\",'School Info'!$K$8)","v":"2001-01-01"},{"$f":"IF('School Info'!$L$8=\"\",\"\",'School Info'!$L$8)","v":"THURSDAY"},{"$f":"IF('School Info'!$M$8=\"\",\"\",'School Info'!$M$8)","v":"10:00AM TO 12:00PM"}]
[{"$f":"IF('School Info'!$J$9=\"\",\"\",'School Info'!$J$9)","v":"SOCIAL SCIENCE"},{"$f":"IF('School Info'!$K$9=\"\",\"\",'School Info'!$K$9)","v":"2001-01-01"},{"$f":"IF('School Info'!$L$9=\"\",\"\",'School Info'!$L$9)","v":"FRIDAY"},{"$f":"IF('School Info'!$M$9=\"\",\"\",'School Info'!$M$9)","v":"10:00AM TO 12:00PM"}]
[{"$f":"IF('School Info'!$J$10=\"\",\"\",'School Info'!$J$10)","v":"SANSKRIT"},{"$f":"IF('School Info'!$K$10=\"\",\"\",'School Info'!$K$10)","v":"2001-01-01"},{"$f":"IF('School Info'!$L$10=\"\",\"\",'School Info'!$L$10)","v":"SATURDAY"},{"$f":"IF('School Info'!$M$10=\"\",\"\",'School Info'!$M$10)","v":"10:00AM TO 12:00PM"}]
[{"$f":"IF('School Info'!$J$11=\"\",\"\",'School Info'!$J$11)","v":""},{"$f":"IF('School Info'!$K$11=\"\",\"\",'School Info'!$K$11)","v":"2001-01-02"},{"$f":"IF('School Info'!$L$11=\"\",\"\",'School Info'!$L$11)","v":"SUNDAY"},{"$f":"IF('School Info'!$M$11=\"\",\"\",'School Info'!$M$11)","v":"10:00AM TO 12:00PM"}]
[{"$f":"IF('School Info'!$J$12=\"\",\"\",'School Info'!$J$12)","v":""},{"$f":"IF('School Info'!$K$12=\"\",\"\",'School Info'!$K$12)","v":"2001-01-03"},{"$f":"IF('School Info'!$L$12=\"\",\"\",'School Info'!$L$12)","v":"MONDAY"},{"$f":"IF('School Info'!$M$12=\"\",\"\",'School Info'!$M$12)","v":"10:00AM TO 12:00PM"}]
[{"$f":"IF('School Info'!$J$13=\"\",\"\",'School Info'!$J$13)","v":""},{"$f":"IF('School Info'!$K$13=\"\",\"\",'School Info'!$K$13)","v":"2001-01-04"},{"$f":"IF('School Info'!$L$13=\"\",\"\",'School Info'!$L$13)","v":"TUESDAY"},{"$f":"IF('School Info'!$M$13=\"\",\"\",'School Info'!$M$13)","v":"10:00AM TO 12:00PM"}]
[{"$f":"IF('School Info'!$J$14=\"\",\"\",'School Info'!$J$14)","v":""},{"$f":"IF('School Info'!$K$14=\"\",\"\",'School Info'!$K$14)","v":""},{"$f":"IF('School Info'!$L$14=\"\",\"\",'School Info'!$L$14)","v":""},{"$f":"IF('School Info'!$M$14=\"\",\"\",'School Info'!$M$14)","v":""}]
[]
["Note :"]
["1. परीक्षार्थी अपना प्रवेश पत्र रोजाना साथ लेकर आये | (Candidates should bring their admit card with them daily.)"]
["2. परीक्षार्थी परीक्षा केंद्र पर आधा घंटे पहले पहुचें | (Candidates should reach the examination center half an hour before.)"]
["3. परीक्षार्थी परीक्षा हेतु आवश्यक सामग्री साथ लेकर आवें | (Candidates should bring with them the necessary materials for the examination.)"]
[]
[]
[]
[]
[]
["Sig. Exam Incharge",null,null,null,null,null,"Sig. Principal "]
[]
[{"$f":"IF('School Info'!$B$4=\"\",\"\",'School Info'!$B$4)","v":"Mahatma Gandhi Government School Bar"}]
[null,null,"School Aff. Code :",null,{"$f":"IF('School Info'!$F$5=\"\",\"\",'School Info'!$F$5)","v":123456}]
[null,null,{"$f":"IF('School Info'!$H$5=\"\",\"\",'School Info'!$H$5)","v":"HALF YEARLY EXAM"},null,{"$f":"IF('School Info'!$H$7=\"\",\"\",'School Info'!$H$7)","v":"2025-26"}]
[null,null,"ADMIT CARD",null,null,null,null,null,{"$f":"I432+1","v":15}]
[]
["ROLL NO :  ",{"$f":"VLOOKUP(I465,Student_data,3,0)","v":115},null,"CLASS : ",{"$f":"IF('School Info'!$B$7=\"\",\"\",'School Info'!$B$7)","v":6},"DOB :",{"$f":"VLOOKUP(I465,Student_data,4,0)","v":"2015-01-01"}]
["NAME :  ",{"$f":"VLOOKUP(I465,Student_data,6,0)","v":"RAJA  "},null,"MEDUIM : ",{"$f":"IF('School Info'!$E$7=\"\",\"\",'School Info'!$E$7)","v":"HINDI"},"GENDER :",{"$f":"VLOOKUP(I465,Student_data,5,0)","v":"MALE"}]
["FATHER :  ",{"$f":"VLOOKUP(I465,Student_data,7,0)","v":"DFD"},null,"SECTION : ",{"$f":"IF('School Info'!$F$8=\"\",\"\",'School Info'!$F$8)","v":"A"},"S.No. : ",{"$f":"VLOOKUP(I465,Student_data,2,0)","v":"A"}]
["MOTHER :  ",{"$f":"VLOOKUP(I465,Student_data,8,0)","v":"GAG"},null,"School DISE Code :",null,{"$f":"IF('School Info'!$B$5=\"\",\"\",'School Info'!$B$5)","v":123456890}]
[]
["SUBJECT","DATE","DAY","TIME "]
[{"$f":"IF('School Info'!$J$5=\"\",\"\",'School Info'!$J$5)","v":"HINDI"},{"$f":"IF('School Info'!$K$5=\"\",\"\",'School Info'!$K$5)","v":"2001-01-01"},{"$f":"IF('School Info'!$L$5=\"\",\"\",'School Info'!$L$5)","v":"MONDAY"},{"$f":"IF('School Info'!$M$5=\"\",\"\",'School Info'!$M$5)","v":"10:00AM TO 12:00PM"}]
[{"$f":"IF('School Info'!$J$6=\"\",\"\",'School Info'!$J$6)","v":"ENGLISH"},{"$f":"IF('School Info'!$K$6=\"\",\"\",'School Info'!$K$6)","v":"2001-01-01"},{"$f":"IF('School Info'!$L$6=\"\",\"\",'School Info'!$L$6)","v":"TUESDAY"},{"$f":"IF('School Info'!$M$6=\"\",\"\",'School Info'!$M$6)","v":"10:00AM TO 12:00PM"}]
[{"$f":"IF('School Info'!$J$7=\"\",\"\",'School Info'!$J$7)","v":"SCIENCE"},{"$f":"IF('School Info'!$K$7=\"\",\"\",'School Info'!$K$7)","v":"2001-01-01"},{"$f":"IF('School Info'!$L$7=\"\",\"\",'School Info'!$L$7)","v":"WEDNESDAY"},{"$f":"IF('School Info'!$M$7=\"\",\"\",'School Info'!$M$7)","v":"10:00AM TO 12:00PM"}]
[{"$f":"IF('School Info'!$J$8=\"\",\"\",'School Info'!$J$8)","v":"MATH"},{"$f":"IF('School Info'!$K$8=\"\",\"\",'School Info'!$K$8)","v":"2001-01-01"},{"$f":"IF('School Info'!$L$8=\"\",\"\",'School Info'!$L$8)","v":"THURSDAY"},{"$f":"IF('School Info'!$M$8=\"\",\"\",'School Info'!$M$8)","v":"10:00AM TO 12:00PM"}]
[{"$f":"IF('School Info'!$J$9=\"\",\"\",'School Info'!$J$9)","v":"SOCIAL SCIENCE"},{"$f":"IF('School Info'!$K$9=\"\",\"\",'School Info'!$K$9)","v":"2001-01-01"},{"$f":"IF('School Info'!$L$9=\"\",\"\",'School Info'!$L$9)","v":"FRIDAY"},{"$f":"IF('School Info'!$M$9=\"\",\"\",'School Info'!$M$9)","v":"10:00AM TO 12:00PM"}]
[{"$f":"IF('School Info'!$J$10=\"\",\"\",'School Info'!$J$10)","v":"SANSKRIT"},{"$f":"IF('School Info'!$K$10=\"\",\"\",'School Info'!$K$10)","v":"2001-01-01"},{"$f":"IF('School Info'!$L$10=\"\",\"\",'School Info'!$L$10)","v":"SATURDAY"},{"$f":"IF('School Info'!$M$10=\"\",\"\",'School Info'!$M$10)","v":"10:00AM TO 12:00PM"}]
[{"$f":"IF('School Info'!$J$11=\"\",\"\",'School Info'!$J$11)","v":""},{"$f":"IF('School Info'!$K$11=\"\",\"\",'School Info'!$K$11)","v":"2001-01-02"},{"$f":"IF('School Info'!$L$11=\"\",\"\",'School Info'!$L$11)","v":"SUNDAY"},{"$f":"IF('School Info'!$M$11=\"\",\"\",'School Info'!$M$11)","v":"10:00AM TO 12:00PM"}]
[{"$f":"IF('School Info'!$J$12=\"\",\"\",'School Info'!$J$12)","v":""},{"$f":"IF('School Info'!$K$12=\"\",\"\",'School Info'!$K$12)","v":"2001-01-03"},{"$f":"IF('School Info'!$L$12=\"\",\"\",'School Info'!$L$12)","v":"MONDAY"},{"$f":"IF('School Info'!$M$12=\"\",\"\",'School Info'!$M$12)","v":"10:00AM TO 12:00PM"}]
[{"$f":"IF('School Info'!$J$13=\"\",\"\",'School Info'!$J$13)","v":""},{"$f":"IF('School Info'!$K$13=\"\",\"\",'School Info'!$K$13)","v":"2001-01-04"},{"$f":"IF('School Info'!$L$13=\"\",\"\",'School Info'!$L$13)","v":"TUESDAY"},{"$f":"IF('School Info'!$M$13=\"\",\"\",'School Info'!$M$13)","v":"10:00AM TO 12:00PM"}]
[{"$f":"IF('School Info'!$J$14=\"\",\"\",'School Info'!$J$14)","v":""},{"$f":"IF('School Info'!$K$14=\"\",\"\",'School Info'!$K$14)","v":""},{"$f":"IF('School Info'!$L$14=\"\",\"\",'School Info'!$L$14)","v":""},{"$f":"IF('School Info'!$M$14=\"\",\"\",'School Info'!$M$14)","v":""}]
[]
["Note :"]
["1. परीक्षार्थी अपना प्रवेश पत्र रोजाना साथ लेकर आये | (Candidates should bring their admit card with them daily.)"]
["2. परीक्षार्थी परीक्षा केंद्र पर आधा घंटे पहले पहुचें | (Candidates should reach the examination center half an hour before.)"]
["3. परीक्षार्थी परीक्षा हेतु आवश्यक सामग्री साथ लेकर आवें | (Candidates should bring with them the necessary materials for the examination.)"]
[]
[]
[]
[]
[]
["Sig. Exam Incharge",null,null,null,null,null,"Sig. Principal "]
[".------------------------------------------------------- Cut Here------------------------------------------------------"]
[{"$f":"IF('School Info'!$B$4=\"\",\"\",'School Info'!$B$4)","v":"Mahatma Gandhi Government School Bar"}]
[null,null,"School Aff. Code :",null,{"$f":"IF('School Info'!$F$5=\"\",\"\",'School Info'!$F$5)","v":123456}]
[null,null,{"$f":"IF('School Info'!$H$5=\"\",\"\",'School Info'!$H$5)","v":"HALF YEARLY EXAM"},null,{"$f":"IF('School Info'!$H$7=\"\",\"\",'School Info'!$H$7)","v":"2025-26"}]
[null,null,"ADMIT CARD",null,null,null,null,null,{"$f":"I465+1","v":16}]
[]
["ROLL NO :  ",{"$f":"VLOOKUP(I498,Student_data,3,0)","v":116},null,"CLASS : ",{"$f":"IF('School Info'!$B$7=\"\",\"\",'School Info'!$B$7)","v":6},"DOB :",{"$f":"VLOOKUP(I498,Student_data,4,0)","v":"2016-01-01"}]
["NAME :  ",{"$f":"VLOOKUP(I498,Student_data,6,0)","v":"RAJ GURUJI"},null,"MEDUIM : ",{"$f":"IF('School Info'!$E$7=\"\",\"\",'School Info'!$E$7)","v":"HINDI"},"GENDER :",{"$f":"VLOOKUP(I498,Student_data,5,0)","v":"MALE"}]
["FATHER :  ",{"$f":"VLOOKUP(I498,Student_data,7,0)","v":"RAJ"},null,"SECTION : ",{"$f":"IF('School Info'!$F$8=\"\",\"\",'School Info'!$F$8)","v":"A"},"S.No. : ",{"$f":"VLOOKUP(I498,Student_data,2,0)","v":"B"}]
["MOTHER :  ",{"$f":"VLOOKUP(I498,Student_data,8,0)","v":"DEVI"},null,"School DISE Code :",null,{"$f":"IF('School Info'!$B$5=\"\",\"\",'School Info'!$B$5)","v":123456890}]
[]
["SUBJECT","DATE","DAY","TIME "]
[{"$f":"IF('School Info'!$J$5=\"\",\"\",'School Info'!$J$5)","v":"HINDI"},{"$f":"IF('School Info'!$K$5=\"\",\"\",'School Info'!$K$5)","v":"2001-01-01"},{"$f":"IF('School Info'!$L$5=\"\",\"\",'School Info'!$L$5)","v":"MONDAY"},{"$f":"IF('School Info'!$M$5=\"\",\"\",'School Info'!$M$5)","v":"10:00AM TO 12:00PM"}]
[{"$f":"IF('School Info'!$J$6=\"\",\"\",'School Info'!$J$6)","v":"ENGLISH"},{"$f":"IF('School Info'!$K$6=\"\",\"\",'School Info'!$K$6)","v":"2001-01-01"},{"$f":"IF('School Info'!$L$6=\"\",\"\",'School Info'!$L$6)","v":"TUESDAY"},{"$f":"IF('School Info'!$M$6=\"\",\"\",'School Info'!$M$6)","v":"10:00AM TO 12:00PM"}]
[{"$f":"IF('School Info'!$J$7=\"\",\"\",'School Info'!$J$7)","v":"SCIENCE"},{"$f":"IF('School Info'!$K$7=\"\",\"\",'School Info'!$K$7)","v":"2001-01-01"},{"$f":"IF('School Info'!$L$7=\"\",\"\",'School Info'!$L$7)","v":"WEDNESDAY"},{"$f":"IF('School Info'!$M$7=\"\",\"\",'School Info'!$M$7)","v":"10:00AM TO 12:00PM"}]
[{"$f":"IF('School Info'!$J$8=\"\",\"\",'School Info'!$J$8)","v":"MATH"},{"$f":"IF('School Info'!$K$8=\"\",\"\",'School Info'!$K$8)","v":"2001-01-01"},{"$f":"IF('School Info'!$L$8=\"\",\"\",'School Info'!$L$8)","v":"THURSDAY"},{"$f":"IF('School Info'!$M$8=\"\",\"\",'School Info'!$M$8)","v":"10:00AM TO 12:00PM"}]
[{"$f":"IF('School Info'!$J$9=\"\",\"\",'School Info'!$J$9)","v":"SOCIAL SCIENCE"},{"$f":"IF('School Info'!$K$9=\"\",\"\",'School Info'!$K$9)","v":"2001-01-01"},{"$f":"IF('School Info'!$L$9=\"\",\"\",'School Info'!$L$9)","v":"FRIDAY"},{"$f":"IF('School Info'!$M$9=\"\",\"\",'School Info'!$M$9)","v":"10:00AM TO 12:00PM"}]
[{"$f":"IF('School Info'!$J$10=\"\",\"\",'School Info'!$J$10)","v":"SANSKRIT"},{"$f":"IF('School Info'!$K$10=\"\",\"\",'School Info'!$K$10)","v":"2001-01-01"},{"$f":"IF('School Info'!$L$10=\"\",\"\",'School Info'!$L$10)","v":"SATURDAY"},{"$f":"IF('School Info'!$M$10=\"\",\"\",'School Info'!$M$10)","v":"10:00AM TO 12:00PM"}]
[{"$f":"IF('School Info'!$J$11=\"\",\"\",'School Info'!$J$11)","v":""},{"$f":"IF('School Info'!$K$11=\"\",\"\",'School Info'!$K$11)","v":"2001-01-02"},{"$f":"IF('School Info'!$L$11=\"\",\"\",'School Info'!$L$11)","v":"SUNDAY"},{"$f":"IF('School Info'!$M$11=\"\",\"\",'School Info'!$M$11)","v":"10:00AM TO 12:00PM"}]
[{"$f":"IF('School Info'!$J$12=\"\",\"\",'School Info'!$J$12)","v":""},{"$f":"IF('School Info'!$K$12=\"\",\"\",'School Info'!$K$12)","v":"2001-01-03"},{"$f":"IF('School Info'!$L$12=\"\",\"\",'School Info'!$L$12)","v":"MONDAY"},{"$f":"IF('School Info'!$M$12=\"\",\"\",'School Info'!$M$12)","v":"10:00AM TO 12:00PM"}]
[{"$f":"IF('School Info'!$J$13=\"\",\"\",'School Info'!$J$13)","v":""},{"$f":"IF('School Info'!$K$13=\"\",\"\",'School Info'!$K$13)","v":"2001-01-04"},{"$f":"IF('School Info'!$L$13=\"\",\"\",'School Info'!$L$13)","v":"TUESDAY"},{"$f":"IF('School Info'!$M$13=\"\",\"\",'School Info'!$M$13)","v":"10:00AM TO 12:00PM"}]
[{"$f":"IF('School Info'!$J$14=\"\",\"\",'School Info'!$J$14)","v":""},{"$f":"IF('School Info'!$K$14=\"\",\"\",'School Info'!$K$14)","v":""},{"$f":"IF('School Info'!$L$14=\"\",\"\",'School Info'!$L$14)","v":""},{"$f":"IF('School Info'!$M$14=\"\",\"\",'School Info'!$M$14)","v":""}]
[]
["Note :"]
["1. परीक्षार्थी अपना प्रवेश पत्र रोजाना साथ लेकर आये | (Candidates should bring their admit card with them daily.)"]
["2. परीक्षार्थी परीक्षा केंद्र पर आधा घंटे पहले पहुचें | (Candidates should reach the examination center half an hour before.)"]
["3. परीक्षार्थी परीक्षा हेतु आवश्यक सामग्री साथ लेकर आवें | (Candidates should bring with them the necessary materials for the examination.)"]
[]
[]
[]
[]
[]
["Sig. Exam Incharge",null,null,null,null,null,"Sig. Principal "]
[]
[{"$f":"IF('School Info'!$B$4=\"\",\"\",'School Info'!$B$4)","v":"Mahatma Gandhi Government School Bar"}]
[null,null,"School Aff. Code :",null,{"$f":"IF('School Info'!$F$5=\"\",\"\",'School Info'!$F$5)","v":123456}]
[null,null,{"$f":"IF('School Info'!$H$5=\"\",\"\",'School Info'!$H$5)","v":"HALF YEARLY EXAM"},null,{"$f":"IF('School Info'!$H$7=\"\",\"\",'School Info'!$H$7)","v":"2025-26"}]
[null,null,"ADMIT CARD",null,null,null,null,null,{"$f":"I498+1","v":17}]
[]
["ROLL NO :  ",{"$f":"VLOOKUP(I531,Student_data,3,0)","v":117},null,"CLASS : ",{"$f":"IF('School Info'!$B$7=\"\",\"\",'School Info'!$B$7)","v":6},"DOB :",{"$f":"VLOOKUP(I531,Student_data,4,0)","v":"2017-01-01"}]
["NAME :  ",{"$f":"VLOOKUP(I531,Student_data,6,0)","v":"MONU"},null,"MEDUIM : ",{"$f":"IF('School Info'!$E$7=\"\",\"\",'School Info'!$E$7)","v":"HINDI"},"GENDER :",{"$f":"VLOOKUP(I531,Student_data,5,0)","v":"MALE"}]
["FATHER :  ",{"$f":"VLOOKUP(I531,Student_data,7,0)","v":"RAAA"},null,"SECTION : ",{"$f":"IF('School Info'!$F$8=\"\",\"\",'School Info'!$F$8)","v":"A"},"S.No. : ",{"$f":"VLOOKUP(I531,Student_data,2,0)","v":"A"}]
["MOTHER :  ",{"$f":"VLOOKUP(I531,Student_data,8,0)","v":"DDD"},null,"School DISE Code :",null,{"$f":"IF('School Info'!$B$5=\"\",\"\",'School Info'!$B$5)","v":123456890}]
[]
["SUBJECT","DATE","DAY","TIME "]
[{"$f":"IF('School Info'!$J$5=\"\",\"\",'School Info'!$J$5)","v":"HINDI"},{"$f":"IF('School Info'!$K$5=\"\",\"\",'School Info'!$K$5)","v":"2001-01-01"},{"$f":"IF('School Info'!$L$5=\"\",\"\",'School Info'!$L$5)","v":"MONDAY"},{"$f":"IF('School Info'!$M$5=\"\",\"\",'School Info'!$M$5)","v":"10:00AM TO 12:00PM"}]
[{"$f":"IF('School Info'!$J$6=\"\",\"\",'School Info'!$J$6)","v":"ENGLISH"},{"$f":"IF('School Info'!$K$6=\"\",\"\",'School Info'!$K$6)","v":"2001-01-01"},{"$f":"IF('School Info'!$L$6=\"\",\"\",'School Info'!$L$6)","v":"TUESDAY"},{"$f":"IF('School Info'!$M$6=\"\",\"\",'School Info'!$M$6)","v":"10:00AM TO 12:00PM"}]
[{"$f":"IF('School Info'!$J$7=\"\",\"\",'School Info'!$J$7)","v":"SCIENCE"},{"$f":"IF('School Info'!$K$7=\"\",\"\",'School Info'!$K$7)","v":"2001-01-01"},{"$f":"IF('School Info'!$L$7=\"\",\"\",'School Info'!$L$7)","v":"WEDNESDAY"},{"$f":"IF('School Info'!$M$7=\"\",\"\",'School Info'!$M$7)","v":"10:00AM TO 12:00PM"}]
[{"$f":"IF('School Info'!$J$8=\"\",\"\",'School Info'!$J$8)","v":"MATH"},{"$f":"IF('School Info'!$K$8=\"\",\"\",'School Info'!$K$8)","v":"2001-01-01"},{"$f":"IF('School Info'!$L$8=\"\",\"\",'School Info'!$L$8)","v":"THURSDAY"},{"$f":"IF('School Info'!$M$8=\"\",\"\",'School Info'!$M$8)","v":"10:00AM TO 12:00PM"}]
[{"$f":"IF('School Info'!$J$9=\"\",\"\",'School Info'!$J$9)","v":"SOCIAL SCIENCE"},{"$f":"IF('School Info'!$K$9=\"\",\"\",'School Info'!$K$9)","v":"2001-01-01"},{"$f":"IF('School Info'!$L$9=\"\",\"\",'School Info'!$L$9)","v":"FRIDAY"},{"$f":"IF('School Info'!$M$9=\"\",\"\",'School Info'!$M$9)","v":"10:00AM TO 12:00PM"}]
[{"$f":"IF('School Info'!$J$10=\"\",\"\",'School Info'!$J$10)","v":"SANSKRIT"},{"$f":"IF('School Info'!$K$10=\"\",\"\",'School Info'!$K$10)","v":"2001-01-01"},{"$f":"IF('School Info'!$L$10=\"\",\"\",'School Info'!$L$10)","v":"SATURDAY"},{"$f":"IF('School Info'!$M$10=\"\",\"\",'School Info'!$M$10)","v":"10:00AM TO 12:00PM"}]
[{"$f":"IF('School Info'!$J$11=\"\",\"\",'School Info'!$J$11)","v":""},{"$f":"IF('School Info'!$K$11=\"\",\"\",'School Info'!$K$11)","v":"2001-01-02"},{"$f":"IF('School Info'!$L$11=\"\",\"\",'School Info'!$L$11)","v":"SUNDAY"},{"$f":"IF('School Info'!$M$11=\"\",\"\",'School Info'!$M$11)","v":"10:00AM TO 12:00PM"}]
[{"$f":"IF('School Info'!$J$12=\"\",\"\",'School Info'!$J$12)","v":""},{"$f":"IF('School Info'!$K$12=\"\",\"\",'School Info'!$K$12)","v":"2001-01-03"},{"$f":"IF('School Info'!$L$12=\"\",\"\",'School Info'!$L$12)","v":"MONDAY"},{"$f":"IF('School Info'!$M$12=\"\",\"\",'School Info'!$M$12)","v":"10:00AM TO 12:00PM"}]
[{"$f":"IF('School Info'!$J$13=\"\",\"\",'School Info'!$J$13)","v":""},{"$f":"IF('School Info'!$K$13=\"\",\"\",'School Info'!$K$13)","v":"2001-01-04"},{"$f":"IF('School Info'!$L$13=\"\",\"\",'School Info'!$L$13)","v":"TUESDAY"},{"$f":"IF('School Info'!$M$13=\"\",\"\",'School Info'!$M$13)","v":"10:00AM TO 12:00PM"}]
[{"$f":"IF('School Info'!$J$14=\"\",\"\",'School Info'!$J$14)","v":""},{"$f":"IF('School Info'!$K$14=\"\",\"\",'School Info'!$K$14)","v":""},{"$f":"IF('School Info'!$L$14=\"\",\"\",'School Info'!$L$14)","v":""},{"$f":"IF('School Info'!$M$14=\"\",\"\",'School Info'!$M$14)","v":""}]
[]
["Note :"]
["1. परीक्षार्थी अपना प्रवेश पत्र रोजाना साथ लेकर आये | (Candidates should bring their admit card with them daily.)"]
["2. परीक्षार्थी परीक्षा केंद्र पर आधा घंटे पहले पहुचें | (Candidates should reach the examination center half an hour before.)"]
["3. परीक्षार्थी परीक्षा हेतु आवश्यक सामग्री साथ लेकर आवें | (Candidates should bring with them the necessary materials for the examination.)"]
[]
[]
[]
[]
[]
["Sig. Exam Incharge",null,null,null,null,null,"Sig. Principal "]
[".------------------------------------------------------- Cut Here------------------------------------------------------"]
[{"$f":"IF('School Info'!$B$4=\"\",\"\",'School Info'!$B$4)","v":"Mahatma Gandhi Government School Bar"}]
[null,null,"School Aff. Code :",null,{"$f":"IF('School Info'!$F$5=\"\",\"\",'School Info'!$F$5)","v":123456}]
[null,null,{"$f":"IF('School Info'!$H$5=\"\",\"\",'School Info'!$H$5)","v":"HALF YEARLY EXAM"},null,{"$f":"IF('School Info'!$H$7=\"\",\"\",'School Info'!$H$7)","v":"2025-26"}]
[null,null,"ADMIT CARD",null,null,null,null,null,{"$f":"I531+1","v":18}]
[]
["ROLL NO :  ",{"$f":"VLOOKUP(I564,Student_data,3,0)","v":118},null,"CLASS : ",{"$f":"IF('School Info'!$B$7=\"\",\"\",'School Info'!$B$7)","v":6},"DOB :",{"$f":"VLOOKUP(I564,Student_data,4,0)","v":"2018-01-01"}]
["NAME :  ",{"$f":"VLOOKUP(I564,Student_data,6,0)","v":"SONU"},null,"MEDUIM : ",{"$f":"IF('School Info'!$E$7=\"\",\"\",'School Info'!$E$7)","v":"HINDI"},"GENDER :",{"$f":"VLOOKUP(I564,Student_data,5,0)","v":"MALE"}]
["FATHER :  ",{"$f":"VLOOKUP(I564,Student_data,7,0)","v":"AAA"},null,"SECTION : ",{"$f":"IF('School Info'!$F$8=\"\",\"\",'School Info'!$F$8)","v":"A"},"S.No. : ",{"$f":"VLOOKUP(I564,Student_data,2,0)","v":"B"}]
["MOTHER :  ",{"$f":"VLOOKUP(I564,Student_data,8,0)","v":"DDS"},null,"School DISE Code :",null,{"$f":"IF('School Info'!$B$5=\"\",\"\",'School Info'!$B$5)","v":123456890}]
[]
["SUBJECT","DATE","DAY","TIME "]
[{"$f":"IF('School Info'!$J$5=\"\",\"\",'School Info'!$J$5)","v":"HINDI"},{"$f":"IF('School Info'!$K$5=\"\",\"\",'School Info'!$K$5)","v":"2001-01-01"},{"$f":"IF('School Info'!$L$5=\"\",\"\",'School Info'!$L$5)","v":"MONDAY"},{"$f":"IF('School Info'!$M$5=\"\",\"\",'School Info'!$M$5)","v":"10:00AM TO 12:00PM"}]
[{"$f":"IF('School Info'!$J$6=\"\",\"\",'School Info'!$J$6)","v":"ENGLISH"},{"$f":"IF('School Info'!$K$6=\"\",\"\",'School Info'!$K$6)","v":"2001-01-01"},{"$f":"IF('School Info'!$L$6=\"\",\"\",'School Info'!$L$6)","v":"TUESDAY"},{"$f":"IF('School Info'!$M$6=\"\",\"\",'School Info'!$M$6)","v":"10:00AM TO 12:00PM"}]
[{"$f":"IF('School Info'!$J$7=\"\",\"\",'School Info'!$J$7)","v":"SCIENCE"},{"$f":"IF('School Info'!$K$7=\"\",\"\",'School Info'!$K$7)","v":"2001-01-01"},{"$f":"IF('School Info'!$L$7=\"\",\"\",'School Info'!$L$7)","v":"WEDNESDAY"},{"$f":"IF('School Info'!$M$7=\"\",\"\",'School Info'!$M$7)","v":"10:00AM TO 12:00PM"}]
[{"$f":"IF('School Info'!$J$8=\"\",\"\",'School Info'!$J$8)","v":"MATH"},{"$f":"IF('School Info'!$K$8=\"\",\"\",'School Info'!$K$8)","v":"2001-01-01"},{"$f":"IF('School Info'!$L$8=\"\",\"\",'School Info'!$L$8)","v":"THURSDAY"},{"$f":"IF('School Info'!$M$8=\"\",\"\",'School Info'!$M$8)","v":"10:00AM TO 12:00PM"}]
[{"$f":"IF('School Info'!$J$9=\"\",\"\",'School Info'!$J$9)","v":"SOCIAL SCIENCE"},{"$f":"IF('School Info'!$K$9=\"\",\"\",'School Info'!$K$9)","v":"2001-01-01"},{"$f":"IF('School Info'!$L$9=\"\",\"\",'School Info'!$L$9)","v":"FRIDAY"},{"$f":"IF('School Info'!$M$9=\"\",\"\",'School Info'!$M$9)","v":"10:00AM TO 12:00PM"}]
[{"$f":"IF('School Info'!$J$10=\"\",\"\",'School Info'!$J$10)","v":"SANSKRIT"},{"$f":"IF('School Info'!$K$10=\"\",\"\",'School Info'!$K$10)","v":"2001-01-01"},{"$f":"IF('School Info'!$L$10=\"\",\"\",'School Info'!$L$10)","v":"SATURDAY"},{"$f":"IF('School Info'!$M$10=\"\",\"\",'School Info'!$M$10)","v":"10:00AM TO 12:00PM"}]
[{"$f":"IF('School Info'!$J$11=\"\",\"\",'School Info'!$J$11)","v":""},{"$f":"IF('School Info'!$K$11=\"\",\"\",'School Info'!$K$11)","v":"2001-01-02"},{"$f":"IF('School Info'!$L$11=\"\",\"\",'School Info'!$L$11)","v":"SUNDAY"},{"$f":"IF('School Info'!$M$11=\"\",\"\",'School Info'!$M$11)","v":"10:00AM TO 12:00PM"}]
[{"$f":"IF('School Info'!$J$12=\"\",\"\",'School Info'!$J$12)","v":""},{"$f":"IF('School Info'!$K$12=\"\",\"\",'School Info'!$K$12)","v":"2001-01-03"},{"$f":"IF('School Info'!$L$12=\"\",\"\",'School Info'!$L$12)","v":"MONDAY"},{"$f":"IF('School Info'!$M$12=\"\",\"\",'School Info'!$M$12)","v":"10:00AM TO 12:00PM"}]
[{"$f":"IF('School Info'!$J$13=\"\",\"\",'School Info'!$J$13)","v":""},{"$f":"IF('School Info'!$K$13=\"\",\"\",'School Info'!$K$13)","v":"2001-01-04"},{"$f":"IF('School Info'!$L$13=\"\",\"\",'School Info'!$L$13)","v":"TUESDAY"},{"$f":"IF('School Info'!$M$13=\"\",\"\",'School Info'!$M$13)","v":"10:00AM TO 12:00PM"}]
[{"$f":"IF('School Info'!$J$14=\"\",\"\",'School Info'!$J$14)","v":""},{"$f":"IF('School Info'!$K$14=\"\",\"\",'School Info'!$K$14)","v":""},{"$f":"IF('School Info'!$L$14=\"\",\"\",'School Info'!$L$14)","v":""},{"$f":"IF('School Info'!$M$14=\"\",\"\",'School Info'!$M$14)","v":""}]
[]
["Note :"]
["1. परीक्षार्थी अपना प्रवेश पत्र रोजाना साथ लेकर आये | (Candidates should bring their admit card with them daily.)"]
["2. परीक्षार्थी परीक्षा केंद्र पर आधा घंटे पहले पहुचें | (Candidates should reach the examination center half an hour before.)"]
["3. परीक्षार्थी परीक्षा हेतु आवश्यक सामग्री साथ लेकर आवें | (Candidates should bring with them the necessary materials for the examination.)"]
[]
[]
[]
[]
[]
["Sig. Exam Incharge",null,null,null,null,null,"Sig. Principal "]
[]
[{"$f":"IF('School Info'!$B$4=\"\",\"\",'School Info'!$B$4)","v":"Mahatma Gandhi Government School Bar"}]
[null,null,"School Aff. Code :",null,{"$f":"IF('School Info'!$F$5=\"\",\"\",'School Info'!$F$5)","v":123456}]
[null,null,{"$f":"IF('School Info'!$H$5=\"\",\"\",'School Info'!$H$5)","v":"HALF YEARLY EXAM"},null,{"$f":"IF('School Info'!$H$7=\"\",\"\",'School Info'!$H$7)","v":"2025-26"}]
[null,null,"ADMIT CARD",null,null,null,null,null,{"$f":"I564+1","v":19}]
[]
["ROLL NO :  ",{"$f":"VLOOKUP(I597,Student_data,3,0)","v":119},null,"CLASS : ",{"$f":"IF('School Info'!$B$7=\"\",\"\",'School Info'!$B$7)","v":6},"DOB :",{"$f":"VLOOKUP(I597,Student_data,4,0)","v":"2019-01-01"}]
["NAME :  ",{"$f":"VLOOKUP(I597,Student_data,6,0)","v":"KARNA"},null,"MEDUIM : ",{"$f":"IF('School Info'!$E$7=\"\",\"\",'School Info'!$E$7)","v":"HINDI"},"GENDER :",{"$f":"VLOOKUP(I597,Student_data,5,0)","v":"MALE"}]
["FATHER :  ",{"$f":"VLOOKUP(I597,Student_data,7,0)","v":"BBB"},null,"SECTION : ",{"$f":"IF('School Info'!$F$8=\"\",\"\",'School Info'!$F$8)","v":"A"},"S.No. : ",{"$f":"VLOOKUP(I597,Student_data,2,0)","v":0}]
["MOTHER :  ",{"$f":"VLOOKUP(I597,Student_data,8,0)","v":"SSDDF"},null,"School DISE Code :",null,{"$f":"IF('School Info'!$B$5=\"\",\"\",'School Info'!$B$5)","v":123456890}]
[]
["SUBJECT","DATE","DAY","TIME "]
[{"$f":"IF('School Info'!$J$5=\"\",\"\",'School Info'!$J$5)","v":"HINDI"},{"$f":"IF('School Info'!$K$5=\"\",\"\",'School Info'!$K$5)","v":"2001-01-01"},{"$f":"IF('School Info'!$L$5=\"\",\"\",'School Info'!$L$5)","v":"MONDAY"},{"$f":"IF('School Info'!$M$5=\"\",\"\",'School Info'!$M$5)","v":"10:00AM TO 12:00PM"}]
[{"$f":"IF('School Info'!$J$6=\"\",\"\",'School Info'!$J$6)","v":"ENGLISH"},{"$f":"IF('School Info'!$K$6=\"\",\"\",'School Info'!$K$6)","v":"2001-01-01"},{"$f":"IF('School Info'!$L$6=\"\",\"\",'School Info'!$L$6)","v":"TUESDAY"},{"$f":"IF('School Info'!$M$6=\"\",\"\",'School Info'!$M$6)","v":"10:00AM TO 12:00PM"}]
[{"$f":"IF('School Info'!$J$7=\"\",\"\",'School Info'!$J$7)","v":"SCIENCE"},{"$f":"IF('School Info'!$K$7=\"\",\"\",'School Info'!$K$7)","v":"2001-01-01"},{"$f":"IF('School Info'!$L$7=\"\",\"\",'School Info'!$L$7)","v":"WEDNESDAY"},{"$f":"IF('School Info'!$M$7=\"\",\"\",'School Info'!$M$7)","v":"10:00AM TO 12:00PM"}]
[{"$f":"IF('School Info'!$J$8=\"\",\"\",'School Info'!$J$8)","v":"MATH"},{"$f":"IF('School Info'!$K$8=\"\",\"\",'School Info'!$K$8)","v":"2001-01-01"},{"$f":"IF('School Info'!$L$8=\"\",\"\",'School Info'!$L$8)","v":"THURSDAY"},{"$f":"IF('School Info'!$M$8=\"\",\"\",'School Info'!$M$8)","v":"10:00AM TO 12:00PM"}]
[{"$f":"IF('School Info'!$J$9=\"\",\"\",'School Info'!$J$9)","v":"SOCIAL SCIENCE"},{"$f":"IF('School Info'!$K$9=\"\",\"\",'School Info'!$K$9)","v":"2001-01-01"},{"$f":"IF('School Info'!$L$9=\"\",\"\",'School Info'!$L$9)","v":"FRIDAY"},{"$f":"IF('School Info'!$M$9=\"\",\"\",'School Info'!$M$9)","v":"10:00AM TO 12:00PM"}]
[{"$f":"IF('School Info'!$J$10=\"\",\"\",'School Info'!$J$10)","v":"SANSKRIT"},{"$f":"IF('School Info'!$K$10=\"\",\"\",'School Info'!$K$10)","v":"2001-01-01"},{"$f":"IF('School Info'!$L$10=\"\",\"\",'School Info'!$L$10)","v":"SATURDAY"},{"$f":"IF('School Info'!$M$10=\"\",\"\",'School Info'!$M$10)","v":"10:00AM TO 12:00PM"}]
[{"$f":"IF('School Info'!$J$11=\"\",\"\",'School Info'!$J$11)","v":""},{"$f":"IF('School Info'!$K$11=\"\",\"\",'School Info'!$K$11)","v":"2001-01-02"},{"$f":"IF('School Info'!$L$11=\"\",\"\",'School Info'!$L$11)","v":"SUNDAY"},{"$f":"IF('School Info'!$M$11=\"\",\"\",'School Info'!$M$11)","v":"10:00AM TO 12:00PM"}]
[{"$f":"IF('School Info'!$J$12=\"\",\"\",'School Info'!$J$12)","v":""},{"$f":"IF('School Info'!$K$12=\"\",\"\",'School Info'!$K$12)","v":"2001-01-03"},{"$f":"IF('School Info'!$L$12=\"\",\"\",'School Info'!$L$12)","v":"MONDAY"},{"$f":"IF('School Info'!$M$12=\"\",\"\",'School Info'!$M$12)","v":"10:00AM TO 12:00PM"}]
[{"$f":"IF('School Info'!$J$13=\"\",\"\",'School Info'!$J$13)","v":""},{"$f":"IF('School Info'!$K$13=\"\",\"\",'School Info'!$K$13)","v":"2001-01-04"},{"$f":"IF('School Info'!$L$13=\"\",\"\",'School Info'!$L$13)","v":"TUESDAY"},{"$f":"IF('School Info'!$M$13=\"\",\"\",'School Info'!$M$13)","v":"10:00AM TO 12:00PM"}]
[{"$f":"IF('School Info'!$J$14=\"\",\"\",'School Info'!$J$14)","v":""},{"$f":"IF('School Info'!$K$14=\"\",\"\",'School Info'!$K$14)","v":""},{"$f":"IF('School Info'!$L$14=\"\",\"\",'School Info'!$L$14)","v":""},{"$f":"IF('School Info'!$M$14=\"\",\"\",'School Info'!$M$14)","v":""}]
[]
["Note :"]
["1. परीक्षार्थी अपना प्रवेश पत्र रोजाना साथ लेकर आये | (Candidates should bring their admit card with them daily.)"]
["2. परीक्षार्थी परीक्षा केंद्र पर आधा घंटे पहले पहुचें | (Candidates should reach the examination center half an hour before.)"]
["3. परीक्षार्थी परीक्षा हेतु आवश्यक सामग्री साथ लेकर आवें | (Candidates should bring with them the necessary materials for the examination.)"]
[]
[]
[]
[]
[]
["Sig. Exam Incharge",null,null,null,null,null,"Sig. Principal "]
[".------------------------------------------------------- Cut Here------------------------------------------------------"]
[{"$f":"IF('School Info'!$B$4=\"\",\"\",'School Info'!$B$4)","v":"Mahatma Gandhi Government School Bar"}]
[null,null,"School Aff. Code :",null,{"$f":"IF('School Info'!$F$5=\"\",\"\",'School Info'!$F$5)","v":123456}]
[null,null,{"$f":"IF('School Info'!$H$5=\"\",\"\",'School Info'!$H$5)","v":"HALF YEARLY EXAM"},null,{"$f":"IF('School Info'!$H$7=\"\",\"\",'School Info'!$H$7)","v":"2025-26"}]
[null,null,"ADMIT CARD",null,null,null,null,null,{"$f":"I597+1","v":20}]
[]
["ROLL NO :  ",{"$f":"VLOOKUP(I630,Student_data,3,0)","v":120},null,"CLASS : ",{"$f":"IF('School Info'!$B$7=\"\",\"\",'School Info'!$B$7)","v":6},"DOB :",{"$f":"VLOOKUP(I630,Student_data,4,0)","v":"2020-01-01"}]
["NAME :  ",{"$f":"VLOOKUP(I630,Student_data,6,0)","v":"RAJA  "},null,"MEDUIM : ",{"$f":"IF('School Info'!$E$7=\"\",\"\",'School Info'!$E$7)","v":"HINDI"},"GENDER :",{"$f":"VLOOKUP(I630,Student_data,5,0)","v":"MALE"}]
["FATHER :  ",{"$f":"VLOOKUP(I630,Student_data,7,0)","v":"DFD"},null,"SECTION : ",{"$f":"IF('School Info'!$F$8=\"\",\"\",'School Info'!$F$8)","v":"A"},"S.No. : ",{"$f":"VLOOKUP(I630,Student_data,2,0)","v":0}]
["MOTHER :  ",{"$f":"VLOOKUP(I630,Student_data,8,0)","v":"GAG"},null,"School DISE Code :",null,{"$f":"IF('School Info'!$B$5=\"\",\"\",'School Info'!$B$5)","v":123456890}]
[]
["SUBJECT","DATE","DAY","TIME "]
[{"$f":"IF('School Info'!$J$5=\"\",\"\",'School Info'!$J$5)","v":"HINDI"},{"$f":"IF('School Info'!$K$5=\"\",\"\",'School Info'!$K$5)","v":"2001-01-01"},{"$f":"IF('School Info'!$L$5=\"\",\"\",'School Info'!$L$5)","v":"MONDAY"},{"$f":"IF('School Info'!$M$5=\"\",\"\",'School Info'!$M$5)","v":"10:00AM TO 12:00PM"}]
[{"$f":"IF('School Info'!$J$6=\"\",\"\",'School Info'!$J$6)","v":"ENGLISH"},{"$f":"IF('School Info'!$K$6=\"\",\"\",'School Info'!$K$6)","v":"2001-01-01"},{"$f":"IF('School Info'!$L$6=\"\",\"\",'School Info'!$L$6)","v":"TUESDAY"},{"$f":"IF('School Info'!$M$6=\"\",\"\",'School Info'!$M$6)","v":"10:00AM TO 12:00PM"}]
[{"$f":"IF('School Info'!$J$7=\"\",\"\",'School Info'!$J$7)","v":"SCIENCE"},{"$f":"IF('School Info'!$K$7=\"\",\"\",'School Info'!$K$7)","v":"2001-01-01"},{"$f":"IF('School Info'!$L$7=\"\",\"\",'School Info'!$L$7)","v":"WEDNESDAY"},{"$f":"IF('School Info'!$M$7=\"\",\"\",'School Info'!$M$7)","v":"10:00AM TO 12:00PM"}]
[{"$f":"IF('School Info'!$J$8=\"\",\"\",'School Info'!$J$8)","v":"MATH"},{"$f":"IF('School Info'!$K$8=\"\",\"\",'School Info'!$K$8)","v":"2001-01-01"},{"$f":"IF('School Info'!$L$8=\"\",\"\",'School Info'!$L$8)","v":"THURSDAY"},{"$f":"IF('School Info'!$M$8=\"\",\"\",'School Info'!$M$8)","v":"10:00AM TO 12:00PM"}]
[{"$f":"IF('School Info'!$J$9=\"\",\"\",'School Info'!$J$9)","v":"SOCIAL SCIENCE"},{"$f":"IF('School Info'!$K$9=\"\",\"\",'School Info'!$K$9)","v":"2001-01-01"},{"$f":"IF('School Info'!$L$9=\"\",\"\",'School Info'!$L$9)","v":"FRIDAY"},{"$f":"IF('School Info'!$M$9=\"\",\"\",'School Info'!$M$9)","v":"10:00AM TO 12:00PM"}]
[{"$f":"IF('School Info'!$J$10=\"\",\"\",'School Info'!$J$10)","v":"SANSKRIT"},{"$f":"IF('School Info'!$K$10=\"\",\"\",'School Info'!$K$10)","v":"2001-01-01"},{"$f":"IF('School Info'!$L$10=\"\",\"\",'School Info'!$L$10)","v":"SATURDAY"},{"$f":"IF('School Info'!$M$10=\"\",\"\",'School Info'!$M$10)","v":"10:00AM TO 12:00PM"}]
[{"$f":"IF('School Info'!$J$11=\"\",\"\",'School Info'!$J$11)","v":""},{"$f":"IF('School Info'!$K$11=\"\",\"\",'School Info'!$K$11)","v":"2001-01-02"},{"$f":"IF('School Info'!$L$11=\"\",\"\",'School Info'!$L$11)","v":"SUNDAY"},{"$f":"IF('School Info'!$M$11=\"\",\"\",'School Info'!$M$11)","v":"10:00AM TO 12:00PM"}]
[{"$f":"IF('School Info'!$J$12=\"\",\"\",'School Info'!$J$12)","v":""},{"$f":"IF('School Info'!$K$12=\"\",\"\",'School Info'!$K$12)","v":"2001-01-03"},{"$f":"IF('School Info'!$L$12=\"\",\"\",'School Info'!$L$12)","v":"MONDAY"},{"$f":"IF('School Info'!$M$12=\"\",\"\",'School Info'!$M$12)","v":"10:00AM TO 12:00PM"}]
[{"$f":"IF('School Info'!$J$13=\"\",\"\",'School Info'!$J$13)","v":""},{"$f":"IF('School Info'!$K$13=\"\",\"\",'School Info'!$K$13)","v":"2001-01-04"},{"$f":"IF('School Info'!$L$13=\"\",\"\",'School Info'!$L$13)","v":"TUESDAY"},{"$f":"IF('School Info'!$M$13=\"\",\"\",'School Info'!$M$13)","v":"10:00AM TO 12:00PM"}]
[{"$f":"IF('School Info'!$J$14=\"\",\"\",'School Info'!$J$14)","v":""},{"$f":"IF('School Info'!$K$14=\"\",\"\",'School Info'!$K$14)","v":""},{"$f":"IF('School Info'!$L$14=\"\",\"\",'School Info'!$L$14)","v":""},{"$f":"IF('School Info'!$M$14=\"\",\"\",'School Info'!$M$14)","v":""}]
[]
["Note :"]
["1. परीक्षार्थी अपना प्रवेश पत्र रोजाना साथ लेकर आये | (Candidates should bring their admit card with them daily.)"]
["2. परीक्षार्थी परीक्षा केंद्र पर आधा घंटे पहले पहुचें | (Candidates should reach the examination center half an hour before.)"]
["3. परीक्षार्थी परीक्षा हेतु आवश्यक सामग्री साथ लेकर आवें | (Candidates should bring with them the necessary materials for the examination.)"]
[]
[]
[]
[]
[]
["Sig. Exam Incharge",null,null,null,null,null,"Sig. Principal "]
[]
[{"$f":"IF('School Info'!$B$4=\"\",\"\",'School Info'!$B$4)","v":"Mahatma Gandhi Government School Bar"}]
[null,null,"School Aff. Code :",null,{"$f":"IF('School Info'!$F$5=\"\",\"\",'School Info'!$F$5)","v":123456}]
[null,null,{"$f":"IF('School Info'!$H$5=\"\",\"\",'School Info'!$H$5)","v":"HALF YEARLY EXAM"},null,{"$f":"IF('School Info'!$H$7=\"\",\"\",'School Info'!$H$7)","v":"2025-26"}]
[null,null,"ADMIT CARD",null,null,null,null,null,{"$f":"I630+1","v":21}]
[]
["ROLL NO :  ",{"$f":"VLOOKUP(I663,Student_data,3,0)","v":121},null,"CLASS : ",{"$f":"IF('School Info'!$B$7=\"\",\"\",'School Info'!$B$7)","v":6},"DOB :",{"$f":"VLOOKUP(I663,Student_data,4,0)","v":"2021-01-01"}]
["NAME :  ",{"$f":"VLOOKUP(I663,Student_data,6,0)","v":"RAJ GURUJI"},null,"MEDUIM : ",{"$f":"IF('School Info'!$E$7=\"\",\"\",'School Info'!$E$7)","v":"HINDI"},"GENDER :",{"$f":"VLOOKUP(I663,Student_data,5,0)","v":"MALE"}]
["FATHER :  ",{"$f":"VLOOKUP(I663,Student_data,7,0)","v":"RAJ"},null,"SECTION : ",{"$f":"IF('School Info'!$F$8=\"\",\"\",'School Info'!$F$8)","v":"A"},"S.No. : ",{"$f":"VLOOKUP(I663,Student_data,2,0)","v":0}]
["MOTHER :  ",{"$f":"VLOOKUP(I663,Student_data,8,0)","v":"DEVI"},null,"School DISE Code :",null,{"$f":"IF('School Info'!$B$5=\"\",\"\",'School Info'!$B$5)","v":123456890}]
[]
["SUBJECT","DATE","DAY","TIME "]
[{"$f":"IF('School Info'!$J$5=\"\",\"\",'School Info'!$J$5)","v":"HINDI"},{"$f":"IF('School Info'!$K$5=\"\",\"\",'School Info'!$K$5)","v":"2001-01-01"},{"$f":"IF('School Info'!$L$5=\"\",\"\",'School Info'!$L$5)","v":"MONDAY"},{"$f":"IF('School Info'!$M$5=\"\",\"\",'School Info'!$M$5)","v":"10:00AM TO 12:00PM"}]
[{"$f":"IF('School Info'!$J$6=\"\",\"\",'School Info'!$J$6)","v":"ENGLISH"},{"$f":"IF('School Info'!$K$6=\"\",\"\",'School Info'!$K$6)","v":"2001-01-01"},{"$f":"IF('School Info'!$L$6=\"\",\"\",'School Info'!$L$6)","v":"TUESDAY"},{"$f":"IF('School Info'!$M$6=\"\",\"\",'School Info'!$M$6)","v":"10:00AM TO 12:00PM"}]
[{"$f":"IF('School Info'!$J$7=\"\",\"\",'School Info'!$J$7)","v":"SCIENCE"},{"$f":"IF('School Info'!$K$7=\"\",\"\",'School Info'!$K$7)","v":"2001-01-01"},{"$f":"IF('School Info'!$L$7=\"\",\"\",'School Info'!$L$7)","v":"WEDNESDAY"},{"$f":"IF('School Info'!$M$7=\"\",\"\",'School Info'!$M$7)","v":"10:00AM TO 12:00PM"}]
[{"$f":"IF('School Info'!$J$8=\"\",\"\",'School Info'!$J$8)","v":"MATH"},{"$f":"IF('School Info'!$K$8=\"\",\"\",'School Info'!$K$8)","v":"2001-01-01"},{"$f":"IF('School Info'!$L$8=\"\",\"\",'School Info'!$L$8)","v":"THURSDAY"},{"$f":"IF('School Info'!$M$8=\"\",\"\",'School Info'!$M$8)","v":"10:00AM TO 12:00PM"}]
[{"$f":"IF('School Info'!$J$9=\"\",\"\",'School Info'!$J$9)","v":"SOCIAL SCIENCE"},{"$f":"IF('School Info'!$K$9=\"\",\"\",'School Info'!$K$9)","v":"2001-01-01"},{"$f":"IF('School Info'!$L$9=\"\",\"\",'School Info'!$L$9)","v":"FRIDAY"},{"$f":"IF('School Info'!$M$9=\"\",\"\",'School Info'!$M$9)","v":"10:00AM TO 12:00PM"}]
[{"$f":"IF('School Info'!$J$10=\"\",\"\",'School Info'!$J$10)","v":"SANSKRIT"},{"$f":"IF('School Info'!$K$10=\"\",\"\",'School Info'!$K$10)","v":"2001-01-01"},{"$f":"IF('School Info'!$L$10=\"\",\"\",'School Info'!$L$10)","v":"SATURDAY"},{"$f":"IF('School Info'!$M$10=\"\",\"\",'School Info'!$M$10)","v":"10:00AM TO 12:00PM"}]
[{"$f":"IF('School Info'!$J$11=\"\",\"\",'School Info'!$J$11)","v":""},{"$f":"IF('School Info'!$K$11=\"\",\"\",'School Info'!$K$11)","v":"2001-01-02"},{"$f":"IF('School Info'!$L$11=\"\",\"\",'School Info'!$L$11)","v":"SUNDAY"},{"$f":"IF('School Info'!$M$11=\"\",\"\",'School Info'!$M$11)","v":"10:00AM TO 12:00PM"}]
[{"$f":"IF('School Info'!$J$12=\"\",\"\",'School Info'!$J$12)","v":""},{"$f":"IF('School Info'!$K$12=\"\",\"\",'School Info'!$K$12)","v":"2001-01-03"},{"$f":"IF('School Info'!$L$12=\"\",\"\",'School Info'!$L$12)","v":"MONDAY"},{"$f":"IF('School Info'!$M$12=\"\",\"\",'School Info'!$M$12)","v":"10:00AM TO 12:00PM"}]
[{"$f":"IF('School Info'!$J$13=\"\",\"\",'School Info'!$J$13)","v":""},{"$f":"IF('School Info'!$K$13=\"\",\"\",'School Info'!$K$13)","v":"2001-01-04"},{"$f":"IF('School Info'!$L$13=\"\",\"\",'School Info'!$L$13)","v":"TUESDAY"},{"$f":"IF('School Info'!$M$13=\"\",\"\",'School Info'!$M$13)","v":"10:00AM TO 12:00PM"}]
[{"$f":"IF('School Info'!$J$14=\"\",\"\",'School Info'!$J$14)","v":""},{"$f":"IF('School Info'!$K$14=\"\",\"\",'School Info'!$K$14)","v":""},{"$f":"IF('School Info'!$L$14=\"\",\"\",'School Info'!$L$14)","v":""},{"$f":"IF('School Info'!$M$14=\"\",\"\",'School Info'!$M$14)","v":""}]
[]
["Note :"]
["1. परीक्षार्थी अपना प्रवेश पत्र रोजाना साथ लेकर आये | (Candidates should bring their admit card with them daily.)"]
["2. परीक्षार्थी परीक्षा केंद्र पर आधा घंटे पहले पहुचें | (Candidates should reach the examination center half an hour before.)"]
["3. परीक्षार्थी परीक्षा हेतु आवश्यक सामग्री साथ लेकर आवें | (Candidates should bring with them the necessary materials for the examination.)"]
[]
[]
[]
[]
[]
["Sig. Exam Incharge",null,null,null,null,null,"Sig. Principal "]
[".------------------------------------------------------- Cut Here------------------------------------------------------"]
[{"$f":"IF('School Info'!$B$4=\"\",\"\",'School Info'!$B$4)","v":"Mahatma Gandhi Government School Bar"}]
[null,null,"School Aff. Code :",null,{"$f":"IF('School Info'!$F$5=\"\",\"\",'School Info'!$F$5)","v":123456}]
[null,null,{"$f":"IF('School Info'!$H$5=\"\",\"\",'School Info'!$H$5)","v":"HALF YEARLY EXAM"},null,{"$f":"IF('School Info'!$H$7=\"\",\"\",'School Info'!$H$7)","v":"2025-26"}]
[null,null,"ADMIT CARD",null,null,null,null,null,{"$f":"I663+1","v":22}]
[]
["ROLL NO :  ",{"$f":"VLOOKUP(I696,Student_data,3,0)","v":122},null,"CLASS : ",{"$f":"IF('School Info'!$B$7=\"\",\"\",'School Info'!$B$7)","v":6},"DOB :",{"$f":"VLOOKUP(I696,Student_data,4,0)","v":"2022-01-01"}]
["NAME :  ",{"$f":"VLOOKUP(I696,Student_data,6,0)","v":"MONU"},null,"MEDUIM : ",{"$f":"IF('School Info'!$E$7=\"\",\"\",'School Info'!$E$7)","v":"HINDI"},"GENDER :",{"$f":"VLOOKUP(I696,Student_data,5,0)","v":"MALE"}]
["FATHER :  ",{"$f":"VLOOKUP(I696,Student_data,7,0)","v":"RAAA"},null,"SECTION : ",{"$f":"IF('School Info'!$F$8=\"\",\"\",'School Info'!$F$8)","v":"A"},"S.No. : ",{"$f":"VLOOKUP(I696,Student_data,2,0)","v":0}]
["MOTHER :  ",{"$f":"VLOOKUP(I696,Student_data,8,0)","v":"DDD"},null,"School DISE Code :",null,{"$f":"IF('School Info'!$B$5=\"\",\"\",'School Info'!$B$5)","v":123456890}]
[]
["SUBJECT","DATE","DAY","TIME "]
[{"$f":"IF('School Info'!$J$5=\"\",\"\",'School Info'!$J$5)","v":"HINDI"},{"$f":"IF('School Info'!$K$5=\"\",\"\",'School Info'!$K$5)","v":"2001-01-01"},{"$f":"IF('School Info'!$L$5=\"\",\"\",'School Info'!$L$5)","v":"MONDAY"},{"$f":"IF('School Info'!$M$5=\"\",\"\",'School Info'!$M$5)","v":"10:00AM TO 12:00PM"}]
[{"$f":"IF('School Info'!$J$6=\"\",\"\",'School Info'!$J$6)","v":"ENGLISH"},{"$f":"IF('School Info'!$K$6=\"\",\"\",'School Info'!$K$6)","v":"2001-01-01"},{"$f":"IF('School Info'!$L$6=\"\",\"\",'School Info'!$L$6)","v":"TUESDAY"},{"$f":"IF('School Info'!$M$6=\"\",\"\",'School Info'!$M$6)","v":"10:00AM TO 12:00PM"}]
[{"$f":"IF('School Info'!$J$7=\"\",\"\",'School Info'!$J$7)","v":"SCIENCE"},{"$f":"IF('School Info'!$K$7=\"\",\"\",'School Info'!$K$7)","v":"2001-01-01"},{"$f":"IF('School Info'!$L$7=\"\",\"\",'School Info'!$L$7)","v":"WEDNESDAY"},{"$f":"IF('School Info'!$M$7=\"\",\"\",'School Info'!$M$7)","v":"10:00AM TO 12:00PM"}]
[{"$f":"IF('School Info'!$J$8=\"\",\"\",'School Info'!$J$8)","v":"MATH"},{"$f":"IF('School Info'!$K$8=\"\",\"\",'School Info'!$K$8)","v":"2001-01-01"},{"$f":"IF('School Info'!$L$8=\"\",\"\",'School Info'!$L$8)","v":"THURSDAY"},{"$f":"IF('School Info'!$M$8=\"\",\"\",'School Info'!$M$8)","v":"10:00AM TO 12:00PM"}]
[{"$f":"IF('School Info'!$J$9=\"\",\"\",'School Info'!$J$9)","v":"SOCIAL SCIENCE"},{"$f":"IF('School Info'!$K$9=\"\",\"\",'School Info'!$K$9)","v":"2001-01-01"},{"$f":"IF('School Info'!$L$9=\"\",\"\",'School Info'!$L$9)","v":"FRIDAY"},{"$f":"IF('School Info'!$M$9=\"\",\"\",'School Info'!$M$9)","v":"10:00AM TO 12:00PM"}]
[{"$f":"IF('School Info'!$J$10=\"\",\"\",'School Info'!$J$10)","v":"SANSKRIT"},{"$f":"IF('School Info'!$K$10=\"\",\"\",'School Info'!$K$10)","v":"2001-01-01"},{"$f":"IF('School Info'!$L$10=\"\",\"\",'School Info'!$L$10)","v":"SATURDAY"},{"$f":"IF('School Info'!$M$10=\"\",\"\",'School Info'!$M$10)","v":"10:00AM TO 12:00PM"}]
[{"$f":"IF('School Info'!$J$11=\"\",\"\",'School Info'!$J$11)","v":""},{"$f":"IF('School Info'!$K$11=\"\",\"\",'School Info'!$K$11)","v":"2001-01-02"},{"$f":"IF('School Info'!$L$11=\"\",\"\",'School Info'!$L$11)","v":"SUNDAY"},{"$f":"IF('School Info'!$M$11=\"\",\"\",'School Info'!$M$11)","v":"10:00AM TO 12:00PM"}]
[{"$f":"IF('School Info'!$J$12=\"\",\"\",'School Info'!$J$12)","v":""},{"$f":"IF('School Info'!$K$12=\"\",\"\",'School Info'!$K$12)","v":"2001-01-03"},{"$f":"IF('School Info'!$L$12=\"\",\"\",'School Info'!$L$12)","v":"MONDAY"},{"$f":"IF('School Info'!$M$12=\"\",\"\",'School Info'!$M$12)","v":"10:00AM TO 12:00PM"}]
[{"$f":"IF('School Info'!$J$13=\"\",\"\",'School Info'!$J$13)","v":""},{"$f":"IF('School Info'!$K$13=\"\",\"\",'School Info'!$K$13)","v":"2001-01-04"},{"$f":"IF('School Info'!$L$13=\"\",\"\",'School Info'!$L$13)","v":"TUESDAY"},{"$f":"IF('School Info'!$M$13=\"\",\"\",'School Info'!$M$13)","v":"10:00AM TO 12:00PM"}]
[{"$f":"IF('School Info'!$J$14=\"\",\"\",'School Info'!$J$14)","v":""},{"$f":"IF('School Info'!$K$14=\"\",\"\",'School Info'!$K$14)","v":""},{"$f":"IF('School Info'!$L$14=\"\",\"\",'School Info'!$L$14)","v":""},{"$f":"IF('School Info'!$M$14=\"\",\"\",'School Info'!$M$14)","v":""}]
[]
["Note :"]
["1. परीक्षार्थी अपना प्रवेश पत्र रोजाना साथ लेकर आये | (Candidates should bring their admit card with them daily.)"]
["2. परीक्षार्थी परीक्षा केंद्र पर आधा घंटे पहले पहुचें | (Candidates should reach the examination center half an hour before.)"]
["3. परीक्षार्थी परीक्षा हेतु आवश्यक सामग्री साथ लेकर आवें | (Candidates should bring with them the necessary materials for the examination.)"]
[]
[]
[]
[]
[]
["Sig. Exam Incharge",null,null,null,null,null,"Sig. Principal "]
[]
[{"$f":"IF('School Info'!$B$4=\"\",\"\",'School Info'!$B$4)","v":"Mahatma Gandhi Government School Bar"}]
[null,null,"School Aff. Code :",null,{"$f":"IF('School Info'!$F$5=\"\",\"\",'School Info'!$F$5)","v":123456}]
[null,null,{"$f":"IF('School Info'!$H$5=\"\",\"\",'School Info'!$H$5)","v":"HALF YEARLY EXAM"},null,{"$f":"IF('School Info'!$H$7=\"\",\"\",'School Info'!$H$7)","v":"2025-26"}]
[null,null,"ADMIT CARD",null,null,null,null,null,{"$f":"I696+1","v":23}]
[]
["ROLL NO :  ",{"$f":"VLOOKUP(I729,Student_data,3,0)","v":123},null,"CLASS : ",{"$f":"IF('School Info'!$B$7=\"\",\"\",'School Info'!$B$7)","v":6},"DOB :",{"$f":"VLOOKUP(I729,Student_data,4,0)","v":"2023-01-01"}]
["NAME :  ",{"$f":"VLOOKUP(I729,Student_data,6,0)","v":"SONU"},null,"MEDUIM : ",{"$f":"IF('School Info'!$E$7=\"\",\"\",'School Info'!$E$7)","v":"HINDI"},"GENDER :",{"$f":"VLOOKUP(I729,Student_data,5,0)","v":"MALE"}]
["FATHER :  ",{"$f":"VLOOKUP(I729,Student_data,7,0)","v":"AAA"},null,"SECTION : ",{"$f":"IF('School Info'!$F$8=\"\",\"\",'School Info'!$F$8)","v":"A"},"S.No. : ",{"$f":"VLOOKUP(I729,Student_data,2,0)","v":0}]
["MOTHER :  ",{"$f":"VLOOKUP(I729,Student_data,8,0)","v":"DDS"},null,"School DISE Code :",null,{"$f":"IF('School Info'!$B$5=\"\",\"\",'School Info'!$B$5)","v":123456890}]
[]
["SUBJECT","DATE","DAY","TIME "]
[{"$f":"IF('School Info'!$J$5=\"\",\"\",'School Info'!$J$5)","v":"HINDI"},{"$f":"IF('School Info'!$K$5=\"\",\"\",'School Info'!$K$5)","v":"2001-01-01"},{"$f":"IF('School Info'!$L$5=\"\",\"\",'School Info'!$L$5)","v":"MONDAY"},{"$f":"IF('School Info'!$M$5=\"\",\"\",'School Info'!$M$5)","v":"10:00AM TO 12:00PM"}]
[{"$f":"IF('School Info'!$J$6=\"\",\"\",'School Info'!$J$6)","v":"ENGLISH"},{"$f":"IF('School Info'!$K$6=\"\",\"\",'School Info'!$K$6)","v":"2001-01-01"},{"$f":"IF('School Info'!$L$6=\"\",\"\",'School Info'!$L$6)","v":"TUESDAY"},{"$f":"IF('School Info'!$M$6=\"\",\"\",'School Info'!$M$6)","v":"10:00AM TO 12:00PM"}]
[{"$f":"IF('School Info'!$J$7=\"\",\"\",'School Info'!$J$7)","v":"SCIENCE"},{"$f":"IF('School Info'!$K$7=\"\",\"\",'School Info'!$K$7)","v":"2001-01-01"},{"$f":"IF('School Info'!$L$7=\"\",\"\",'School Info'!$L$7)","v":"WEDNESDAY"},{"$f":"IF('School Info'!$M$7=\"\",\"\",'School Info'!$M$7)","v":"10:00AM TO 12:00PM"}]
[{"$f":"IF('School Info'!$J$8=\"\",\"\",'School Info'!$J$8)","v":"MATH"},{"$f":"IF('School Info'!$K$8=\"\",\"\",'School Info'!$K$8)","v":"2001-01-01"},{"$f":"IF('School Info'!$L$8=\"\",\"\",'School Info'!$L$8)","v":"THURSDAY"},{"$f":"IF('School Info'!$M$8=\"\",\"\",'School Info'!$M$8)","v":"10:00AM TO 12:00PM"}]
[{"$f":"IF('School Info'!$J$9=\"\",\"\",'School Info'!$J$9)","v":"SOCIAL SCIENCE"},{"$f":"IF('School Info'!$K$9=\"\",\"\",'School Info'!$K$9)","v":"2001-01-01"},{"$f":"IF('School Info'!$L$9=\"\",\"\",'School Info'!$L$9)","v":"FRIDAY"},{"$f":"IF('School Info'!$M$9=\"\",\"\",'School Info'!$M$9)","v":"10:00AM TO 12:00PM"}]
[{"$f":"IF('School Info'!$J$10=\"\",\"\",'School Info'!$J$10)","v":"SANSKRIT"},{"$f":"IF('School Info'!$K$10=\"\",\"\",'School Info'!$K$10)","v":"2001-01-01"},{"$f":"IF('School Info'!$L$10=\"\",\"\",'School Info'!$L$10)","v":"SATURDAY"},{"$f":"IF('School Info'!$M$10=\"\",\"\",'School Info'!$M$10)","v":"10:00AM TO 12:00PM"}]
[{"$f":"IF('School Info'!$J$11=\"\",\"\",'School Info'!$J$11)","v":""},{"$f":"IF('School Info'!$K$11=\"\",\"\",'School Info'!$K$11)","v":"2001-01-02"},{"$f":"IF('School Info'!$L$11=\"\",\"\",'School Info'!$L$11)","v":"SUNDAY"},{"$f":"IF('School Info'!$M$11=\"\",\"\",'School Info'!$M$11)","v":"10:00AM TO 12:00PM"}]
[{"$f":"IF('School Info'!$J$12=\"\",\"\",'School Info'!$J$12)","v":""},{"$f":"IF('School Info'!$K$12=\"\",\"\",'School Info'!$K$12)","v":"2001-01-03"},{"$f":"IF('School Info'!$L$12=\"\",\"\",'School Info'!$L$12)","v":"MONDAY"},{"$f":"IF('School Info'!$M$12=\"\",\"\",'School Info'!$M$12)","v":"10:00AM TO 12:00PM"}]
[{"$f":"IF('School Info'!$J$13=\"\",\"\",'School Info'!$J$13)","v":""},{"$f":"IF('School Info'!$K$13=\"\",\"\",'School Info'!$K$13)","v":"2001-01-04"},{"$f":"IF('School Info'!$L$13=\"\",\"\",'School Info'!$L$13)","v":"TUESDAY"},{"$f":"IF('School Info'!$M$13=\"\",\"\",'School Info'!$M$13)","v":"10:00AM TO 12:00PM"}]
[{"$f":"IF('School Info'!$J$14=\"\",\"\",'School Info'!$J$14)","v":""},{"$f":"IF('School Info'!$K$14=\"\",\"\",'School Info'!$K$14)","v":""},{"$f":"IF('School Info'!$L$14=\"\",\"\",'School Info'!$L$14)","v":""},{"$f":"IF('School Info'!$M$14=\"\",\"\",'School Info'!$M$14)","v":""}]
[]
["Note :"]
["1. परीक्षार्थी अपना प्रवेश पत्र रोजाना साथ लेकर आये | (Candidates should bring their admit card with them daily.)"]
["2. परीक्षार्थी परीक्षा केंद्र पर आधा घंटे पहले पहुचें | (Candidates should reach the examination center half an hour before.)"]
["3. परीक्षार्थी परीक्षा हेतु आवश्यक सामग्री साथ लेकर आवें | (Candidates should bring with them the necessary materials for the examination.)"]
[]
[]
[]
[]
[]
["Sig. Exam Incharge",null,null,null,null,null,"Sig. Principal "]
[".------------------------------------------------------- Cut Here------------------------------------------------------"]
[{"$f":"IF('School Info'!$B$4=\"\",\"\",'School Info'!$B$4)","v":"Mahatma Gandhi Government School Bar"}]
[null,null,"School Aff. Code :",null,{"$f":"IF('School Info'!$F$5=\"\",\"\",'School Info'!$F$5)","v":123456}]
[null,null,{"$f":"IF('School Info'!$H$5=\"\",\"\",'School Info'!$H$5)","v":"HALF YEARLY EXAM"},null,{"$f":"IF('School Info'!$H$7=\"\",\"\",'School Info'!$H$7)","v":"2025-26"}]
[null,null,"ADMIT CARD",null,null,null,null,null,{"$f":"I729+1","v":24}]
[]
["ROLL NO :  ",{"$f":"VLOOKUP(I762,Student_data,3,0)","v":124},null,"CLASS : ",{"$f":"IF('School Info'!$B$7=\"\",\"\",'School Info'!$B$7)","v":6},"DOB :",{"$f":"VLOOKUP(I762,Student_data,4,0)","v":"2024-01-01"}]
["NAME :  ",{"$f":"VLOOKUP(I762,Student_data,6,0)","v":"KARNA"},null,"MEDUIM : ",{"$f":"IF('School Info'!$E$7=\"\",\"\",'School Info'!$E$7)","v":"HINDI"},"GENDER :",{"$f":"VLOOKUP(I762,Student_data,5,0)","v":"MALE"}]
["FATHER :  ",{"$f":"VLOOKUP(I762,Student_data,7,0)","v":"BBB"},null,"SECTION : ",{"$f":"IF('School Info'!$F$8=\"\",\"\",'School Info'!$F$8)","v":"A"},"S.No. : ",{"$f":"VLOOKUP(I762,Student_data,2,0)","v":0}]
["MOTHER :  ",{"$f":"VLOOKUP(I762,Student_data,8,0)","v":"SSDDF"},null,"School DISE Code :",null,{"$f":"IF('School Info'!$B$5=\"\",\"\",'School Info'!$B$5)","v":123456890}]
[]
["SUBJECT","DATE","DAY","TIME "]
[{"$f":"IF('School Info'!$J$5=\"\",\"\",'School Info'!$J$5)","v":"HINDI"},{"$f":"IF('School Info'!$K$5=\"\",\"\",'School Info'!$K$5)","v":"2001-01-01"},{"$f":"IF('School Info'!$L$5=\"\",\"\",'School Info'!$L$5)","v":"MONDAY"},{"$f":"IF('School Info'!$M$5=\"\",\"\",'School Info'!$M$5)","v":"10:00AM TO 12:00PM"}]
[{"$f":"IF('School Info'!$J$6=\"\",\"\",'School Info'!$J$6)","v":"ENGLISH"},{"$f":"IF('School Info'!$K$6=\"\",\"\",'School Info'!$K$6)","v":"2001-01-01"},{"$f":"IF('School Info'!$L$6=\"\",\"\",'School Info'!$L$6)","v":"TUESDAY"},{"$f":"IF('School Info'!$M$6=\"\",\"\",'School Info'!$M$6)","v":"10:00AM TO 12:00PM"}]
[{"$f":"IF('School Info'!$J$7=\"\",\"\",'School Info'!$J$7)","v":"SCIENCE"},{"$f":"IF('School Info'!$K$7=\"\",\"\",'School Info'!$K$7)","v":"2001-01-01"},{"$f":"IF('School Info'!$L$7=\"\",\"\",'School Info'!$L$7)","v":"WEDNESDAY"},{"$f":"IF('School Info'!$M$7=\"\",\"\",'School Info'!$M$7)","v":"10:00AM TO 12:00PM"}]
[{"$f":"IF('School Info'!$J$8=\"\",\"\",'School Info'!$J$8)","v":"MATH"},{"$f":"IF('School Info'!$K$8=\"\",\"\",'School Info'!$K$8)","v":"2001-01-01"},{"$f":"IF('School Info'!$L$8=\"\",\"\",'School Info'!$L$8)","v":"THURSDAY"},{"$f":"IF('School Info'!$M$8=\"\",\"\",'School Info'!$M$8)","v":"10:00AM TO 12:00PM"}]
[{"$f":"IF('School Info'!$J$9=\"\",\"\",'School Info'!$J$9)","v":"SOCIAL SCIENCE"},{"$f":"IF('School Info'!$K$9=\"\",\"\",'School Info'!$K$9)","v":"2001-01-01"},{"$f":"IF('School Info'!$L$9=\"\",\"\",'School Info'!$L$9)","v":"FRIDAY"},{"$f":"IF('School Info'!$M$9=\"\",\"\",'School Info'!$M$9)","v":"10:00AM TO 12:00PM"}]
[{"$f":"IF('School Info'!$J$10=\"\",\"\",'School Info'!$J$10)","v":"SANSKRIT"},{"$f":"IF('School Info'!$K$10=\"\",\"\",'School Info'!$K$10)","v":"2001-01-01"},{"$f":"IF('School Info'!$L$10=\"\",\"\",'School Info'!$L$10)","v":"SATURDAY"},{"$f":"IF('School Info'!$M$10=\"\",\"\",'School Info'!$M$10)","v":"10:00AM TO 12:00PM"}]
[{"$f":"IF('School Info'!$J$11=\"\",\"\",'School Info'!$J$11)","v":""},{"$f":"IF('School Info'!$K$11=\"\",\"\",'School Info'!$K$11)","v":"2001-01-02"},{"$f":"IF('School Info'!$L$11=\"\",\"\",'School Info'!$L$11)","v":"SUNDAY"},{"$f":"IF('School Info'!$M$11=\"\",\"\",'School Info'!$M$11)","v":"10:00AM TO 12:00PM"}]
[{"$f":"IF('School Info'!$J$12=\"\",\"\",'School Info'!$J$12)","v":""},{"$f":"IF('School Info'!$K$12=\"\",\"\",'School Info'!$K$12)","v":"2001-01-03"},{"$f":"IF('School Info'!$L$12=\"\",\"\",'School Info'!$L$12)","v":"MONDAY"},{"$f":"IF('School Info'!$M$12=\"\",\"\",'School Info'!$M$12)","v":"10:00AM TO 12:00PM"}]
[{"$f":"IF('School Info'!$J$13=\"\",\"\",'School Info'!$J$13)","v":""},{"$f":"IF('School Info'!$K$13=\"\",\"\",'School Info'!$K$13)","v":"2001-01-04"},{"$f":"IF('School Info'!$L$13=\"\",\"\",'School Info'!$L$13)","v":"TUESDAY"},{"$f":"IF('School Info'!$M$13=\"\",\"\",'School Info'!$M$13)","v":"10:00AM TO 12:00PM"}]
[{"$f":"IF('School Info'!$J$14=\"\",\"\",'School Info'!$J$14)","v":""},{"$f":"IF('School Info'!$K$14=\"\",\"\",'School Info'!$K$14)","v":""},{"$f":"IF('School Info'!$L$14=\"\",\"\",'School Info'!$L$14)","v":""},{"$f":"IF('School Info'!$M$14=\"\",\"\",'School Info'!$M$14)","v":""}]
[]
["Note :"]
["1. परीक्षार्थी अपना प्रवेश पत्र रोजाना साथ लेकर आये | (Candidates should bring their admit card with them daily.)"]
["2. परीक्षार्थी परीक्षा केंद्र पर आधा घंटे पहले पहुचें | (Candidates should reach the examination center half an hour before.)"]
["3. परीक्षार्थी परीक्षा हेतु आवश्यक सामग्री साथ लेकर आवें | (Candidates should bring with them the necessary materials for the examination.)"]
[]
[]
[]
[]
[]
["Sig. Exam Incharge",null,null,null,null,null,"Sig. Principal "]
[]
[{"$f":"IF('School Info'!$B$4=\"\",\"\",'School Info'!$B$4)","v":"Mahatma Gandhi Government School Bar"}]
[null,null,"School Aff. Code :",null,{"$f":"IF('School Info'!$F$5=\"\",\"\",'School Info'!$F$5)","v":123456}]
[null,null,{"$f":"IF('School Info'!$H$5=\"\",\"\",'School Info'!$H$5)","v":"HALF YEARLY EXAM"},null,{"$f":"IF('School Info'!$H$7=\"\",\"\",'School Info'!$H$7)","v":"2025-26"}]
[null,null,"ADMIT CARD",null,null,null,null,null,{"$f":"I762+1","v":25}]
[]
["ROLL NO :  ",{"$f":"VLOOKUP(I795,Student_data,3,0)","v":125},null,"CLASS : ",{"$f":"IF('School Info'!$B$7=\"\",\"\",'School Info'!$B$7)","v":6},"DOB :",{"$f":"VLOOKUP(I795,Student_data,4,0)","v":"2025-01-01"}]
["NAME :  ",{"$f":"VLOOKUP(I795,Student_data,6,0)","v":"RAJA  "},null,"MEDUIM : ",{"$f":"IF('School Info'!$E$7=\"\",\"\",'School Info'!$E$7)","v":"HINDI"},"GENDER :",{"$f":"VLOOKUP(I795,Student_data,5,0)","v":"MALE"}]
["FATHER :  ",{"$f":"VLOOKUP(I795,Student_data,7,0)","v":"DFD"},null,"SECTION : ",{"$f":"IF('School Info'!$F$8=\"\",\"\",'School Info'!$F$8)","v":"A"},"S.No. : ",{"$f":"VLOOKUP(I795,Student_data,2,0)","v":0}]
["MOTHER :  ",{"$f":"VLOOKUP(I795,Student_data,8,0)","v":"GAG"},null,"School DISE Code :",null,{"$f":"IF('School Info'!$B$5=\"\",\"\",'School Info'!$B$5)","v":123456890}]
[]
["SUBJECT","DATE","DAY","TIME "]
[{"$f":"IF('School Info'!$J$5=\"\",\"\",'School Info'!$J$5)","v":"HINDI"},{"$f":"IF('School Info'!$K$5=\"\",\"\",'School Info'!$K$5)","v":"2001-01-01"},{"$f":"IF('School Info'!$L$5=\"\",\"\",'School Info'!$L$5)","v":"MONDAY"},{"$f":"IF('School Info'!$M$5=\"\",\"\",'School Info'!$M$5)","v":"10:00AM TO 12:00PM"}]
[{"$f":"IF('School Info'!$J$6=\"\",\"\",'School Info'!$J$6)","v":"ENGLISH"},{"$f":"IF('School Info'!$K$6=\"\",\"\",'School Info'!$K$6)","v":"2001-01-01"},{"$f":"IF('School Info'!$L$6=\"\",\"\",'School Info'!$L$6)","v":"TUESDAY"},{"$f":"IF('School Info'!$M$6=\"\",\"\",'School Info'!$M$6)","v":"10:00AM TO 12:00PM"}]
[{"$f":"IF('School Info'!$J$7=\"\",\"\",'School Info'!$J$7)","v":"SCIENCE"},{"$f":"IF('School Info'!$K$7=\"\",\"\",'School Info'!$K$7)","v":"2001-01-01"},{"$f":"IF('School Info'!$L$7=\"\",\"\",'School Info'!$L$7)","v":"WEDNESDAY"},{"$f":"IF('School Info'!$M$7=\"\",\"\",'School Info'!$M$7)","v":"10:00AM TO 12:00PM"}]
[{"$f":"IF('School Info'!$J$8=\"\",\"\",'School Info'!$J$8)","v":"MATH"},{"$f":"IF('School Info'!$K$8=\"\",\"\",'School Info'!$K$8)","v":"2001-01-01"},{"$f":"IF('School Info'!$L$8=\"\",\"\",'School Info'!$L$8)","v":"THURSDAY"},{"$f":"IF('School Info'!$M$8=\"\",\"\",'School Info'!$M$8)","v":"10:00AM TO 12:00PM"}]
[{"$f":"IF('School Info'!$J$9=\"\",\"\",'School Info'!$J$9)","v":"SOCIAL SCIENCE"},{"$f":"IF('School Info'!$K$9=\"\",\"\",'School Info'!$K$9)","v":"2001-01-01"},{"$f":"IF('School Info'!$L$9=\"\",\"\",'School Info'!$L$9)","v":"FRIDAY"},{"$f":"IF('School Info'!$M$9=\"\",\"\",'School Info'!$M$9)","v":"10:00AM TO 12:00PM"}]
[{"$f":"IF('School Info'!$J$10=\"\",\"\",'School Info'!$J$10)","v":"SANSKRIT"},{"$f":"IF('School Info'!$K$10=\"\",\"\",'School Info'!$K$10)","v":"2001-01-01"},{"$f":"IF('School Info'!$L$10=\"\",\"\",'School Info'!$L$10)","v":"SATURDAY"},{"$f":"IF('School Info'!$M$10=\"\",\"\",'School Info'!$M$10)","v":"10:00AM TO 12:00PM"}]
[{"$f":"IF('School Info'!$J$11=\"\",\"\",'School Info'!$J$11)","v":""},{"$f":"IF('School Info'!$K$11=\"\",\"\",'School Info'!$K$11)","v":"2001-01-02"},{"$f":"IF('School Info'!$L$11=\"\",\"\",'School Info'!$L$11)","v":"SUNDAY"},{"$f":"IF('School Info'!$M$11=\"\",\"\",'School Info'!$M$11)","v":"10:00AM TO 12:00PM"}]
[{"$f":"IF('School Info'!$J$12=\"\",\"\",'School Info'!$J$12)","v":""},{"$f":"IF('School Info'!$K$12=\"\",\"\",'School Info'!$K$12)","v":"2001-01-03"},{"$f":"IF('School Info'!$L$12=\"\",\"\",'School Info'!$L$12)","v":"MONDAY"},{"$f":"IF('School Info'!$M$12=\"\",\"\",'School Info'!$M$12)","v":"10:00AM TO 12:00PM"}]
[{"$f":"IF('School Info'!$J$13=\"\",\"\",'School Info'!$J$13)","v":""},{"$f":"IF('School Info'!$K$13=\"\",\"\",'School Info'!$K$13)","v":"2001-01-04"},{"$f":"IF('School Info'!$L$13=\"\",\"\",'School Info'!$L$13)","v":"TUESDAY"},{"$f":"IF('School Info'!$M$13=\"\",\"\",'School Info'!$M$13)","v":"10:00AM TO 12:00PM"}]
[{"$f":"IF('School Info'!$J$14=\"\",\"\",'School Info'!$J$14)","v":""},{"$f":"IF('School Info'!$K$14=\"\",\"\",'School Info'!$K$14)","v":""},{"$f":"IF('School Info'!$L$14=\"\",\"\",'School Info'!$L$14)","v":""},{"$f":"IF('School Info'!$M$14=\"\",\"\",'School Info'!$M$14)","v":""}]
[]
["Note :"]
["1. परीक्षार्थी अपना प्रवेश पत्र रोजाना साथ लेकर आये | (Candidates should bring their admit card with them daily.)"]
["2. परीक्षार्थी परीक्षा केंद्र पर आधा घंटे पहले पहुचें | (Candidates should reach the examination center half an hour before.)"]
["3. परीक्षार्थी परीक्षा हेतु आवश्यक सामग्री साथ लेकर आवें | (Candidates should bring with them the necessary materials for the examination.)"]
[]
[]
[]
[]
[]
["Sig. Exam Incharge",null,null,null,null,null,"Sig. Principal "]
[".------------------------------------------------------- Cut Here------------------------------------------------------"]
[{"$f":"IF('School Info'!$B$4=\"\",\"\",'School Info'!$B$4)","v":"Mahatma Gandhi Government School Bar"}]
[null,null,"School Aff. Code :",null,{"$f":"IF('School Info'!$F$5=\"\",\"\",'School Info'!$F$5)","v":123456}]
[null,null,{"$f":"IF('School Info'!$H$5=\"\",\"\",'School Info'!$H$5)","v":"HALF YEARLY EXAM"},null,{"$f":"IF('School Info'!$H$7=\"\",\"\",'School Info'!$H$7)","v":"2025-26"}]
[null,null,"ADMIT CARD",null,null,null,null,null,{"$f":"I795+1","v":26}]
[]
["ROLL NO :  ",{"$f":"VLOOKUP(I828,Student_data,3,0)","v":126},null,"CLASS : ",{"$f":"IF('School Info'!$B$7=\"\",\"\",'School Info'!$B$7)","v":6},"DOB :",{"$f":"VLOOKUP(I828,Student_data,4,0)","v":"2026-01-01"}]
["NAME :  ",{"$f":"VLOOKUP(I828,Student_data,6,0)","v":"RAJ GURUJI"},null,"MEDUIM : ",{"$f":"IF('School Info'!$E$7=\"\",\"\",'School Info'!$E$7)","v":"HINDI"},"GENDER :",{"$f":"VLOOKUP(I828,Student_data,5,0)","v":"MALE"}]
["FATHER :  ",{"$f":"VLOOKUP(I828,Student_data,7,0)","v":"RAJ"},null,"SECTION : ",{"$f":"IF('School Info'!$F$8=\"\",\"\",'School Info'!$F$8)","v":"A"},"S.No. : ",{"$f":"VLOOKUP(I828,Student_data,2,0)","v":0}]
["MOTHER :  ",{"$f":"VLOOKUP(I828,Student_data,8,0)","v":"DEVI"},null,"School DISE Code :",null,{"$f":"IF('School Info'!$B$5=\"\",\"\",'School Info'!$B$5)","v":123456890}]
[]
["SUBJECT","DATE","DAY","TIME "]
[{"$f":"IF('School Info'!$J$5=\"\",\"\",'School Info'!$J$5)","v":"HINDI"},{"$f":"IF('School Info'!$K$5=\"\",\"\",'School Info'!$K$5)","v":"2001-01-01"},{"$f":"IF('School Info'!$L$5=\"\",\"\",'School Info'!$L$5)","v":"MONDAY"},{"$f":"IF('School Info'!$M$5=\"\",\"\",'School Info'!$M$5)","v":"10:00AM TO 12:00PM"}]
[{"$f":"IF('School Info'!$J$6=\"\",\"\",'School Info'!$J$6)","v":"ENGLISH"},{"$f":"IF('School Info'!$K$6=\"\",\"\",'School Info'!$K$6)","v":"2001-01-01"},{"$f":"IF('School Info'!$L$6=\"\",\"\",'School Info'!$L$6)","v":"TUESDAY"},{"$f":"IF('School Info'!$M$6=\"\",\"\",'School Info'!$M$6)","v":"10:00AM TO 12:00PM"}]
[{"$f":"IF('School Info'!$J$7=\"\",\"\",'School Info'!$J$7)","v":"SCIENCE"},{"$f":"IF('School Info'!$K$7=\"\",\"\",'School Info'!$K$7)","v":"2001-01-01"},{"$f":"IF('School Info'!$L$7=\"\",\"\",'School Info'!$L$7)","v":"WEDNESDAY"},{"$f":"IF('School Info'!$M$7=\"\",\"\",'School Info'!$M$7)","v":"10:00AM TO 12:00PM"}]
[{"$f":"IF('School Info'!$J$8=\"\",\"\",'School Info'!$J$8)","v":"MATH"},{"$f":"IF('School Info'!$K$8=\"\",\"\",'School Info'!$K$8)","v":"2001-01-01"},{"$f":"IF('School Info'!$L$8=\"\",\"\",'School Info'!$L$8)","v":"THURSDAY"},{"$f":"IF('School Info'!$M$8=\"\",\"\",'School Info'!$M$8)","v":"10:00AM TO 12:00PM"}]
[{"$f":"IF('School Info'!$J$9=\"\",\"\",'School Info'!$J$9)","v":"SOCIAL SCIENCE"},{"$f":"IF('School Info'!$K$9=\"\",\"\",'School Info'!$K$9)","v":"2001-01-01"},{"$f":"IF('School Info'!$L$9=\"\",\"\",'School Info'!$L$9)","v":"FRIDAY"},{"$f":"IF('School Info'!$M$9=\"\",\"\",'School Info'!$M$9)","v":"10:00AM TO 12:00PM"}]
[{"$f":"IF('School Info'!$J$10=\"\",\"\",'School Info'!$J$10)","v":"SANSKRIT"},{"$f":"IF('School Info'!$K$10=\"\",\"\",'School Info'!$K$10)","v":"2001-01-01"},{"$f":"IF('School Info'!$L$10=\"\",\"\",'School Info'!$L$10)","v":"SATURDAY"},{"$f":"IF('School Info'!$M$10=\"\",\"\",'School Info'!$M$10)","v":"10:00AM TO 12:00PM"}]
[{"$f":"IF('School Info'!$J$11=\"\",\"\",'School Info'!$J$11)","v":""},{"$f":"IF('School Info'!$K$11=\"\",\"\",'School Info'!$K$11)","v":"2001-01-02"},{"$f":"IF('School Info'!$L$11=\"\",\"\",'School Info'!$L$11)","v":"SUNDAY"},{"$f":"IF('School Info'!$M$11=\"\",\"\",'School Info'!$M$11)","v":"10:00AM TO 12:00PM"}]
[{"$f":"IF('School Info'!$J$12=\"\",\"\",'School Info'!$J$12)","v":""},{"$f":"IF('School Info'!$K$12=\"\",\"\",'School Info'!$K$12)","v":"2001-01-03"},{"$f":"IF('School Info'!$L$12=\"\",\"\",'School Info'!$L$12)","v":"MONDAY"},{"$f":"IF('School Info'!$M$12=\"\",\"\",'School Info'!$M$12)","v":"10:00AM TO 12:00PM"}]
[{"$f":"IF('School Info'!$J$13=\"\",\"\",'School Info'!$J$13)","v":""},{"$f":"IF('School Info'!$K$13=\"\",\"\",'School Info'!$K$13)","v":"2001-01-04"},{"$f":"IF('School Info'!$L$13=\"\",\"\",'School Info'!$L$13)","v":"TUESDAY"},{"$f":"IF('School Info'!$M$13=\"\",\"\",'School Info'!$M$13)","v":"10:00AM TO 12:00PM"}]
[{"$f":"IF('School Info'!$J$14=\"\",\"\",'School Info'!$J$14)","v":""},{"$f":"IF('School Info'!$K$14=\"\",\"\",'School Info'!$K$14)","v":""},{"$f":"IF('School Info'!$L$14=\"\",\"\",'School Info'!$L$14)","v":""},{"$f":"IF('School Info'!$M$14=\"\",\"\",'School Info'!$M$14)","v":""}]
[]
["Note :"]
["1. परीक्षार्थी अपना प्रवेश पत्र रोजाना साथ लेकर आये | (Candidates should bring their admit card with them daily.)"]
["2. परीक्षार्थी परीक्षा केंद्र पर आधा घंटे पहले पहुचें | (Candidates should reach the examination center half an hour before.)"]
["3. परीक्षार्थी परीक्षा हेतु आवश्यक सामग्री साथ लेकर आवें | (Candidates should bring with them the necessary materials for the examination.)"]
[]
[]
[]
[]
[]
["Sig. Exam Incharge",null,null,null,null,null,"Sig. Principal "]
[]
[{"$f":"IF('School Info'!$B$4=\"\",\"\",'School Info'!$B$4)","v":"Mahatma Gandhi Government School Bar"}]
[null,null,"School Aff. Code :",null,{"$f":"IF('School Info'!$F$5=\"\",\"\",'School Info'!$F$5)","v":123456}]
[null,null,{"$f":"IF('School Info'!$H$5=\"\",\"\",'School Info'!$H$5)","v":"HALF YEARLY EXAM"},null,{"$f":"IF('School Info'!$H$7=\"\",\"\",'School Info'!$H$7)","v":"2025-26"}]
[null,null,"ADMIT CARD",null,null,null,null,null,{"$f":"I828+1","v":27}]
[]
["ROLL NO :  ",{"$f":"VLOOKUP(I861,Student_data,3,0)","v":127},null,"CLASS : ",{"$f":"IF('School Info'!$B$7=\"\",\"\",'School Info'!$B$7)","v":6},"DOB :",{"$f":"VLOOKUP(I861,Student_data,4,0)","v":"2027-01-01"}]
["NAME :  ",{"$f":"VLOOKUP(I861,Student_data,6,0)","v":"ggggggggg"},null,"MEDUIM : ",{"$f":"IF('School Info'!$E$7=\"\",\"\",'School Info'!$E$7)","v":"HINDI"},"GENDER :",{"$f":"VLOOKUP(I861,Student_data,5,0)","v":"MALE"}]
["FATHER :  ",{"$f":"VLOOKUP(I861,Student_data,7,0)","v":"RAAA"},null,"SECTION : ",{"$f":"IF('School Info'!$F$8=\"\",\"\",'School Info'!$F$8)","v":"A"},"S.No. : ",{"$f":"VLOOKUP(I861,Student_data,2,0)","v":0}]
["MOTHER :  ",{"$f":"VLOOKUP(I861,Student_data,8,0)","v":"DDD"},null,"School DISE Code :",null,{"$f":"IF('School Info'!$B$5=\"\",\"\",'School Info'!$B$5)","v":123456890}]
[]
["SUBJECT","DATE","DAY","TIME "]
[{"$f":"IF('School Info'!$J$5=\"\",\"\",'School Info'!$J$5)","v":"HINDI"},{"$f":"IF('School Info'!$K$5=\"\",\"\",'School Info'!$K$5)","v":"2001-01-01"},{"$f":"IF('School Info'!$L$5=\"\",\"\",'School Info'!$L$5)","v":"MONDAY"},{"$f":"IF('School Info'!$M$5=\"\",\"\",'School Info'!$M$5)","v":"10:00AM TO 12:00PM"}]
[{"$f":"IF('School Info'!$J$6=\"\",\"\",'School Info'!$J$6)","v":"ENGLISH"},{"$f":"IF('School Info'!$K$6=\"\",\"\",'School Info'!$K$6)","v":"2001-01-01"},{"$f":"IF('School Info'!$L$6=\"\",\"\",'School Info'!$L$6)","v":"TUESDAY"},{"$f":"IF('School Info'!$M$6=\"\",\"\",'School Info'!$M$6)","v":"10:00AM TO 12:00PM"}]
[{"$f":"IF('School Info'!$J$7=\"\",\"\",'School Info'!$J$7)","v":"SCIENCE"},{"$f":"IF('School Info'!$K$7=\"\",\"\",'School Info'!$K$7)","v":"2001-01-01"},{"$f":"IF('School Info'!$L$7=\"\",\"\",'School Info'!$L$7)","v":"WEDNESDAY"},{"$f":"IF('School Info'!$M$7=\"\",\"\",'School Info'!$M$7)","v":"10:00AM TO 12:00PM"}]
[{"$f":"IF('School Info'!$J$8=\"\",\"\",'School Info'!$J$8)","v":"MATH"},{"$f":"IF('School Info'!$K$8=\"\",\"\",'School Info'!$K$8)","v":"2001-01-01"},{"$f":"IF('School Info'!$L$8=\"\",\"\",'School Info'!$L$8)","v":"THURSDAY"},{"$f":"IF('School Info'!$M$8=\"\",\"\",'School Info'!$M$8)","v":"10:00AM TO 12:00PM"}]
[{"$f":"IF('School Info'!$J$9=\"\",\"\",'School Info'!$J$9)","v":"SOCIAL SCIENCE"},{"$f":"IF('School Info'!$K$9=\"\",\"\",'School Info'!$K$9)","v":"2001-01-01"},{"$f":"IF('School Info'!$L$9=\"\",\"\",'School Info'!$L$9)","v":"FRIDAY"},{"$f":"IF('School Info'!$M$9=\"\",\"\",'School Info'!$M$9)","v":"10:00AM TO 12:00PM"}]
[{"$f":"IF('School Info'!$J$10=\"\",\"\",'School Info'!$J$10)","v":"SANSKRIT"},{"$f":"IF('School Info'!$K$10=\"\",\"\",'School Info'!$K$10)","v":"2001-01-01"},{"$f":"IF('School Info'!$L$10=\"\",\"\",'School Info'!$L$10)","v":"SATURDAY"},{"$f":"IF('School Info'!$M$10=\"\",\"\",'School Info'!$M$10)","v":"10:00AM TO 12:00PM"}]
[{"$f":"IF('School Info'!$J$11=\"\",\"\",'School Info'!$J$11)","v":""},{"$f":"IF('School Info'!$K$11=\"\",\"\",'School Info'!$K$11)","v":"2001-01-02"},{"$f":"IF('School Info'!$L$11=\"\",\"\",'School Info'!$L$11)","v":"SUNDAY"},{"$f":"IF('School Info'!$M$11=\"\",\"\",'School Info'!$M$11)","v":"10:00AM TO 12:00PM"}]
[{"$f":"IF('School Info'!$J$12=\"\",\"\",'School Info'!$J$12)","v":""},{"$f":"IF('School Info'!$K$12=\"\",\"\",'School Info'!$K$12)","v":"2001-01-03"},{"$f":"IF('School Info'!$L$12=\"\",\"\",'School Info'!$L$12)","v":"MONDAY"},{"$f":"IF('School Info'!$M$12=\"\",\"\",'School Info'!$M$12)","v":"10:00AM TO 12:00PM"}]
[{"$f":"IF('School Info'!$J$13=\"\",\"\",'School Info'!$J$13)","v":""},{"$f":"IF('School Info'!$K$13=\"\",\"\",'School Info'!$K$13)","v":"2001-01-04"},{"$f":"IF('School Info'!$L$13=\"\",\"\",'School Info'!$L$13)","v":"TUESDAY"},{"$f":"IF('School Info'!$M$13=\"\",\"\",'School Info'!$M$13)","v":"10:00AM TO 12:00PM"}]
[{"$f":"IF('School Info'!$J$14=\"\",\"\",'School Info'!$J$14)","v":""},{"$f":"IF('School Info'!$K$14=\"\",\"\",'School Info'!$K$14)","v":""},{"$f":"IF('School Info'!$L$14=\"\",\"\",'School Info'!$L$14)","v":""},{"$f":"IF('School Info'!$M$14=\"\",\"\",'School Info'!$M$14)","v":""}]
[]
["Note :"]
["1. परीक्षार्थी अपना प्रवेश पत्र रोजाना साथ लेकर आये | (Candidates should bring their admit card with them daily.)"]
["2. परीक्षार्थी परीक्षा केंद्र पर आधा घंटे पहले पहुचें | (Candidates should reach the examination center half an hour before.)"]
["3. परीक्षार्थी परीक्षा हेतु आवश्यक सामग्री साथ लेकर आवें | (Candidates should bring with them the necessary materials for the examination.)"]
[]
[]
[]
[]
[]
["Sig. Exam Incharge",null,null,null,null,null,"Sig. Principal "]
[".------------------------------------------------------- Cut Here------------------------------------------------------"]
[{"$f":"IF('School Info'!$B$4=\"\",\"\",'School Info'!$B$4)","v":"Mahatma Gandhi Government School Bar"}]
[null,null,"School Aff. Code :",null,{"$f":"IF('School Info'!$F$5=\"\",\"\",'School Info'!$F$5)","v":123456}]
[null,null,{"$f":"IF('School Info'!$H$5=\"\",\"\",'School Info'!$H$5)","v":"HALF YEARLY EXAM"},null,{"$f":"IF('School Info'!$H$7=\"\",\"\",'School Info'!$H$7)","v":"2025-26"}]
[null,null,"ADMIT CARD",null,null,null,null,null,{"$f":"I861+1","v":28}]
[]
["ROLL NO :  ",{"$f":"VLOOKUP(I894,Student_data,3,0)","v":128},null,"CLASS : ",{"$f":"IF('School Info'!$B$7=\"\",\"\",'School Info'!$B$7)","v":6},"DOB :",{"$f":"VLOOKUP(I894,Student_data,4,0)","v":"2028-01-01"}]
["NAME :  ",{"$f":"VLOOKUP(I894,Student_data,6,0)","v":"SONU"},null,"MEDUIM : ",{"$f":"IF('School Info'!$E$7=\"\",\"\",'School Info'!$E$7)","v":"HINDI"},"GENDER :",{"$f":"VLOOKUP(I894,Student_data,5,0)","v":"MALE"}]
["FATHER :  ",{"$f":"VLOOKUP(I894,Student_data,7,0)","v":"AAA"},null,"SECTION : ",{"$f":"IF('School Info'!$F$8=\"\",\"\",'School Info'!$F$8)","v":"A"},"S.No. : ",{"$f":"VLOOKUP(I894,Student_data,2,0)","v":0}]
["MOTHER :  ",{"$f":"VLOOKUP(I894,Student_data,8,0)","v":"DDS"},null,"School DISE Code :",null,{"$f":"IF('School Info'!$B$5=\"\",\"\",'School Info'!$B$5)","v":123456890}]
[]
["SUBJECT","DATE","DAY","TIME "]
[{"$f":"IF('School Info'!$J$5=\"\",\"\",'School Info'!$J$5)","v":"HINDI"},{"$f":"IF('School Info'!$K$5=\"\",\"\",'School Info'!$K$5)","v":"2001-01-01"},{"$f":"IF('School Info'!$L$5=\"\",\"\",'School Info'!$L$5)","v":"MONDAY"},{"$f":"IF('School Info'!$M$5=\"\",\"\",'School Info'!$M$5)","v":"10:00AM TO 12:00PM"}]
[{"$f":"IF('School Info'!$J$6=\"\",\"\",'School Info'!$J$6)","v":"ENGLISH"},{"$f":"IF('School Info'!$K$6=\"\",\"\",'School Info'!$K$6)","v":"2001-01-01"},{"$f":"IF('School Info'!$L$6=\"\",\"\",'School Info'!$L$6)","v":"TUESDAY"},{"$f":"IF('School Info'!$M$6=\"\",\"\",'School Info'!$M$6)","v":"10:00AM TO 12:00PM"}]
[{"$f":"IF('School Info'!$J$7=\"\",\"\",'School Info'!$J$7)","v":"SCIENCE"},{"$f":"IF('School Info'!$K$7=\"\",\"\",'School Info'!$K$7)","v":"2001-01-01"},{"$f":"IF('School Info'!$L$7=\"\",\"\",'School Info'!$L$7)","v":"WEDNESDAY"},{"$f":"IF('School Info'!$M$7=\"\",\"\",'School Info'!$M$7)","v":"10:00AM TO 12:00PM"}]
[{"$f":"IF('School Info'!$J$8=\"\",\"\",'School Info'!$J$8)","v":"MATH"},{"$f":"IF('School Info'!$K$8=\"\",\"\",'School Info'!$K$8)","v":"2001-01-01"},{"$f":"IF('School Info'!$L$8=\"\",\"\",'School Info'!$L$8)","v":"THURSDAY"},{"$f":"IF('School Info'!$M$8=\"\",\"\",'School Info'!$M$8)","v":"10:00AM TO 12:00PM"}]
[{"$f":"IF('School Info'!$J$9=\"\",\"\",'School Info'!$J$9)","v":"SOCIAL SCIENCE"},{"$f":"IF('School Info'!$K$9=\"\",\"\",'School Info'!$K$9)","v":"2001-01-01"},{"$f":"IF('School Info'!$L$9=\"\",\"\",'School Info'!$L$9)","v":"FRIDAY"},{"$f":"IF('School Info'!$M$9=\"\",\"\",'School Info'!$M$9)","v":"10:00AM TO 12:00PM"}]
[{"$f":"IF('School Info'!$J$10=\"\",\"\",'School Info'!$J$10)","v":"SANSKRIT"},{"$f":"IF('School Info'!$K$10=\"\",\"\",'School Info'!$K$10)","v":"2001-01-01"},{"$f":"IF('School Info'!$L$10=\"\",\"\",'School Info'!$L$10)","v":"SATURDAY"},{"$f":"IF('School Info'!$M$10=\"\",\"\",'School Info'!$M$10)","v":"10:00AM TO 12:00PM"}]
[{"$f":"IF('School Info'!$J$11=\"\",\"\",'School Info'!$J$11)","v":""},{"$f":"IF('School Info'!$K$11=\"\",\"\",'School Info'!$K$11)","v":"2001-01-02"},{"$f":"IF('School Info'!$L$11=\"\",\"\",'School Info'!$L$11)","v":"SUNDAY"},{"$f":"IF('School Info'!$M$11=\"\",\"\",'School Info'!$M$11)","v":"10:00AM TO 12:00PM"}]
[{"$f":"IF('School Info'!$J$12=\"\",\"\",'School Info'!$J$12)","v":""},{"$f":"IF('School Info'!$K$12=\"\",\"\",'School Info'!$K$12)","v":"2001-01-03"},{"$f":"IF('School Info'!$L$12=\"\",\"\",'School Info'!$L$12)","v":"MONDAY"},{"$f":"IF('School Info'!$M$12=\"\",\"\",'School Info'!$M$12)","v":"10:00AM TO 12:00PM"}]
[{"$f":"IF('School Info'!$J$13=\"\",\"\",'School Info'!$J$13)","v":""},{"$f":"IF('School Info'!$K$13=\"\",\"\",'School Info'!$K$13)","v":"2001-01-04"},{"$f":"IF('School Info'!$L$13=\"\",\"\",'School Info'!$L$13)","v":"TUESDAY"},{"$f":"IF('School Info'!$M$13=\"\",\"\",'School Info'!$M$13)","v":"10:00AM TO 12:00PM"}]
[{"$f":"IF('School Info'!$J$14=\"\",\"\",'School Info'!$J$14)","v":""},{"$f":"IF('School Info'!$K$14=\"\",\"\",'School Info'!$K$14)","v":""},{"$f":"IF('School Info'!$L$14=\"\",\"\",'School Info'!$L$14)","v":""},{"$f":"IF('School Info'!$M$14=\"\",\"\",'School Info'!$M$14)","v":""}]
[]
["Note :"]
["1. परीक्षार्थी अपना प्रवेश पत्र रोजाना साथ लेकर आये | (Candidates should bring their admit card with them daily.)"]
["2. परीक्षार्थी परीक्षा केंद्र पर आधा घंटे पहले पहुचें | (Candidates should reach the examination center half an hour before.)"]
["3. परीक्षार्थी परीक्षा हेतु आवश्यक सामग्री साथ लेकर आवें | (Candidates should bring with them the necessary materials for the examination.)"]
[]
[]
[]
[]
[]
["Sig. Exam Incharge",null,null,null,null,null,"Sig. Principal "]
[]
[{"$f":"IF('School Info'!$B$4=\"\",\"\",'School Info'!$B$4)","v":"Mahatma Gandhi Government School Bar"}]
[null,null,"School Aff. Code :",null,{"$f":"IF('School Info'!$F$5=\"\",\"\",'School Info'!$F$5)","v":123456}]
[null,null,{"$f":"IF('School Info'!$H$5=\"\",\"\",'School Info'!$H$5)","v":"HALF YEARLY EXAM"},null,{"$f":"IF('School Info'!$H$7=\"\",\"\",'School Info'!$H$7)","v":"2025-26"}]
[null,null,"ADMIT CARD",null,null,null,null,null,{"$f":"I894+1","v":29}]
[]
["ROLL NO :  ",{"$f":"VLOOKUP(I927,Student_data,3,0)","v":129},null,"CLASS : ",{"$f":"IF('School Info'!$B$7=\"\",\"\",'School Info'!$B$7)","v":6},"DOB :",{"$f":"VLOOKUP(I927,Student_data,4,0)","v":"2029-01-01"}]
["NAME :  ",{"$f":"VLOOKUP(I927,Student_data,6,0)","v":"KARNA"},null,"MEDUIM : ",{"$f":"IF('School Info'!$E$7=\"\",\"\",'School Info'!$E$7)","v":"HINDI"},"GENDER :",{"$f":"VLOOKUP(I927,Student_data,5,0)","v":"MALE"}]
["FATHER :  ",{"$f":"VLOOKUP(I927,Student_data,7,0)","v":"BBB"},null,"SECTION : ",{"$f":"IF('School Info'!$F$8=\"\",\"\",'School Info'!$F$8)","v":"A"},"S.No. : ",{"$f":"VLOOKUP(I927,Student_data,2,0)","v":0}]
["MOTHER :  ",{"$f":"VLOOKUP(I927,Student_data,8,0)","v":"SSDDF"},null,"School DISE Code :",null,{"$f":"IF('School Info'!$B$5=\"\",\"\",'School Info'!$B$5)","v":123456890}]
[]
["SUBJECT","DATE","DAY","TIME "]
[{"$f":"IF('School Info'!$J$5=\"\",\"\",'School Info'!$J$5)","v":"HINDI"},{"$f":"IF('School Info'!$K$5=\"\",\"\",'School Info'!$K$5)","v":"2001-01-01"},{"$f":"IF('School Info'!$L$5=\"\",\"\",'School Info'!$L$5)","v":"MONDAY"},{"$f":"IF('School Info'!$M$5=\"\",\"\",'School Info'!$M$5)","v":"10:00AM TO 12:00PM"}]
[{"$f":"IF('School Info'!$J$6=\"\",\"\",'School Info'!$J$6)","v":"ENGLISH"},{"$f":"IF('School Info'!$K$6=\"\",\"\",'School Info'!$K$6)","v":"2001-01-01"},{"$f":"IF('School Info'!$L$6=\"\",\"\",'School Info'!$L$6)","v":"TUESDAY"},{"$f":"IF('School Info'!$M$6=\"\",\"\",'School Info'!$M$6)","v":"10:00AM TO 12:00PM"}]
[{"$f":"IF('School Info'!$J$7=\"\",\"\",'School Info'!$J$7)","v":"SCIENCE"},{"$f":"IF('School Info'!$K$7=\"\",\"\",'School Info'!$K$7)","v":"2001-01-01"},{"$f":"IF('School Info'!$L$7=\"\",\"\",'School Info'!$L$7)","v":"WEDNESDAY"},{"$f":"IF('School Info'!$M$7=\"\",\"\",'School Info'!$M$7)","v":"10:00AM TO 12:00PM"}]
[{"$f":"IF('School Info'!$J$8=\"\",\"\",'School Info'!$J$8)","v":"MATH"},{"$f":"IF('School Info'!$K$8=\"\",\"\",'School Info'!$K$8)","v":"2001-01-01"},{"$f":"IF('School Info'!$L$8=\"\",\"\",'School Info'!$L$8)","v":"THURSDAY"},{"$f":"IF('School Info'!$M$8=\"\",\"\",'School Info'!$M$8)","v":"10:00AM TO 12:00PM"}]
[{"$f":"IF('School Info'!$J$9=\"\",\"\",'School Info'!$J$9)","v":"SOCIAL SCIENCE"},{"$f":"IF('School Info'!$K$9=\"\",\"\",'School Info'!$K$9)","v":"2001-01-01"},{"$f":"IF('School Info'!$L$9=\"\",\"\",'School Info'!$L$9)","v":"FRIDAY"},{"$f":"IF('School Info'!$M$9=\"\",\"\",'School Info'!$M$9)","v":"10:00AM TO 12:00PM"}]
[{"$f":"IF('School Info'!$J$10=\"\",\"\",'School Info'!$J$10)","v":"SANSKRIT"},{"$f":"IF('School Info'!$K$10=\"\",\"\",'School Info'!$K$10)","v":"2001-01-01"},{"$f":"IF('School Info'!$L$10=\"\",\"\",'School Info'!$L$10)","v":"SATURDAY"},{"$f":"IF('School Info'!$M$10=\"\",\"\",'School Info'!$M$10)","v":"10:00AM TO 12:00PM"}]
[{"$f":"IF('School Info'!$J$11=\"\",\"\",'School Info'!$J$11)","v":""},{"$f":"IF('School Info'!$K$11=\"\",\"\",'School Info'!$K$11)","v":"2001-01-02"},{"$f":"IF('School Info'!$L$11=\"\",\"\",'School Info'!$L$11)","v":"SUNDAY"},{"$f":"IF('School Info'!$M$11=\"\",\"\",'School Info'!$M$11)","v":"10:00AM TO 12:00PM"}]
[{"$f":"IF('School Info'!$J$12=\"\",\"\",'School Info'!$J$12)","v":""},{"$f":"IF('School Info'!$K$12=\"\",\"\",'School Info'!$K$12)","v":"2001-01-03"},{"$f":"IF('School Info'!$L$12=\"\",\"\",'School Info'!$L$12)","v":"MONDAY"},{"$f":"IF('School Info'!$M$12=\"\",\"\",'School Info'!$M$12)","v":"10:00AM TO 12:00PM"}]
[{"$f":"IF('School Info'!$J$13=\"\",\"\",'School Info'!$J$13)","v":""},{"$f":"IF('School Info'!$K$13=\"\",\"\",'School Info'!$K$13)","v":"2001-01-04"},{"$f":"IF('School Info'!$L$13=\"\",\"\",'School Info'!$L$13)","v":"TUESDAY"},{"$f":"IF('School Info'!$M$13=\"\",\"\",'School Info'!$M$13)","v":"10:00AM TO 12:00PM"}]
[{"$f":"IF('School Info'!$J$14=\"\",\"\",'School Info'!$J$14)","v":""},{"$f":"IF('School Info'!$K$14=\"\",\"\",'School Info'!$K$14)","v":""},{"$f":"IF('School Info'!$L$14=\"\",\"\",'School Info'!$L$14)","v":""},{"$f":"IF('School Info'!$M$14=\"\",\"\",'School Info'!$M$14)","v":""}]
[]
["Note :"]
["1. परीक्षार्थी अपना प्रवेश पत्र रोजाना साथ लेकर आये | (Candidates should bring their admit card with them daily.)"]
["2. परीक्षार्थी परीक्षा केंद्र पर आधा घंटे पहले पहुचें | (Candidates should reach the examination center half an hour before.)"]
["3. परीक्षार्थी परीक्षा हेतु आवश्यक सामग्री साथ लेकर आवें | (Candidates should bring with them the necessary materials for the examination.)"]
[]
[]
[]
[]
[]
["Sig. Exam Incharge",null,null,null,null,null,"Sig. Principal "]
[".------------------------------------------------------- Cut Here------------------------------------------------------"]
[{"$f":"IF('School Info'!$B$4=\"\",\"\",'School Info'!$B$4)","v":"Mahatma Gandhi Government School Bar"}]
[null,null,"School Aff. Code :",null,{"$f":"IF('School Info'!$F$5=\"\",\"\",'School Info'!$F$5)","v":123456}]
[null,null,{"$f":"IF('School Info'!$H$5=\"\",\"\",'School Info'!$H$5)","v":"HALF YEARLY EXAM"},null,{"$f":"IF('School Info'!$H$7=\"\",\"\",'School Info'!$H$7)","v":"2025-26"}]
[null,null,"ADMIT CARD",null,null,null,null,null,{"$f":"I927+1","v":30}]
[]
["ROLL NO :  ",{"$f":"VLOOKUP(I960,Student_data,3,0)","v":130},null,"CLASS : ",{"$f":"IF('School Info'!$B$7=\"\",\"\",'School Info'!$B$7)","v":6},"DOB :",{"$f":"VLOOKUP(I960,Student_data,4,0)","v":"2030-01-01"}]
["NAME :  ",{"$f":"VLOOKUP(I960,Student_data,6,0)","v":"RAJA  "},null,"MEDUIM : ",{"$f":"IF('School Info'!$E$7=\"\",\"\",'School Info'!$E$7)","v":"HINDI"},"GENDER :",{"$f":"VLOOKUP(I960,Student_data,5,0)","v":"MALE"}]
["FATHER :  ",{"$f":"VLOOKUP(I960,Student_data,7,0)","v":"DFD"},null,"SECTION : ",{"$f":"IF('School Info'!$F$8=\"\",\"\",'School Info'!$F$8)","v":"A"},"S.No. : ",{"$f":"VLOOKUP(I960,Student_data,2,0)","v":0}]
["MOTHER :  ",{"$f":"VLOOKUP(I960,Student_data,8,0)","v":"GAG"},null,"School DISE Code :",null,{"$f":"IF('School Info'!$B$5=\"\",\"\",'School Info'!$B$5)","v":123456890}]
[]
["SUBJECT","DATE","DAY","TIME "]
[{"$f":"IF('School Info'!$J$5=\"\",\"\",'School Info'!$J$5)","v":"HINDI"},{"$f":"IF('School Info'!$K$5=\"\",\"\",'School Info'!$K$5)","v":"2001-01-01"},{"$f":"IF('School Info'!$L$5=\"\",\"\",'School Info'!$L$5)","v":"MONDAY"},{"$f":"IF('School Info'!$M$5=\"\",\"\",'School Info'!$M$5)","v":"10:00AM TO 12:00PM"}]
[{"$f":"IF('School Info'!$J$6=\"\",\"\",'School Info'!$J$6)","v":"ENGLISH"},{"$f":"IF('School Info'!$K$6=\"\",\"\",'School Info'!$K$6)","v":"2001-01-01"},{"$f":"IF('School Info'!$L$6=\"\",\"\",'School Info'!$L$6)","v":"TUESDAY"},{"$f":"IF('School Info'!$M$6=\"\",\"\",'School Info'!$M$6)","v":"10:00AM TO 12:00PM"}]
[{"$f":"IF('School Info'!$J$7=\"\",\"\",'School Info'!$J$7)","v":"SCIENCE"},{"$f":"IF('School Info'!$K$7=\"\",\"\",'School Info'!$K$7)","v":"2001-01-01"},{"$f":"IF('School Info'!$L$7=\"\",\"\",'School Info'!$L$7)","v":"WEDNESDAY"},{"$f":"IF('School Info'!$M$7=\"\",\"\",'School Info'!$M$7)","v":"10:00AM TO 12:00PM"}]
[{"$f":"IF('School Info'!$J$8=\"\",\"\",'School Info'!$J$8)","v":"MATH"},{"$f":"IF('School Info'!$K$8=\"\",\"\",'School Info'!$K$8)","v":"2001-01-01"},{"$f":"IF('School Info'!$L$8=\"\",\"\",'School Info'!$L$8)","v":"THURSDAY"},{"$f":"IF('School Info'!$M$8=\"\",\"\",'School Info'!$M$8)","v":"10:00AM TO 12:00PM"}]
[{"$f":"IF('School Info'!$J$9=\"\",\"\",'School Info'!$J$9)","v":"SOCIAL SCIENCE"},{"$f":"IF('School Info'!$K$9=\"\",\"\",'School Info'!$K$9)","v":"2001-01-01"},{"$f":"IF('School Info'!$L$9=\"\",\"\",'School Info'!$L$9)","v":"FRIDAY"},{"$f":"IF('School Info'!$M$9=\"\",\"\",'School Info'!$M$9)","v":"10:00AM TO 12:00PM"}]
[{"$f":"IF('School Info'!$J$10=\"\",\"\",'School Info'!$J$10)","v":"SANSKRIT"},{"$f":"IF('School Info'!$K$10=\"\",\"\",'School Info'!$K$10)","v":"2001-01-01"},{"$f":"IF('School Info'!$L$10=\"\",\"\",'School Info'!$L$10)","v":"SATURDAY"},{"$f":"IF('School Info'!$M$10=\"\",\"\",'School Info'!$M$10)","v":"10:00AM TO 12:00PM"}]
[{"$f":"IF('School Info'!$J$11=\"\",\"\",'School Info'!$J$11)","v":""},{"$f":"IF('School Info'!$K$11=\"\",\"\",'School Info'!$K$11)","v":"2001-01-02"},{"$f":"IF('School Info'!$L$11=\"\",\"\",'School Info'!$L$11)","v":"SUNDAY"},{"$f":"IF('School Info'!$M$11=\"\",\"\",'School Info'!$M$11)","v":"10:00AM TO 12:00PM"}]
[{"$f":"IF('School Info'!$J$12=\"\",\"\",'School Info'!$J$12)","v":""},{"$f":"IF('School Info'!$K$12=\"\",\"\",'School Info'!$K$12)","v":"2001-01-03"},{"$f":"IF('School Info'!$L$12=\"\",\"\",'School Info'!$L$12)","v":"MONDAY"},{"$f":"IF('School Info'!$M$12=\"\",\"\",'School Info'!$M$12)","v":"10:00AM TO 12:00PM"}]
[{"$f":"IF('School Info'!$J$13=\"\",\"\",'School Info'!$J$13)","v":""},{"$f":"IF('School Info'!$K$13=\"\",\"\",'School Info'!$K$13)","v":"2001-01-04"},{"$f":"IF('School Info'!$L$13=\"\",\"\",'School Info'!$L$13)","v":"TUESDAY"},{"$f":"IF('School Info'!$M$13=\"\",\"\",'School Info'!$M$13)","v":"10:00AM TO 12:00PM"}]
[{"$f":"IF('School Info'!$J$14=\"\",\"\",'School Info'!$J$14)","v":""},{"$f":"IF('School Info'!$K$14=\"\",\"\",'School Info'!$K$14)","v":""},{"$f":"IF('School Info'!$L$14=\"\",\"\",'School Info'!$L$14)","v":""},{"$f":"IF('School Info'!$M$14=\"\",\"\",'School Info'!$M$14)","v":""}]
[]
["Note :"]
["1. परीक्षार्थी अपना प्रवेश पत्र रोजाना साथ लेकर आये | (Candidates should bring their admit card with them daily.)"]
["2. परीक्षार्थी परीक्षा केंद्र पर आधा घंटे पहले पहुचें | (Candidates should reach the examination center half an hour before.)"]
["3. परीक्षार्थी परीक्षा हेतु आवश्यक सामग्री साथ लेकर आवें | (Candidates should bring with them the necessary materials for the examination.)"]
[]
[]
[]
[]
[]
["Sig. Exam Incharge",null,null,null,null,null,"Sig. Principal "]
[]
[{"$f":"IF('School Info'!$B$4=\"\",\"\",'School Info'!$B$4)","v":"Mahatma Gandhi Government School Bar"}]
[null,null,"School Aff. Code :",null,{"$f":"IF('School Info'!$F$5=\"\",\"\",'School Info'!$F$5)","v":123456}]
[null,null,{"$f":"IF('School Info'!$H$5=\"\",\"\",'School Info'!$H$5)","v":"HALF YEARLY EXAM"},null,{"$f":"IF('School Info'!$H$7=\"\",\"\",'School Info'!$H$7)","v":"2025-26"}]
[null,null,"ADMIT CARD",null,null,null,null,null,{"$f":"I960+1","v":31}]
[]
["ROLL NO :  ",{"$f":"VLOOKUP(I993,Student_data,3,0)","v":131},null,"CLASS : ",{"$f":"IF('School Info'!$B$7=\"\",\"\",'School Info'!$B$7)","v":6},"DOB :",{"$f":"VLOOKUP(I993,Student_data,4,0)","v":"2031-01-01"}]
["NAME :  ",{"$f":"VLOOKUP(I993,Student_data,6,0)","v":"RAJ GURUJI"},null,"MEDUIM : ",{"$f":"IF('School Info'!$E$7=\"\",\"\",'School Info'!$E$7)","v":"HINDI"},"GENDER :",{"$f":"VLOOKUP(I993,Student_data,5,0)","v":"MALE"}]
["FATHER :  ",{"$f":"VLOOKUP(I993,Student_data,7,0)","v":"RAJ"},null,"SECTION : ",{"$f":"IF('School Info'!$F$8=\"\",\"\",'School Info'!$F$8)","v":"A"},"S.No. : ",{"$f":"VLOOKUP(I993,Student_data,2,0)","v":0}]
["MOTHER :  ",{"$f":"VLOOKUP(I993,Student_data,8,0)","v":"DEVI"},null,"School DISE Code :",null,{"$f":"IF('School Info'!$B$5=\"\",\"\",'School Info'!$B$5)","v":123456890}]
[]
["SUBJECT","DATE","DAY","TIME "]
[{"$f":"IF('School Info'!$J$5=\"\",\"\",'School Info'!$J$5)","v":"HINDI"},{"$f":"IF('School Info'!$K$5=\"\",\"\",'School Info'!$K$5)","v":"2001-01-01"},{"$f":"IF('School Info'!$L$5=\"\",\"\",'School Info'!$L$5)","v":"MONDAY"},{"$f":"IF('School Info'!$M$5=\"\",\"\",'School Info'!$M$5)","v":"10:00AM TO 12:00PM"}]
[{"$f":"IF('School Info'!$J$6=\"\",\"\",'School Info'!$J$6)","v":"ENGLISH"},{"$f":"IF('School Info'!$K$6=\"\",\"\",'School Info'!$K$6)","v":"2001-01-01"},{"$f":"IF('School Info'!$L$6=\"\",\"\",'School Info'!$L$6)","v":"TUESDAY"},{"$f":"IF('School Info'!$M$6=\"\",\"\",'School Info'!$M$6)","v":"10:00AM TO 12:00PM"}]
[{"$f":"IF('School Info'!$J$7=\"\",\"\",'School Info'!$J$7)","v":"SCIENCE"},{"$f":"IF('School Info'!$K$7=\"\",\"\",'School Info'!$K$7)","v":"2001-01-01"},{"$f":"IF('School Info'!$L$7=\"\",\"\",'School Info'!$L$7)","v":"WEDNESDAY"},{"$f":"IF('School Info'!$M$7=\"\",\"\",'School Info'!$M$7)","v":"10:00AM TO 12:00PM"}]
[{"$f":"IF('School Info'!$J$8=\"\",\"\",'School Info'!$J$8)","v":"MATH"},{"$f":"IF('School Info'!$K$8=\"\",\"\",'School Info'!$K$8)","v":"2001-01-01"},{"$f":"IF('School Info'!$L$8=\"\",\"\",'School Info'!$L$8)","v":"THURSDAY"},{"$f":"IF('School Info'!$M$8=\"\",\"\",'School Info'!$M$8)","v":"10:00AM TO 12:00PM"}]
[{"$f":"IF('School Info'!$J$9=\"\",\"\",'School Info'!$J$9)","v":"SOCIAL SCIENCE"},{"$f":"IF('School Info'!$K$9=\"\",\"\",'School Info'!$K$9)","v":"2001-01-01"},{"$f":"IF('School Info'!$L$9=\"\",\"\",'School Info'!$L$9)","v":"FRIDAY"},{"$f":"IF('School Info'!$M$9=\"\",\"\",'School Info'!$M$9)","v":"10:00AM TO 12:00PM"}]
[{"$f":"IF('School Info'!$J$10=\"\",\"\",'School Info'!$J$10)","v":"SANSKRIT"},{"$f":"IF('School Info'!$K$10=\"\",\"\",'School Info'!$K$10)","v":"2001-01-01"},{"$f":"IF('School Info'!$L$10=\"\",\"\",'School Info'!$L$10)","v":"SATURDAY"},{"$f":"IF('School Info'!$M$10=\"\",\"\",'School Info'!$M$10)","v":"10:00AM TO 12:00PM"}]
[{"$f":"IF('School Info'!$J$11=\"\",\"\",'School Info'!$J$11)","v":""},{"$f":"IF('School Info'!$K$11=\"\",\"\",'School Info'!$K$11)","v":"2001-01-02"},{"$f":"IF('School Info'!$L$11=\"\",\"\",'School Info'!$L$11)","v":"SUNDAY"},{"$f":"IF('School Info'!$M$11=\"\",\"\",'School Info'!$M$11)","v":"10:00AM TO 12:00PM"}]
[{"$f":"IF('School Info'!$J$12=\"\",\"\",'School Info'!$J$12)","v":""},{"$f":"IF('School Info'!$K$12=\"\",\"\",'School Info'!$K$12)","v":"2001-01-03"},{"$f":"IF('School Info'!$L$12=\"\",\"\",'School Info'!$L$12)","v":"MONDAY"},{"$f":"IF('School Info'!$M$12=\"\",\"\",'School Info'!$M$12)","v":"10:00AM TO 12:00PM"}]
[{"$f":"IF('School Info'!$J$13=\"\",\"\",'School Info'!$J$13)","v":""},{"$f":"IF('School Info'!$K$13=\"\",\"\",'School Info'!$K$13)","v":"2001-01-04"},{"$f":"IF('School Info'!$L$13=\"\",\"\",'School Info'!$L$13)","v":"TUESDAY"},{"$f":"IF('School Info'!$M$13=\"\",\"\",'School Info'!$M$13)","v":"10:00AM TO 12:00PM"}]
[{"$f":"IF('School Info'!$J$14=\"\",\"\",'School Info'!$J$14)","v":""},{"$f":"IF('School Info'!$K$14=\"\",\"\",'School Info'!$K$14)","v":""},{"$f":"IF('School Info'!$L$14=\"\",\"\",'School Info'!$L$14)","v":""},{"$f":"IF('School Info'!$M$14=\"\",\"\",'School Info'!$M$14)","v":""}]
[]
["Note :"]
["1. परीक्षार्थी अपना प्रवेश पत्र रोजाना साथ लेकर आये | (Candidates should bring their admit card with them daily.)"]
["2. परीक्षार्थी परीक्षा केंद्र पर आधा घंटे पहले पहुचें | (Candidates should reach the examination center half an hour before.)"]
["3. परीक्षार्थी परीक्षा हेतु आवश्यक सामग्री साथ लेकर आवें | (Candidates should bring with them the necessary materials for the examination.)"]
[]
[]
[]
[]
[]
["Sig. Exam Incharge",null,null,null,null,null,"Sig. Principal "]
[".------------------------------------------------------- Cut Here------------------------------------------------------"]
[{"$f":"IF('School Info'!$B$4=\"\",\"\",'School Info'!$B$4)","v":"Mahatma Gandhi Government School Bar"}]
[null,null,"School Aff. Code :",null,{"$f":"IF('School Info'!$F$5=\"\",\"\",'School Info'!$F$5)","v":123456}]
[null,null,{"$f":"IF('School Info'!$H$5=\"\",\"\",'School Info'!$H$5)","v":"HALF YEARLY EXAM"},null,{"$f":"IF('School Info'!$H$7=\"\",\"\",'School Info'!$H$7)","v":"2025-26"}]
[null,null,"ADMIT CARD",null,null,null,null,null,{"$f":"I993+1","v":32}]
[]
["ROLL NO :  ",{"$f":"VLOOKUP(I1026,Student_data,3,0)","v":132},null,"CLASS : ",{"$f":"IF('School Info'!$B$7=\"\",\"\",'School Info'!$B$7)","v":6},"DOB :",{"$f":"VLOOKUP(I1026,Student_data,4,0)","v":"2032-01-01"}]
["NAME :  ",{"$f":"VLOOKUP(I1026,Student_data,6,0)","v":"MONU"},null,"MEDUIM : ",{"$f":"IF('School Info'!$E$7=\"\",\"\",'School Info'!$E$7)","v":"HINDI"},"GENDER :",{"$f":"VLOOKUP(I1026,Student_data,5,0)","v":"MALE"}]
["FATHER :  ",{"$f":"VLOOKUP(I1026,Student_data,7,0)","v":"RAAA"},null,"SECTION : ",{"$f":"IF('School Info'!$F$8=\"\",\"\",'School Info'!$F$8)","v":"A"},"S.No. : ",{"$f":"VLOOKUP(I1026,Student_data,2,0)","v":0}]
["MOTHER :  ",{"$f":"VLOOKUP(I1026,Student_data,8,0)","v":"DDD"},null,"School DISE Code :",null,{"$f":"IF('School Info'!$B$5=\"\",\"\",'School Info'!$B$5)","v":123456890}]
[]
["SUBJECT","DATE","DAY","TIME "]
[{"$f":"IF('School Info'!$J$5=\"\",\"\",'School Info'!$J$5)","v":"HINDI"},{"$f":"IF('School Info'!$K$5=\"\",\"\",'School Info'!$K$5)","v":"2001-01-01"},{"$f":"IF('School Info'!$L$5=\"\",\"\",'School Info'!$L$5)","v":"MONDAY"},{"$f":"IF('School Info'!$M$5=\"\",\"\",'School Info'!$M$5)","v":"10:00AM TO 12:00PM"}]
[{"$f":"IF('School Info'!$J$6=\"\",\"\",'School Info'!$J$6)","v":"ENGLISH"},{"$f":"IF('School Info'!$K$6=\"\",\"\",'School Info'!$K$6)","v":"2001-01-01"},{"$f":"IF('School Info'!$L$6=\"\",\"\",'School Info'!$L$6)","v":"TUESDAY"},{"$f":"IF('School Info'!$M$6=\"\",\"\",'School Info'!$M$6)","v":"10:00AM TO 12:00PM"}]
[{"$f":"IF('School Info'!$J$7=\"\",\"\",'School Info'!$J$7)","v":"SCIENCE"},{"$f":"IF('School Info'!$K$7=\"\",\"\",'School Info'!$K$7)","v":"2001-01-01"},{"$f":"IF('School Info'!$L$7=\"\",\"\",'School Info'!$L$7)","v":"WEDNESDAY"},{"$f":"IF('School Info'!$M$7=\"\",\"\",'School Info'!$M$7)","v":"10:00AM TO 12:00PM"}]
[{"$f":"IF('School Info'!$J$8=\"\",\"\",'School Info'!$J$8)","v":"MATH"},{"$f":"IF('School Info'!$K$8=\"\",\"\",'School Info'!$K$8)","v":"2001-01-01"},{"$f":"IF('School Info'!$L$8=\"\",\"\",'School Info'!$L$8)","v":"THURSDAY"},{"$f":"IF('School Info'!$M$8=\"\",\"\",'School Info'!$M$8)","v":"10:00AM TO 12:00PM"}]
[{"$f":"IF('School Info'!$J$9=\"\",\"\",'School Info'!$J$9)","v":"SOCIAL SCIENCE"},{"$f":"IF('School Info'!$K$9=\"\",\"\",'School Info'!$K$9)","v":"2001-01-01"},{"$f":"IF('School Info'!$L$9=\"\",\"\",'School Info'!$L$9)","v":"FRIDAY"},{"$f":"IF('School Info'!$M$9=\"\",\"\",'School Info'!$M$9)","v":"10:00AM TO 12:00PM"}]
[{"$f":"IF('School Info'!$J$10=\"\",\"\",'School Info'!$J$10)","v":"SANSKRIT"},{"$f":"IF('School Info'!$K$10=\"\",\"\",'School Info'!$K$10)","v":"2001-01-01"},{"$f":"IF('School Info'!$L$10=\"\",\"\",'School Info'!$L$10)","v":"SATURDAY"},{"$f":"IF('School Info'!$M$10=\"\",\"\",'School Info'!$M$10)","v":"10:00AM TO 12:00PM"}]
[{"$f":"IF('School Info'!$J$11=\"\",\"\",'School Info'!$J$11)","v":""},{"$f":"IF('School Info'!$K$11=\"\",\"\",'School Info'!$K$11)","v":"2001-01-02"},{"$f":"IF('School Info'!$L$11=\"\",\"\",'School Info'!$L$11)","v":"SUNDAY"},{"$f":"IF('School Info'!$M$11=\"\",\"\",'School Info'!$M$11)","v":"10:00AM TO 12:00PM"}]
[{"$f":"IF('School Info'!$J$12=\"\",\"\",'School Info'!$J$12)","v":""},{"$f":"IF('School Info'!$K$12=\"\",\"\",'School Info'!$K$12)","v":"2001-01-03"},{"$f":"IF('School Info'!$L$12=\"\",\"\",'School Info'!$L$12)","v":"MONDAY"},{"$f":"IF('School Info'!$M$12=\"\",\"\",'School Info'!$M$12)","v":"10:00AM TO 12:00PM"}]
[{"$f":"IF('School Info'!$J$13=\"\",\"\",'School Info'!$J$13)","v":""},{"$f":"IF('School Info'!$K$13=\"\",\"\",'School Info'!$K$13)","v":"2001-01-04"},{"$f":"IF('School Info'!$L$13=\"\",\"\",'School Info'!$L$13)","v":"TUESDAY"},{"$f":"IF('School Info'!$M$13=\"\",\"\",'School Info'!$M$13)","v":"10:00AM TO 12:00PM"}]
[{"$f":"IF('School Info'!$J$14=\"\",\"\",'School Info'!$J$14)","v":""},{"$f":"IF('School Info'!$K$14=\"\",\"\",'School Info'!$K$14)","v":""},{"$f":"IF('School Info'!$L$14=\"\",\"\",'School Info'!$L$14)","v":""},{"$f":"IF('School Info'!$M$14=\"\",\"\",'School Info'!$M$14)","v":""}]
[]
["Note :"]
["1. परीक्षार्थी अपना प्रवेश पत्र रोजाना साथ लेकर आये | (Candidates should bring their admit card with them daily.)"]
["2. परीक्षार्थी परीक्षा केंद्र पर आधा घंटे पहले पहुचें | (Candidates should reach the examination center half an hour before.)"]
["3. परीक्षार्थी परीक्षा हेतु आवश्यक सामग्री साथ लेकर आवें | (Candidates should bring with them the necessary materials for the examination.)"]
[]
[]
[]
[]
[]
["Sig. Exam Incharge",null,null,null,null,null,"Sig. Principal "]
[]
[{"$f":"IF('School Info'!$B$4=\"\",\"\",'School Info'!$B$4)","v":"Mahatma Gandhi Government School Bar"}]
[null,null,"School Aff. Code :",null,{"$f":"IF('School Info'!$F$5=\"\",\"\",'School Info'!$F$5)","v":123456}]
[null,null,{"$f":"IF('School Info'!$H$5=\"\",\"\",'School Info'!$H$5)","v":"HALF YEARLY EXAM"},null,{"$f":"IF('School Info'!$H$7=\"\",\"\",'School Info'!$H$7)","v":"2025-26"}]
[null,null,"ADMIT CARD",null,null,null,null,null,{"$f":"I1026+1","v":33}]
[]
["ROLL NO :  ",{"$f":"VLOOKUP(I1059,Student_data,3,0)","v":133},null,"CLASS : ",{"$f":"IF('School Info'!$B$7=\"\",\"\",'School Info'!$B$7)","v":6},"DOB :",{"$f":"VLOOKUP(I1059,Student_data,4,0)","v":"2033-01-01"}]
["NAME :  ",{"$f":"VLOOKUP(I1059,Student_data,6,0)","v":"SONU"},null,"MEDUIM : ",{"$f":"IF('School Info'!$E$7=\"\",\"\",'School Info'!$E$7)","v":"HINDI"},"GENDER :",{"$f":"VLOOKUP(I1059,Student_data,5,0)","v":"MALE"}]
["FATHER :  ",{"$f":"VLOOKUP(I1059,Student_data,7,0)","v":"AAA"},null,"SECTION : ",{"$f":"IF('School Info'!$F$8=\"\",\"\",'School Info'!$F$8)","v":"A"},"S.No. : ",{"$f":"VLOOKUP(I1059,Student_data,2,0)","v":0}]
["MOTHER :  ",{"$f":"VLOOKUP(I1059,Student_data,8,0)","v":"DDS"},null,"School DISE Code :",null,{"$f":"IF('School Info'!$B$5=\"\",\"\",'School Info'!$B$5)","v":123456890}]
[]
["SUBJECT","DATE","DAY","TIME "]
[{"$f":"IF('School Info'!$J$5=\"\",\"\",'School Info'!$J$5)","v":"HINDI"},{"$f":"IF('School Info'!$K$5=\"\",\"\",'School Info'!$K$5)","v":"2001-01-01"},{"$f":"IF('School Info'!$L$5=\"\",\"\",'School Info'!$L$5)","v":"MONDAY"},{"$f":"IF('School Info'!$M$5=\"\",\"\",'School Info'!$M$5)","v":"10:00AM TO 12:00PM"}]
[{"$f":"IF('School Info'!$J$6=\"\",\"\",'School Info'!$J$6)","v":"ENGLISH"},{"$f":"IF('School Info'!$K$6=\"\",\"\",'School Info'!$K$6)","v":"2001-01-01"},{"$f":"IF('School Info'!$L$6=\"\",\"\",'School Info'!$L$6)","v":"TUESDAY"},{"$f":"IF('School Info'!$M$6=\"\",\"\",'School Info'!$M$6)","v":"10:00AM TO 12:00PM"}]
[{"$f":"IF('School Info'!$J$7=\"\",\"\",'School Info'!$J$7)","v":"SCIENCE"},{"$f":"IF('School Info'!$K$7=\"\",\"\",'School Info'!$K$7)","v":"2001-01-01"},{"$f":"IF('School Info'!$L$7=\"\",\"\",'School Info'!$L$7)","v":"WEDNESDAY"},{"$f":"IF('School Info'!$M$7=\"\",\"\",'School Info'!$M$7)","v":"10:00AM TO 12:00PM"}]
[{"$f":"IF('School Info'!$J$8=\"\",\"\",'School Info'!$J$8)","v":"MATH"},{"$f":"IF('School Info'!$K$8=\"\",\"\",'School Info'!$K$8)","v":"2001-01-01"},{"$f":"IF('School Info'!$L$8=\"\",\"\",'School Info'!$L$8)","v":"THURSDAY"},{"$f":"IF('School Info'!$M$8=\"\",\"\",'School Info'!$M$8)","v":"10:00AM TO 12:00PM"}]
[{"$f":"IF('School Info'!$J$9=\"\",\"\",'School Info'!$J$9)","v":"SOCIAL SCIENCE"},{"$f":"IF('School Info'!$K$9=\"\",\"\",'School Info'!$K$9)","v":"2001-01-01"},{"$f":"IF('School Info'!$L$9=\"\",\"\",'School Info'!$L$9)","v":"FRIDAY"},{"$f":"IF('School Info'!$M$9=\"\",\"\",'School Info'!$M$9)","v":"10:00AM TO 12:00PM"}]
[{"$f":"IF('School Info'!$J$10=\"\",\"\",'School Info'!$J$10)","v":"SANSKRIT"},{"$f":"IF('School Info'!$K$10=\"\",\"\",'School Info'!$K$10)","v":"2001-01-01"},{"$f":"IF('School Info'!$L$10=\"\",\"\",'School Info'!$L$10)","v":"SATURDAY"},{"$f":"IF('School Info'!$M$10=\"\",\"\",'School Info'!$M$10)","v":"10:00AM TO 12:00PM"}]
[{"$f":"IF('School Info'!$J$11=\"\",\"\",'School Info'!$J$11)","v":""},{"$f":"IF('School Info'!$K$11=\"\",\"\",'School Info'!$K$11)","v":"2001-01-02"},{"$f":"IF('School Info'!$L$11=\"\",\"\",'School Info'!$L$11)","v":"SUNDAY"},{"$f":"IF('School Info'!$M$11=\"\",\"\",'School Info'!$M$11)","v":"10:00AM TO 12:00PM"}]
[{"$f":"IF('School Info'!$J$12=\"\",\"\",'School Info'!$J$12)","v":""},{"$f":"IF('School Info'!$K$12=\"\",\"\",'School Info'!$K$12)","v":"2001-01-03"},{"$f":"IF('School Info'!$L$12=\"\",\"\",'School Info'!$L$12)","v":"MONDAY"},{"$f":"IF('School Info'!$M$12=\"\",\"\",'School Info'!$M$12)","v":"10:00AM TO 12:00PM"}]
[{"$f":"IF('School Info'!$J$13=\"\",\"\",'School Info'!$J$13)","v":""},{"$f":"IF('School Info'!$K$13=\"\",\"\",'School Info'!$K$13)","v":"2001-01-04"},{"$f":"IF('School Info'!$L$13=\"\",\"\",'School Info'!$L$13)","v":"TUESDAY"},{"$f":"IF('School Info'!$M$13=\"\",\"\",'School Info'!$M$13)","v":"10:00AM TO 12:00PM"}]
[{"$f":"IF('School Info'!$J$14=\"\",\"\",'School Info'!$J$14)","v":""},{"$f":"IF('School Info'!$K$14=\"\",\"\",'School Info'!$K$14)","v":""},{"$f":"IF('School Info'!$L$14=\"\",\"\",'School Info'!$L$14)","v":""},{"$f":"IF('School Info'!$M$14=\"\",\"\",'School Info'!$M$14)","v":""}]
[]
["Note :"]
["1. परीक्षार्थी अपना प्रवेश पत्र रोजाना साथ लेकर आये | (Candidates should bring their admit card with them daily.)"]
["2. परीक्षार्थी परीक्षा केंद्र पर आधा घंटे पहले पहुचें | (Candidates should reach the examination center half an hour before.)"]
["3. परीक्षार्थी परीक्षा हेतु आवश्यक सामग्री साथ लेकर आवें | (Candidates should bring with them the necessary materials for the examination.)"]
[]
[]
[]
[]
[]
["Sig. Exam Incharge",null,null,null,null,null,"Sig. Principal "]
[".------------------------------------------------------- Cut Here------------------------------------------------------"]
[{"$f":"IF('School Info'!$B$4=\"\",\"\",'School Info'!$B$4)","v":"Mahatma Gandhi Government School Bar"}]
[null,null,"School Aff. Code :",null,{"$f":"IF('School Info'!$F$5=\"\",\"\",'School Info'!$F$5)","v":123456}]
[null,null,{"$f":"IF('School Info'!$H$5=\"\",\"\",'School Info'!$H$5)","v":"HALF YEARLY EXAM"},null,{"$f":"IF('School Info'!$H$7=\"\",\"\",'School Info'!$H$7)","v":"2025-26"}]
[null,null,"ADMIT CARD",null,null,null,null,null,{"$f":"I1059+1","v":34}]
[]
["ROLL NO :  ",{"$f":"VLOOKUP(I1092,Student_data,3,0)","v":134},null,"CLASS : ",{"$f":"IF('School Info'!$B$7=\"\",\"\",'School Info'!$B$7)","v":6},"DOB :",{"$f":"VLOOKUP(I1092,Student_data,4,0)","v":"2034-01-01"}]
["NAME :  ",{"$f":"VLOOKUP(I1092,Student_data,6,0)","v":"KARNA"},null,"MEDUIM : ",{"$f":"IF('School Info'!$E$7=\"\",\"\",'School Info'!$E$7)","v":"HINDI"},"GENDER :",{"$f":"VLOOKUP(I1092,Student_data,5,0)","v":"MALE"}]
["FATHER :  ",{"$f":"VLOOKUP(I1092,Student_data,7,0)","v":"BBB"},null,"SECTION : ",{"$f":"IF('School Info'!$F$8=\"\",\"\",'School Info'!$F$8)","v":"A"},"S.No. : ",{"$f":"VLOOKUP(I1092,Student_data,2,0)","v":0}]
["MOTHER :  ",{"$f":"VLOOKUP(I1092,Student_data,8,0)","v":"SSDDF"},null,"School DISE Code :",null,{"$f":"IF('School Info'!$B$5=\"\",\"\",'School Info'!$B$5)","v":123456890}]
[]
["SUBJECT","DATE","DAY","TIME "]
[{"$f":"IF('School Info'!$J$5=\"\",\"\",'School Info'!$J$5)","v":"HINDI"},{"$f":"IF('School Info'!$K$5=\"\",\"\",'School Info'!$K$5)","v":"2001-01-01"},{"$f":"IF('School Info'!$L$5=\"\",\"\",'School Info'!$L$5)","v":"MONDAY"},{"$f":"IF('School Info'!$M$5=\"\",\"\",'School Info'!$M$5)","v":"10:00AM TO 12:00PM"}]
[{"$f":"IF('School Info'!$J$6=\"\",\"\",'School Info'!$J$6)","v":"ENGLISH"},{"$f":"IF('School Info'!$K$6=\"\",\"\",'School Info'!$K$6)","v":"2001-01-01"},{"$f":"IF('School Info'!$L$6=\"\",\"\",'School Info'!$L$6)","v":"TUESDAY"},{"$f":"IF('School Info'!$M$6=\"\",\"\",'School Info'!$M$6)","v":"10:00AM TO 12:00PM"}]
[{"$f":"IF('School Info'!$J$7=\"\",\"\",'School Info'!$J$7)","v":"SCIENCE"},{"$f":"IF('School Info'!$K$7=\"\",\"\",'School Info'!$K$7)","v":"2001-01-01"},{"$f":"IF('School Info'!$L$7=\"\",\"\",'School Info'!$L$7)","v":"WEDNESDAY"},{"$f":"IF('School Info'!$M$7=\"\",\"\",'School Info'!$M$7)","v":"10:00AM TO 12:00PM"}]
[{"$f":"IF('School Info'!$J$8=\"\",\"\",'School Info'!$J$8)","v":"MATH"},{"$f":"IF('School Info'!$K$8=\"\",\"\",'School Info'!$K$8)","v":"2001-01-01"},{"$f":"IF('School Info'!$L$8=\"\",\"\",'School Info'!$L$8)","v":"THURSDAY"},{"$f":"IF('School Info'!$M$8=\"\",\"\",'School Info'!$M$8)","v":"10:00AM TO 12:00PM"}]
[{"$f":"IF('School Info'!$J$9=\"\",\"\",'School Info'!$J$9)","v":"SOCIAL SCIENCE"},{"$f":"IF('School Info'!$K$9=\"\",\"\",'School Info'!$K$9)","v":"2001-01-01"},{"$f":"IF('School Info'!$L$9=\"\",\"\",'School Info'!$L$9)","v":"FRIDAY"},{"$f":"IF('School Info'!$M$9=\"\",\"\",'School Info'!$M$9)","v":"10:00AM TO 12:00PM"}]
[{"$f":"IF('School Info'!$J$10=\"\",\"\",'School Info'!$J$10)","v":"SANSKRIT"},{"$f":"IF('School Info'!$K$10=\"\",\"\",'School Info'!$K$10)","v":"2001-01-01"},{"$f":"IF('School Info'!$L$10=\"\",\"\",'School Info'!$L$10)","v":"SATURDAY"},{"$f":"IF('School Info'!$M$10=\"\",\"\",'School Info'!$M$10)","v":"10:00AM TO 12:00PM"}]
[{"$f":"IF('School Info'!$J$11=\"\",\"\",'School Info'!$J$11)","v":""},{"$f":"IF('School Info'!$K$11=\"\",\"\",'School Info'!$K$11)","v":"2001-01-02"},{"$f":"IF('School Info'!$L$11=\"\",\"\",'School Info'!$L$11)","v":"SUNDAY"},{"$f":"IF('School Info'!$M$11=\"\",\"\",'School Info'!$M$11)","v":"10:00AM TO 12:00PM"}]
[{"$f":"IF('School Info'!$J$12=\"\",\"\",'School Info'!$J$12)","v":""},{"$f":"IF('School Info'!$K$12=\"\",\"\",'School Info'!$K$12)","v":"2001-01-03"},{"$f":"IF('School Info'!$L$12=\"\",\"\",'School Info'!$L$12)","v":"MONDAY"},{"$f":"IF('School Info'!$M$12=\"\",\"\",'School Info'!$M$12)","v":"10:00AM TO 12:00PM"}]
[{"$f":"IF('School Info'!$J$13=\"\",\"\",'School Info'!$J$13)","v":""},{"$f":"IF('School Info'!$K$13=\"\",\"\",'School Info'!$K$13)","v":"2001-01-04"},{"$f":"IF('School Info'!$L$13=\"\",\"\",'School Info'!$L$13)","v":"TUESDAY"},{"$f":"IF('School Info'!$M$13=\"\",\"\",'School Info'!$M$13)","v":"10:00AM TO 12:00PM"}]
[{"$f":"IF('School Info'!$J$14=\"\",\"\",'School Info'!$J$14)","v":""},{"$f":"IF('School Info'!$K$14=\"\",\"\",'School Info'!$K$14)","v":""},{"$f":"IF('School Info'!$L$14=\"\",\"\",'School Info'!$L$14)","v":""},{"$f":"IF('School Info'!$M$14=\"\",\"\",'School Info'!$M$14)","v":""}]
[]
["Note :"]
["1. परीक्षार्थी अपना प्रवेश पत्र रोजाना साथ लेकर आये | (Candidates should bring their admit card with them daily.)"]
["2. परीक्षार्थी परीक्षा केंद्र पर आधा घंटे पहले पहुचें | (Candidates should reach the examination center half an hour before.)"]
["3. परीक्षार्थी परीक्षा हेतु आवश्यक सामग्री साथ लेकर आवें | (Candidates should bring with them the necessary materials for the examination.)"]
[]
[]
[]
[]
[]
["Sig. Exam Incharge",null,null,null,null,null,"Sig. Principal "]
[]
[{"$f":"IF('School Info'!$B$4=\"\",\"\",'School Info'!$B$4)","v":"Mahatma Gandhi Government School Bar"}]
[null,null,"School Aff. Code :",null,{"$f":"IF('School Info'!$F$5=\"\",\"\",'School Info'!$F$5)","v":123456}]
[null,null,{"$f":"IF('School Info'!$H$5=\"\",\"\",'School Info'!$H$5)","v":"HALF YEARLY EXAM"},null,{"$f":"IF('School Info'!$H$7=\"\",\"\",'School Info'!$H$7)","v":"2025-26"}]
[null,null,"ADMIT CARD",null,null,null,null,null,{"$f":"I1092+1","v":35}]
[]
["ROLL NO :  ",{"$f":"VLOOKUP(I1125,Student_data,3,0)","v":135},null,"CLASS : ",{"$f":"IF('School Info'!$B$7=\"\",\"\",'School Info'!$B$7)","v":6},"DOB :",{"$f":"VLOOKUP(I1125,Student_data,4,0)","v":"2035-01-01"}]
["NAME :  ",{"$f":"VLOOKUP(I1125,Student_data,6,0)","v":"RAJA  "},null,"MEDUIM : ",{"$f":"IF('School Info'!$E$7=\"\",\"\",'School Info'!$E$7)","v":"HINDI"},"GENDER :",{"$f":"VLOOKUP(I1125,Student_data,5,0)","v":"MALE"}]
["FATHER :  ",{"$f":"VLOOKUP(I1125,Student_data,7,0)","v":"DFD"},null,"SECTION : ",{"$f":"IF('School Info'!$F$8=\"\",\"\",'School Info'!$F$8)","v":"A"},"S.No. : ",{"$f":"VLOOKUP(I1125,Student_data,2,0)","v":0}]
["MOTHER :  ",{"$f":"VLOOKUP(I1125,Student_data,8,0)","v":"GAG"},null,"School DISE Code :",null,{"$f":"IF('School Info'!$B$5=\"\",\"\",'School Info'!$B$5)","v":123456890}]
[]
["SUBJECT","DATE","DAY","TIME "]
[{"$f":"IF('School Info'!$J$5=\"\",\"\",'School Info'!$J$5)","v":"HINDI"},{"$f":"IF('School Info'!$K$5=\"\",\"\",'School Info'!$K$5)","v":"2001-01-01"},{"$f":"IF('School Info'!$L$5=\"\",\"\",'School Info'!$L$5)","v":"MONDAY"},{"$f":"IF('School Info'!$M$5=\"\",\"\",'School Info'!$M$5)","v":"10:00AM TO 12:00PM"}]
[{"$f":"IF('School Info'!$J$6=\"\",\"\",'School Info'!$J$6)","v":"ENGLISH"},{"$f":"IF('School Info'!$K$6=\"\",\"\",'School Info'!$K$6)","v":"2001-01-01"},{"$f":"IF('School Info'!$L$6=\"\",\"\",'School Info'!$L$6)","v":"TUESDAY"},{"$f":"IF('School Info'!$M$6=\"\",\"\",'School Info'!$M$6)","v":"10:00AM TO 12:00PM"}]
[{"$f":"IF('School Info'!$J$7=\"\",\"\",'School Info'!$J$7)","v":"SCIENCE"},{"$f":"IF('School Info'!$K$7=\"\",\"\",'School Info'!$K$7)","v":"2001-01-01"},{"$f":"IF('School Info'!$L$7=\"\",\"\",'School Info'!$L$7)","v":"WEDNESDAY"},{"$f":"IF('School Info'!$M$7=\"\",\"\",'School Info'!$M$7)","v":"10:00AM TO 12:00PM"}]
[{"$f":"IF('School Info'!$J$8=\"\",\"\",'School Info'!$J$8)","v":"MATH"},{"$f":"IF('School Info'!$K$8=\"\",\"\",'School Info'!$K$8)","v":"2001-01-01"},{"$f":"IF('School Info'!$L$8=\"\",\"\",'School Info'!$L$8)","v":"THURSDAY"},{"$f":"IF('School Info'!$M$8=\"\",\"\",'School Info'!$M$8)","v":"10:00AM TO 12:00PM"}]
[{"$f":"IF('School Info'!$J$9=\"\",\"\",'School Info'!$J$9)","v":"SOCIAL SCIENCE"},{"$f":"IF('School Info'!$K$9=\"\",\"\",'School Info'!$K$9)","v":"2001-01-01"},{"$f":"IF('School Info'!$L$9=\"\",\"\",'School Info'!$L$9)","v":"FRIDAY"},{"$f":"IF('School Info'!$M$9=\"\",\"\",'School Info'!$M$9)","v":"10:00AM TO 12:00PM"}]
[{"$f":"IF('School Info'!$J$10=\"\",\"\",'School Info'!$J$10)","v":"SANSKRIT"},{"$f":"IF('School Info'!$K$10=\"\",\"\",'School Info'!$K$10)","v":"2001-01-01"},{"$f":"IF('School Info'!$L$10=\"\",\"\",'School Info'!$L$10)","v":"SATURDAY"},{"$f":"IF('School Info'!$M$10=\"\",\"\",'School Info'!$M$10)","v":"10:00AM TO 12:00PM"}]
[{"$f":"IF('School Info'!$J$11=\"\",\"\",'School Info'!$J$11)","v":""},{"$f":"IF('School Info'!$K$11=\"\",\"\",'School Info'!$K$11)","v":"2001-01-02"},{"$f":"IF('School Info'!$L$11=\"\",\"\",'School Info'!$L$11)","v":"SUNDAY"},{"$f":"IF('School Info'!$M$11=\"\",\"\",'School Info'!$M$11)","v":"10:00AM TO 12:00PM"}]
[{"$f":"IF('School Info'!$J$12=\"\",\"\",'School Info'!$J$12)","v":""},{"$f":"IF('School Info'!$K$12=\"\",\"\",'School Info'!$K$12)","v":"2001-01-03"},{"$f":"IF('School Info'!$L$12=\"\",\"\",'School Info'!$L$12)","v":"MONDAY"},{"$f":"IF('School Info'!$M$12=\"\",\"\",'School Info'!$M$12)","v":"10:00AM TO 12:00PM"}]
[{"$f":"IF('School Info'!$J$13=\"\",\"\",'School Info'!$J$13)","v":""},{"$f":"IF('School Info'!$K$13=\"\",\"\",'School Info'!$K$13)","v":"2001-01-04"},{"$f":"IF('School Info'!$L$13=\"\",\"\",'School Info'!$L$13)","v":"TUESDAY"},{"$f":"IF('School Info'!$M$13=\"\",\"\",'School Info'!$M$13)","v":"10:00AM TO 12:00PM"}]
[{"$f":"IF('School Info'!$J$14=\"\",\"\",'School Info'!$J$14)","v":""},{"$f":"IF('School Info'!$K$14=\"\",\"\",'School Info'!$K$14)","v":""},{"$f":"IF('School Info'!$L$14=\"\",\"\",'School Info'!$L$14)","v":""},{"$f":"IF('School Info'!$M$14=\"\",\"\",'School Info'!$M$14)","v":""}]
[]
["Note :"]
["1. परीक्षार्थी अपना प्रवेश पत्र रोजाना साथ लेकर आये | (Candidates should bring their admit card with them daily.)"]
["2. परीक्षार्थी परीक्षा केंद्र पर आधा घंटे पहले पहुचें | (Candidates should reach the examination center half an hour before.)"]
["3. परीक्षार्थी परीक्षा हेतु आवश्यक सामग्री साथ लेकर आवें | (Candidates should bring with them the necessary materials for the examination.)"]
[]
[]
[]
[]
[]
["Sig. Exam Incharge",null,null,null,null,null,"Sig. Principal "]
[".------------------------------------------------------- Cut Here------------------------------------------------------"]
[{"$f":"IF('School Info'!$B$4=\"\",\"\",'School Info'!$B$4)","v":"Mahatma Gandhi Government School Bar"}]
[null,null,"School Aff. Code :",null,{"$f":"IF('School Info'!$F$5=\"\",\"\",'School Info'!$F$5)","v":123456}]
[null,null,{"$f":"IF('School Info'!$H$5=\"\",\"\",'School Info'!$H$5)","v":"HALF YEARLY EXAM"},null,{"$f":"IF('School Info'!$H$7=\"\",\"\",'School Info'!$H$7)","v":"2025-26"}]
[null,null,"ADMIT CARD",null,null,null,null,null,{"$f":"I1125+1","v":36}]
[]
["ROLL NO :  ",{"$f":"VLOOKUP(I1158,Student_data,3,0)","v":136},null,"CLASS : ",{"$f":"IF('School Info'!$B$7=\"\",\"\",'School Info'!$B$7)","v":6},"DOB :",{"$f":"VLOOKUP(I1158,Student_data,4,0)","v":"2036-01-01"}]
["NAME :  ",{"$f":"VLOOKUP(I1158,Student_data,6,0)","v":"RAJ GURUJI"},null,"MEDUIM : ",{"$f":"IF('School Info'!$E$7=\"\",\"\",'School Info'!$E$7)","v":"HINDI"},"GENDER :",{"$f":"VLOOKUP(I1158,Student_data,5,0)","v":"MALE"}]
["FATHER :  ",{"$f":"VLOOKUP(I1158,Student_data,7,0)","v":"RAJ"},null,"SECTION : ",{"$f":"IF('School Info'!$F$8=\"\",\"\",'School Info'!$F$8)","v":"A"},"S.No. : ",{"$f":"VLOOKUP(I1158,Student_data,2,0)","v":0}]
["MOTHER :  ",{"$f":"VLOOKUP(I1158,Student_data,8,0)","v":"DEVI"},null,"School DISE Code :",null,{"$f":"IF('School Info'!$B$5=\"\",\"\",'School Info'!$B$5)","v":123456890}]
[]
["SUBJECT","DATE","DAY","TIME "]
[{"$f":"IF('School Info'!$J$5=\"\",\"\",'School Info'!$J$5)","v":"HINDI"},{"$f":"IF('School Info'!$K$5=\"\",\"\",'School Info'!$K$5)","v":"2001-01-01"},{"$f":"IF('School Info'!$L$5=\"\",\"\",'School Info'!$L$5)","v":"MONDAY"},{"$f":"IF('School Info'!$M$5=\"\",\"\",'School Info'!$M$5)","v":"10:00AM TO 12:00PM"}]
[{"$f":"IF('School Info'!$J$6=\"\",\"\",'School Info'!$J$6)","v":"ENGLISH"},{"$f":"IF('School Info'!$K$6=\"\",\"\",'School Info'!$K$6)","v":"2001-01-01"},{"$f":"IF('School Info'!$L$6=\"\",\"\",'School Info'!$L$6)","v":"TUESDAY"},{"$f":"IF('School Info'!$M$6=\"\",\"\",'School Info'!$M$6)","v":"10:00AM TO 12:00PM"}]
[{"$f":"IF('School Info'!$J$7=\"\",\"\",'School Info'!$J$7)","v":"SCIENCE"},{"$f":"IF('School Info'!$K$7=\"\",\"\",'School Info'!$K$7)","v":"2001-01-01"},{"$f":"IF('School Info'!$L$7=\"\",\"\",'School Info'!$L$7)","v":"WEDNESDAY"},{"$f":"IF('School Info'!$M$7=\"\",\"\",'School Info'!$M$7)","v":"10:00AM TO 12:00PM"}]
[{"$f":"IF('School Info'!$J$8=\"\",\"\",'School Info'!$J$8)","v":"MATH"},{"$f":"IF('School Info'!$K$8=\"\",\"\",'School Info'!$K$8)","v":"2001-01-01"},{"$f":"IF('School Info'!$L$8=\"\",\"\",'School Info'!$L$8)","v":"THURSDAY"},{"$f":"IF('School Info'!$M$8=\"\",\"\",'School Info'!$M$8)","v":"10:00AM TO 12:00PM"}]
[{"$f":"IF('School Info'!$J$9=\"\",\"\",'School Info'!$J$9)","v":"SOCIAL SCIENCE"},{"$f":"IF('School Info'!$K$9=\"\",\"\",'School Info'!$K$9)","v":"2001-01-01"},{"$f":"IF('School Info'!$L$9=\"\",\"\",'School Info'!$L$9)","v":"FRIDAY"},{"$f":"IF('School Info'!$M$9=\"\",\"\",'School Info'!$M$9)","v":"10:00AM TO 12:00PM"}]
[{"$f":"IF('School Info'!$J$10=\"\",\"\",'School Info'!$J$10)","v":"SANSKRIT"},{"$f":"IF('School Info'!$K$10=\"\",\"\",'School Info'!$K$10)","v":"2001-01-01"},{"$f":"IF('School Info'!$L$10=\"\",\"\",'School Info'!$L$10)","v":"SATURDAY"},{"$f":"IF('School Info'!$M$10=\"\",\"\",'School Info'!$M$10)","v":"10:00AM TO 12:00PM"}]
[{"$f":"IF('School Info'!$J$11=\"\",\"\",'School Info'!$J$11)","v":""},{"$f":"IF('School Info'!$K$11=\"\",\"\",'School Info'!$K$11)","v":"2001-01-02"},{"$f":"IF('School Info'!$L$11=\"\",\"\",'School Info'!$L$11)","v":"SUNDAY"},{"$f":"IF('School Info'!$M$11=\"\",\"\",'School Info'!$M$11)","v":"10:00AM TO 12:00PM"}]
[{"$f":"IF('School Info'!$J$12=\"\",\"\",'School Info'!$J$12)","v":""},{"$f":"IF('School Info'!$K$12=\"\",\"\",'School Info'!$K$12)","v":"2001-01-03"},{"$f":"IF('School Info'!$L$12=\"\",\"\",'School Info'!$L$12)","v":"MONDAY"},{"$f":"IF('School Info'!$M$12=\"\",\"\",'School Info'!$M$12)","v":"10:00AM TO 12:00PM"}]
[{"$f":"IF('School Info'!$J$13=\"\",\"\",'School Info'!$J$13)","v":""},{"$f":"IF('School Info'!$K$13=\"\",\"\",'School Info'!$K$13)","v":"2001-01-04"},{"$f":"IF('School Info'!$L$13=\"\",\"\",'School Info'!$L$13)","v":"TUESDAY"},{"$f":"IF('School Info'!$M$13=\"\",\"\",'School Info'!$M$13)","v":"10:00AM TO 12:00PM"}]
[{"$f":"IF('School Info'!$J$14=\"\",\"\",'School Info'!$J$14)","v":""},{"$f":"IF('School Info'!$K$14=\"\",\"\",'School Info'!$K$14)","v":""},{"$f":"IF('School Info'!$L$14=\"\",\"\",'School Info'!$L$14)","v":""},{"$f":"IF('School Info'!$M$14=\"\",\"\",'School Info'!$M$14)","v":""}]
[]
["Note :"]
["1. परीक्षार्थी अपना प्रवेश पत्र रोजाना साथ लेकर आये | (Candidates should bring their admit card with them daily.)"]
["2. परीक्षार्थी परीक्षा केंद्र पर आधा घंटे पहले पहुचें | (Candidates should reach the examination center half an hour before.)"]
["3. परीक्षार्थी परीक्षा हेतु आवश्यक सामग्री साथ लेकर आवें | (Candidates should bring with them the necessary materials for the examination.)"]
[]
[]
[]
[]
[]
["Sig. Exam Incharge",null,null,null,null,null,"Sig. Principal "]
[]
[{"$f":"IF('School Info'!$B$4=\"\",\"\",'School Info'!$B$4)","v":"Mahatma Gandhi Government School Bar"}]
[null,null,"School Aff. Code :",null,{"$f":"IF('School Info'!$F$5=\"\",\"\",'School Info'!$F$5)","v":123456}]
[null,null,{"$f":"IF('School Info'!$H$5=\"\",\"\",'School Info'!$H$5)","v":"HALF YEARLY EXAM"},null,{"$f":"IF('School Info'!$H$7=\"\",\"\",'School Info'!$H$7)","v":"2025-26"}]
[null,null,"ADMIT CARD",null,null,null,null,null,{"$f":"I1158+1","v":37}]
[]
["ROLL NO :  ",{"$f":"VLOOKUP(I1191,Student_data,3,0)","v":137},null,"CLASS : ",{"$f":"IF('School Info'!$B$7=\"\",\"\",'School Info'!$B$7)","v":6},"DOB :",{"$f":"VLOOKUP(I1191,Student_data,4,0)","v":"2037-01-01"}]
["NAME :  ",{"$f":"VLOOKUP(I1191,Student_data,6,0)","v":"MONU"},null,"MEDUIM : ",{"$f":"IF('School Info'!$E$7=\"\",\"\",'School Info'!$E$7)","v":"HINDI"},"GENDER :",{"$f":"VLOOKUP(I1191,Student_data,5,0)","v":"MALE"}]
["FATHER :  ",{"$f":"VLOOKUP(I1191,Student_data,7,0)","v":"RAAA"},null,"SECTION : ",{"$f":"IF('School Info'!$F$8=\"\",\"\",'School Info'!$F$8)","v":"A"},"S.No. : ",{"$f":"VLOOKUP(I1191,Student_data,2,0)","v":0}]
["MOTHER :  ",{"$f":"VLOOKUP(I1191,Student_data,8,0)","v":"DDD"},null,"School DISE Code :",null,{"$f":"IF('School Info'!$B$5=\"\",\"\",'School Info'!$B$5)","v":123456890}]
[]
["SUBJECT","DATE","DAY","TIME "]
[{"$f":"IF('School Info'!$J$5=\"\",\"\",'School Info'!$J$5)","v":"HINDI"},{"$f":"IF('School Info'!$K$5=\"\",\"\",'School Info'!$K$5)","v":"2001-01-01"},{"$f":"IF('School Info'!$L$5=\"\",\"\",'School Info'!$L$5)","v":"MONDAY"},{"$f":"IF('School Info'!$M$5=\"\",\"\",'School Info'!$M$5)","v":"10:00AM TO 12:00PM"}]
[{"$f":"IF('School Info'!$J$6=\"\",\"\",'School Info'!$J$6)","v":"ENGLISH"},{"$f":"IF('School Info'!$K$6=\"\",\"\",'School Info'!$K$6)","v":"2001-01-01"},{"$f":"IF('School Info'!$L$6=\"\",\"\",'School Info'!$L$6)","v":"TUESDAY"},{"$f":"IF('School Info'!$M$6=\"\",\"\",'School Info'!$M$6)","v":"10:00AM TO 12:00PM"}]
[{"$f":"IF('School Info'!$J$7=\"\",\"\",'School Info'!$J$7)","v":"SCIENCE"},{"$f":"IF('School Info'!$K$7=\"\",\"\",'School Info'!$K$7)","v":"2001-01-01"},{"$f":"IF('School Info'!$L$7=\"\",\"\",'School Info'!$L$7)","v":"WEDNESDAY"},{"$f":"IF('School Info'!$M$7=\"\",\"\",'School Info'!$M$7)","v":"10:00AM TO 12:00PM"}]
[{"$f":"IF('School Info'!$J$8=\"\",\"\",'School Info'!$J$8)","v":"MATH"},{"$f":"IF('School Info'!$K$8=\"\",\"\",'School Info'!$K$8)","v":"2001-01-01"},{"$f":"IF('School Info'!$L$8=\"\",\"\",'School Info'!$L$8)","v":"THURSDAY"},{"$f":"IF('School Info'!$M$8=\"\",\"\",'School Info'!$M$8)","v":"10:00AM TO 12:00PM"}]
[{"$f":"IF('School Info'!$J$9=\"\",\"\",'School Info'!$J$9)","v":"SOCIAL SCIENCE"},{"$f":"IF('School Info'!$K$9=\"\",\"\",'School Info'!$K$9)","v":"2001-01-01"},{"$f":"IF('School Info'!$L$9=\"\",\"\",'School Info'!$L$9)","v":"FRIDAY"},{"$f":"IF('School Info'!$M$9=\"\",\"\",'School Info'!$M$9)","v":"10:00AM TO 12:00PM"}]
[{"$f":"IF('School Info'!$J$10=\"\",\"\",'School Info'!$J$10)","v":"SANSKRIT"},{"$f":"IF('School Info'!$K$10=\"\",\"\",'School Info'!$K$10)","v":"2001-01-01"},{"$f":"IF('School Info'!$L$10=\"\",\"\",'School Info'!$L$10)","v":"SATURDAY"},{"$f":"IF('School Info'!$M$10=\"\",\"\",'School Info'!$M$10)","v":"10:00AM TO 12:00PM"}]
[{"$f":"IF('School Info'!$J$11=\"\",\"\",'School Info'!$J$11)","v":""},{"$f":"IF('School Info'!$K$11=\"\",\"\",'School Info'!$K$11)","v":"2001-01-02"},{"$f":"IF('School Info'!$L$11=\"\",\"\",'School Info'!$L$11)","v":"SUNDAY"},{"$f":"IF('School Info'!$M$11=\"\",\"\",'School Info'!$M$11)","v":"10:00AM TO 12:00PM"}]
[{"$f":"IF('School Info'!$J$12=\"\",\"\",'School Info'!$J$12)","v":""},{"$f":"IF('School Info'!$K$12=\"\",\"\",'School Info'!$K$12)","v":"2001-01-03"},{"$f":"IF('School Info'!$L$12=\"\",\"\",'School Info'!$L$12)","v":"MONDAY"},{"$f":"IF('School Info'!$M$12=\"\",\"\",'School Info'!$M$12)","v":"10:00AM TO 12:00PM"}]
[{"$f":"IF('School Info'!$J$13=\"\",\"\",'School Info'!$J$13)","v":""},{"$f":"IF('School Info'!$K$13=\"\",\"\",'School Info'!$K$13)","v":"2001-01-04"},{"$f":"IF('School Info'!$L$13=\"\",\"\",'School Info'!$L$13)","v":"TUESDAY"},{"$f":"IF('School Info'!$M$13=\"\",\"\",'School Info'!$M$13)","v":"10:00AM TO 12:00PM"}]
[{"$f":"IF('School Info'!$J$14=\"\",\"\",'School Info'!$J$14)","v":""},{"$f":"IF('School Info'!$K$14=\"\",\"\",'School Info'!$K$14)","v":""},{"$f":"IF('School Info'!$L$14=\"\",\"\",'School Info'!$L$14)","v":""},{"$f":"IF('School Info'!$M$14=\"\",\"\",'School Info'!$M$14)","v":""}]
[]
["Note :"]
["1. परीक्षार्थी अपना प्रवेश पत्र रोजाना साथ लेकर आये | (Candidates should bring their admit card with them daily.)"]
["2. परीक्षार्थी परीक्षा केंद्र पर आधा घंटे पहले पहुचें | (Candidates should reach the examination center half an hour before.)"]
["3. परीक्षार्थी परीक्षा हेतु आवश्यक सामग्री साथ लेकर आवें | (Candidates should bring with them the necessary materials for the examination.)"]
[]
[]
[]
[]
[]
["Sig. Exam Incharge",null,null,null,null,null,"Sig. Principal "]
[".------------------------------------------------------- Cut Here------------------------------------------------------"]
[{"$f":"IF('School Info'!$B$4=\"\",\"\",'School Info'!$B$4)","v":"Mahatma Gandhi Government School Bar"}]
[null,null,"School Aff. Code :",null,{"$f":"IF('School Info'!$F$5=\"\",\"\",'School Info'!$F$5)","v":123456}]
[null,null,{"$f":"IF('School Info'!$H$5=\"\",\"\",'School Info'!$H$5)","v":"HALF YEARLY EXAM"},null,{"$f":"IF('School Info'!$H$7=\"\",\"\",'School Info'!$H$7)","v":"2025-26"}]
[null,null,"ADMIT CARD",null,null,null,null,null,{"$f":"I1191+1","v":38}]
[]
["ROLL NO :  ",{"$f":"VLOOKUP(I1224,Student_data,3,0)","v":138},null,"CLASS : ",{"$f":"IF('School Info'!$B$7=\"\",\"\",'School Info'!$B$7)","v":6},"DOB :",{"$f":"VLOOKUP(I1224,Student_data,4,0)","v":"2038-01-01"}]
["NAME :  ",{"$f":"VLOOKUP(I1224,Student_data,6,0)","v":"SONU"},null,"MEDUIM : ",{"$f":"IF('School Info'!$E$7=\"\",\"\",'School Info'!$E$7)","v":"HINDI"},"GENDER :",{"$f":"VLOOKUP(I1224,Student_data,5,0)","v":"MALE"}]
["FATHER :  ",{"$f":"VLOOKUP(I1224,Student_data,7,0)","v":"AAA"},null,"SECTION : ",{"$f":"IF('School Info'!$F$8=\"\",\"\",'School Info'!$F$8)","v":"A"},"S.No. : ",{"$f":"VLOOKUP(I1224,Student_data,2,0)","v":0}]
["MOTHER :  ",{"$f":"VLOOKUP(I1224,Student_data,8,0)","v":"DDS"},null,"School DISE Code :",null,{"$f":"IF('School Info'!$B$5=\"\",\"\",'School Info'!$B$5)","v":123456890}]
[]
["SUBJECT","DATE","DAY","TIME "]
[{"$f":"IF('School Info'!$J$5=\"\",\"\",'School Info'!$J$5)","v":"HINDI"},{"$f":"IF('School Info'!$K$5=\"\",\"\",'School Info'!$K$5)","v":"2001-01-01"},{"$f":"IF('School Info'!$L$5=\"\",\"\",'School Info'!$L$5)","v":"MONDAY"},{"$f":"IF('School Info'!$M$5=\"\",\"\",'School Info'!$M$5)","v":"10:00AM TO 12:00PM"}]
[{"$f":"IF('School Info'!$J$6=\"\",\"\",'School Info'!$J$6)","v":"ENGLISH"},{"$f":"IF('School Info'!$K$6=\"\",\"\",'School Info'!$K$6)","v":"2001-01-01"},{"$f":"IF('School Info'!$L$6=\"\",\"\",'School Info'!$L$6)","v":"TUESDAY"},{"$f":"IF('School Info'!$M$6=\"\",\"\",'School Info'!$M$6)","v":"10:00AM TO 12:00PM"}]
[{"$f":"IF('School Info'!$J$7=\"\",\"\",'School Info'!$J$7)","v":"SCIENCE"},{"$f":"IF('School Info'!$K$7=\"\",\"\",'School Info'!$K$7)","v":"2001-01-01"},{"$f":"IF('School Info'!$L$7=\"\",\"\",'School Info'!$L$7)","v":"WEDNESDAY"},{"$f":"IF('School Info'!$M$7=\"\",\"\",'School Info'!$M$7)","v":"10:00AM TO 12:00PM"}]
[{"$f":"IF('School Info'!$J$8=\"\",\"\",'School Info'!$J$8)","v":"MATH"},{"$f":"IF('School Info'!$K$8=\"\",\"\",'School Info'!$K$8)","v":"2001-01-01"},{"$f":"IF('School Info'!$L$8=\"\",\"\",'School Info'!$L$8)","v":"THURSDAY"},{"$f":"IF('School Info'!$M$8=\"\",\"\",'School Info'!$M$8)","v":"10:00AM TO 12:00PM"}]
[{"$f":"IF('School Info'!$J$9=\"\",\"\",'School Info'!$J$9)","v":"SOCIAL SCIENCE"},{"$f":"IF('School Info'!$K$9=\"\",\"\",'School Info'!$K$9)","v":"2001-01-01"},{"$f":"IF('School Info'!$L$9=\"\",\"\",'School Info'!$L$9)","v":"FRIDAY"},{"$f":"IF('School Info'!$M$9=\"\",\"\",'School Info'!$M$9)","v":"10:00AM TO 12:00PM"}]
[{"$f":"IF('School Info'!$J$10=\"\",\"\",'School Info'!$J$10)","v":"SANSKRIT"},{"$f":"IF('School Info'!$K$10=\"\",\"\",'School Info'!$K$10)","v":"2001-01-01"},{"$f":"IF('School Info'!$L$10=\"\",\"\",'School Info'!$L$10)","v":"SATURDAY"},{"$f":"IF('School Info'!$M$10=\"\",\"\",'School Info'!$M$10)","v":"10:00AM TO 12:00PM"}]
[{"$f":"IF('School Info'!$J$11=\"\",\"\",'School Info'!$J$11)","v":""},{"$f":"IF('School Info'!$K$11=\"\",\"\",'School Info'!$K$11)","v":"2001-01-02"},{"$f":"IF('School Info'!$L$11=\"\",\"\",'School Info'!$L$11)","v":"SUNDAY"},{"$f":"IF('School Info'!$M$11=\"\",\"\",'School Info'!$M$11)","v":"10:00AM TO 12:00PM"}]
[{"$f":"IF('School Info'!$J$12=\"\",\"\",'School Info'!$J$12)","v":""},{"$f":"IF('School Info'!$K$12=\"\",\"\",'School Info'!$K$12)","v":"2001-01-03"},{"$f":"IF('School Info'!$L$12=\"\",\"\",'School Info'!$L$12)","v":"MONDAY"},{"$f":"IF('School Info'!$M$12=\"\",\"\",'School Info'!$M$12)","v":"10:00AM TO 12:00PM"}]
[{"$f":"IF('School Info'!$J$13=\"\",\"\",'School Info'!$J$13)","v":""},{"$f":"IF('School Info'!$K$13=\"\",\"\",'School Info'!$K$13)","v":"2001-01-04"},{"$f":"IF('School Info'!$L$13=\"\",\"\",'School Info'!$L$13)","v":"TUESDAY"},{"$f":"IF('School Info'!$M$13=\"\",\"\",'School Info'!$M$13)","v":"10:00AM TO 12:00PM"}]
[{"$f":"IF('School Info'!$J$14=\"\",\"\",'School Info'!$J$14)","v":""},{"$f":"IF('School Info'!$K$14=\"\",\"\",'School Info'!$K$14)","v":""},{"$f":"IF('School Info'!$L$14=\"\",\"\",'School Info'!$L$14)","v":""},{"$f":"IF('School Info'!$M$14=\"\",\"\",'School Info'!$M$14)","v":""}]
[]
["Note :"]
["1. परीक्षार्थी अपना प्रवेश पत्र रोजाना साथ लेकर आये | (Candidates should bring their admit card with them daily.)"]
["2. परीक्षार्थी परीक्षा केंद्र पर आधा घंटे पहले पहुचें | (Candidates should reach the examination center half an hour before.)"]
["3. परीक्षार्थी परीक्षा हेतु आवश्यक सामग्री साथ लेकर आवें | (Candidates should bring with them the necessary materials for the examination.)"]
[]
[]
[]
[]
[]
["Sig. Exam Incharge",null,null,null,null,null,"Sig. Principal "]
[]
[{"$f":"IF('School Info'!$B$4=\"\",\"\",'School Info'!$B$4)","v":"Mahatma Gandhi Government School Bar"}]
[null,null,"School Aff. Code :",null,{"$f":"IF('School Info'!$F$5=\"\",\"\",'School Info'!$F$5)","v":123456}]
[null,null,{"$f":"IF('School Info'!$H$5=\"\",\"\",'School Info'!$H$5)","v":"HALF YEARLY EXAM"},null,{"$f":"IF('School Info'!$H$7=\"\",\"\",'School Info'!$H$7)","v":"2025-26"}]
[null,null,"ADMIT CARD",null,null,null,null,null,{"$f":"I1224+1","v":39}]
[]
["ROLL NO :  ",{"$f":"VLOOKUP(I1257,Student_data,3,0)","v":139},null,"CLASS : ",{"$f":"IF('School Info'!$B$7=\"\",\"\",'School Info'!$B$7)","v":6},"DOB :",{"$f":"VLOOKUP(I1257,Student_data,4,0)","v":"2039-01-01"}]
["NAME :  ",{"$f":"VLOOKUP(I1257,Student_data,6,0)","v":"KARNA"},null,"MEDUIM : ",{"$f":"IF('School Info'!$E$7=\"\",\"\",'School Info'!$E$7)","v":"HINDI"},"GENDER :",{"$f":"VLOOKUP(I1257,Student_data,5,0)","v":"MALE"}]
["FATHER :  ",{"$f":"VLOOKUP(I1257,Student_data,7,0)","v":"BBB"},null,"SECTION : ",{"$f":"IF('School Info'!$F$8=\"\",\"\",'School Info'!$F$8)","v":"A"},"S.No. : ",{"$f":"VLOOKUP(I1257,Student_data,2,0)","v":0}]
["MOTHER :  ",{"$f":"VLOOKUP(I1257,Student_data,8,0)","v":"SSDDF"},null,"School DISE Code :",null,{"$f":"IF('School Info'!$B$5=\"\",\"\",'School Info'!$B$5)","v":123456890}]
[]
["SUBJECT","DATE","DAY","TIME "]
[{"$f":"IF('School Info'!$J$5=\"\",\"\",'School Info'!$J$5)","v":"HINDI"},{"$f":"IF('School Info'!$K$5=\"\",\"\",'School Info'!$K$5)","v":"2001-01-01"},{"$f":"IF('School Info'!$L$5=\"\",\"\",'School Info'!$L$5)","v":"MONDAY"},{"$f":"IF('School Info'!$M$5=\"\",\"\",'School Info'!$M$5)","v":"10:00AM TO 12:00PM"}]
[{"$f":"IF('School Info'!$J$6=\"\",\"\",'School Info'!$J$6)","v":"ENGLISH"},{"$f":"IF('School Info'!$K$6=\"\",\"\",'School Info'!$K$6)","v":"2001-01-01"},{"$f":"IF('School Info'!$L$6=\"\",\"\",'School Info'!$L$6)","v":"TUESDAY"},{"$f":"IF('School Info'!$M$6=\"\",\"\",'School Info'!$M$6)","v":"10:00AM TO 12:00PM"}]
[{"$f":"IF('School Info'!$J$7=\"\",\"\",'School Info'!$J$7)","v":"SCIENCE"},{"$f":"IF('School Info'!$K$7=\"\",\"\",'School Info'!$K$7)","v":"2001-01-01"},{"$f":"IF('School Info'!$L$7=\"\",\"\",'School Info'!$L$7)","v":"WEDNESDAY"},{"$f":"IF('School Info'!$M$7=\"\",\"\",'School Info'!$M$7)","v":"10:00AM TO 12:00PM"}]
[{"$f":"IF('School Info'!$J$8=\"\",\"\",'School Info'!$J$8)","v":"MATH"},{"$f":"IF('School Info'!$K$8=\"\",\"\",'School Info'!$K$8)","v":"2001-01-01"},{"$f":"IF('School Info'!$L$8=\"\",\"\",'School Info'!$L$8)","v":"THURSDAY"},{"$f":"IF('School Info'!$M$8=\"\",\"\",'School Info'!$M$8)","v":"10:00AM TO 12:00PM"}]
[{"$f":"IF('School Info'!$J$9=\"\",\"\",'School Info'!$J$9)","v":"SOCIAL SCIENCE"},{"$f":"IF('School Info'!$K$9=\"\",\"\",'School Info'!$K$9)","v":"2001-01-01"},{"$f":"IF('School Info'!$L$9=\"\",\"\",'School Info'!$L$9)","v":"FRIDAY"},{"$f":"IF('School Info'!$M$9=\"\",\"\",'School Info'!$M$9)","v":"10:00AM TO 12:00PM"}]
[{"$f":"IF('School Info'!$J$10=\"\",\"\",'School Info'!$J$10)","v":"SANSKRIT"},{"$f":"IF('School Info'!$K$10=\"\",\"\",'School Info'!$K$10)","v":"2001-01-01"},{"$f":"IF('School Info'!$L$10=\"\",\"\",'School Info'!$L$10)","v":"SATURDAY"},{"$f":"IF('School Info'!$M$10=\"\",\"\",'School Info'!$M$10)","v":"10:00AM TO 12:00PM"}]
[{"$f":"IF('School Info'!$J$11=\"\",\"\",'School Info'!$J$11)","v":""},{"$f":"IF('School Info'!$K$11=\"\",\"\",'School Info'!$K$11)","v":"2001-01-02"},{"$f":"IF('School Info'!$L$11=\"\",\"\",'School Info'!$L$11)","v":"SUNDAY"},{"$f":"IF('School Info'!$M$11=\"\",\"\",'School Info'!$M$11)","v":"10:00AM TO 12:00PM"}]
[{"$f":"IF('School Info'!$J$12=\"\",\"\",'School Info'!$J$12)","v":""},{"$f":"IF('School Info'!$K$12=\"\",\"\",'School Info'!$K$12)","v":"2001-01-03"},{"$f":"IF('School Info'!$L$12=\"\",\"\",'School Info'!$L$12)","v":"MONDAY"},{"$f":"IF('School Info'!$M$12=\"\",\"\",'School Info'!$M$12)","v":"10:00AM TO 12:00PM"}]
[{"$f":"IF('School Info'!$J$13=\"\",\"\",'School Info'!$J$13)","v":""},{"$f":"IF('School Info'!$K$13=\"\",\"\",'School Info'!$K$13)","v":"2001-01-04"},{"$f":"IF('School Info'!$L$13=\"\",\"\",'School Info'!$L$13)","v":"TUESDAY"},{"$f":"IF('School Info'!$M$13=\"\",\"\",'School Info'!$M$13)","v":"10:00AM TO 12:00PM"}]
[{"$f":"IF('School Info'!$J$14=\"\",\"\",'School Info'!$J$14)","v":""},{"$f":"IF('School Info'!$K$14=\"\",\"\",'School Info'!$K$14)","v":""},{"$f":"IF('School Info'!$L$14=\"\",\"\",'School Info'!$L$14)","v":""},{"$f":"IF('School Info'!$M$14=\"\",\"\",'School Info'!$M$14)","v":""}]
[]
["Note :"]
["1. परीक्षार्थी अपना प्रवेश पत्र रोजाना साथ लेकर आये | (Candidates should bring their admit card with them daily.)"]
["2. परीक्षार्थी परीक्षा केंद्र पर आधा घंटे पहले पहुचें | (Candidates should reach the examination center half an hour before.)"]
["3. परीक्षार्थी परीक्षा हेतु आवश्यक सामग्री साथ लेकर आवें | (Candidates should bring with them the necessary materials for the examination.)"]
[]
[]
[]
[]
[]
["Sig. Exam Incharge",null,null,null,null,null,"Sig. Principal "]
[".------------------------------------------------------- Cut Here------------------------------------------------------"]
[{"$f":"IF('School Info'!$B$4=\"\",\"\",'School Info'!$B$4)","v":"Mahatma Gandhi Government School Bar"}]
[null,null,"School Aff. Code :",null,{"$f":"IF('School Info'!$F$5=\"\",\"\",'School Info'!$F$5)","v":123456}]
[null,null,{"$f":"IF('School Info'!$H$5=\"\",\"\",'School Info'!$H$5)","v":"HALF YEARLY EXAM"},null,{"$f":"IF('School Info'!$H$7=\"\",\"\",'School Info'!$H$7)","v":"2025-26"}]
[null,null,"ADMIT CARD",null,null,null,null,null,{"$f":"I1257+1","v":40}]
[]
["ROLL NO :  ",{"$f":"VLOOKUP(I1290,Student_data,3,0)","v":140},null,"CLASS : ",{"$f":"IF('School Info'!$B$7=\"\",\"\",'School Info'!$B$7)","v":6},"DOB :",{"$f":"VLOOKUP(I1290,Student_data,4,0)","v":"2040-01-01"}]
["NAME :  ",{"$f":"VLOOKUP(I1290,Student_data,6,0)","v":"RAJA  "},null,"MEDUIM : ",{"$f":"IF('School Info'!$E$7=\"\",\"\",'School Info'!$E$7)","v":"HINDI"},"GENDER :",{"$f":"VLOOKUP(I1290,Student_data,5,0)","v":"MALE"}]
["FATHER :  ",{"$f":"VLOOKUP(I1290,Student_data,7,0)","v":"DFD"},null,"SECTION : ",{"$f":"IF('School Info'!$F$8=\"\",\"\",'School Info'!$F$8)","v":"A"},"S.No. : ",{"$f":"VLOOKUP(I1290,Student_data,2,0)","v":0}]
["MOTHER :  ",{"$f":"VLOOKUP(I1290,Student_data,8,0)","v":"GAG"},null,"School DISE Code :",null,{"$f":"IF('School Info'!$B$5=\"\",\"\",'School Info'!$B$5)","v":123456890}]
[]
["SUBJECT","DATE","DAY","TIME "]
[{"$f":"IF('School Info'!$J$5=\"\",\"\",'School Info'!$J$5)","v":"HINDI"},{"$f":"IF('School Info'!$K$5=\"\",\"\",'School Info'!$K$5)","v":"2001-01-01"},{"$f":"IF('School Info'!$L$5=\"\",\"\",'School Info'!$L$5)","v":"MONDAY"},{"$f":"IF('School Info'!$M$5=\"\",\"\",'School Info'!$M$5)","v":"10:00AM TO 12:00PM"}]
[{"$f":"IF('School Info'!$J$6=\"\",\"\",'School Info'!$J$6)","v":"ENGLISH"},{"$f":"IF('School Info'!$K$6=\"\",\"\",'School Info'!$K$6)","v":"2001-01-01"},{"$f":"IF('School Info'!$L$6=\"\",\"\",'School Info'!$L$6)","v":"TUESDAY"},{"$f":"IF('School Info'!$M$6=\"\",\"\",'School Info'!$M$6)","v":"10:00AM TO 12:00PM"}]
[{"$f":"IF('School Info'!$J$7=\"\",\"\",'School Info'!$J$7)","v":"SCIENCE"},{"$f":"IF('School Info'!$K$7=\"\",\"\",'School Info'!$K$7)","v":"2001-01-01"},{"$f":"IF('School Info'!$L$7=\"\",\"\",'School Info'!$L$7)","v":"WEDNESDAY"},{"$f":"IF('School Info'!$M$7=\"\",\"\",'School Info'!$M$7)","v":"10:00AM TO 12:00PM"}]
[{"$f":"IF('School Info'!$J$8=\"\",\"\",'School Info'!$J$8)","v":"MATH"},{"$f":"IF('School Info'!$K$8=\"\",\"\",'School Info'!$K$8)","v":"2001-01-01"},{"$f":"IF('School Info'!$L$8=\"\",\"\",'School Info'!$L$8)","v":"THURSDAY"},{"$f":"IF('School Info'!$M$8=\"\",\"\",'School Info'!$M$8)","v":"10:00AM TO 12:00PM"}]
[{"$f":"IF('School Info'!$J$9=\"\",\"\",'School Info'!$J$9)","v":"SOCIAL SCIENCE"},{"$f":"IF('School Info'!$K$9=\"\",\"\",'School Info'!$K$9)","v":"2001-01-01"},{"$f":"IF('School Info'!$L$9=\"\",\"\",'School Info'!$L$9)","v":"FRIDAY"},{"$f":"IF('School Info'!$M$9=\"\",\"\",'School Info'!$M$9)","v":"10:00AM TO 12:00PM"}]
[{"$f":"IF('School Info'!$J$10=\"\",\"\",'School Info'!$J$10)","v":"SANSKRIT"},{"$f":"IF('School Info'!$K$10=\"\",\"\",'School Info'!$K$10)","v":"2001-01-01"},{"$f":"IF('School Info'!$L$10=\"\",\"\",'School Info'!$L$10)","v":"SATURDAY"},{"$f":"IF('School Info'!$M$10=\"\",\"\",'School Info'!$M$10)","v":"10:00AM TO 12:00PM"}]
[{"$f":"IF('School Info'!$J$11=\"\",\"\",'School Info'!$J$11)","v":""},{"$f":"IF('School Info'!$K$11=\"\",\"\",'School Info'!$K$11)","v":"2001-01-02"},{"$f":"IF('School Info'!$L$11=\"\",\"\",'School Info'!$L$11)","v":"SUNDAY"},{"$f":"IF('School Info'!$M$11=\"\",\"\",'School Info'!$M$11)","v":"10:00AM TO 12:00PM"}]
[{"$f":"IF('School Info'!$J$12=\"\",\"\",'School Info'!$J$12)","v":""},{"$f":"IF('School Info'!$K$12=\"\",\"\",'School Info'!$K$12)","v":"2001-01-03"},{"$f":"IF('School Info'!$L$12=\"\",\"\",'School Info'!$L$12)","v":"MONDAY"},{"$f":"IF('School Info'!$M$12=\"\",\"\",'School Info'!$M$12)","v":"10:00AM TO 12:00PM"}]
[{"$f":"IF('School Info'!$J$13=\"\",\"\",'School Info'!$J$13)","v":""},{"$f":"IF('School Info'!$K$13=\"\",\"\",'School Info'!$K$13)","v":"2001-01-04"},{"$f":"IF('School Info'!$L$13=\"\",\"\",'School Info'!$L$13)","v":"TUESDAY"},{"$f":"IF('School Info'!$M$13=\"\",\"\",'School Info'!$M$13)","v":"10:00AM TO 12:00PM"}]
[{"$f":"IF('School Info'!$J$14=\"\",\"\",'School Info'!$J$14)","v":""},{"$f":"IF('School Info'!$K$14=\"\",\"\",'School Info'!$K$14)","v":""},{"$f":"IF('School Info'!$L$14=\"\",\"\",'School Info'!$L$14)","v":""},{"$f":"IF('School Info'!$M$14=\"\",\"\",'School Info'!$M$14)","v":""}]
[]
["Note :"]
["1. परीक्षार्थी अपना प्रवेश पत्र रोजाना साथ लेकर आये | (Candidates should bring their admit card with them daily.)"]
["2. परीक्षार्थी परीक्षा केंद्र पर आधा घंटे पहले पहुचें | (Candidates should reach the examination center half an hour before.)"]
["3. परीक्षार्थी परीक्षा हेतु आवश्यक सामग्री साथ लेकर आवें | (Candidates should bring with them the necessary materials for the examination.)"]
[]
[]
[]
[]
[]
["Sig. Exam Incharge",null,null,null,null,null,"Sig. Principal "]
[]
[{"$f":"IF('School Info'!$B$4=\"\",\"\",'School Info'!$B$4)","v":"Mahatma Gandhi Government School Bar"}]
[null,null,"School Aff. Code :",null,{"$f":"IF('School Info'!$F$5=\"\",\"\",'School Info'!$F$5)","v":123456}]
[null,null,{"$f":"IF('School Info'!$H$5=\"\",\"\",'School Info'!$H$5)","v":"HALF YEARLY EXAM"},null,{"$f":"IF('School Info'!$H$7=\"\",\"\",'School Info'!$H$7)","v":"2025-26"}]
[null,null,"ADMIT CARD",null,null,null,null,null,{"$f":"I1290+1","v":41}]
[]
["ROLL NO :  ",{"$f":"VLOOKUP(I1323,Student_data,3,0)","v":141},null,"CLASS : ",{"$f":"IF('School Info'!$B$7=\"\",\"\",'School Info'!$B$7)","v":6},"DOB :",{"$f":"VLOOKUP(I1323,Student_data,4,0)","v":"2041-01-01"}]
["NAME :  ",{"$f":"VLOOKUP(I1323,Student_data,6,0)","v":"RAJ GURUJI"},null,"MEDUIM : ",{"$f":"IF('School Info'!$E$7=\"\",\"\",'School Info'!$E$7)","v":"HINDI"},"GENDER :",{"$f":"VLOOKUP(I1323,Student_data,5,0)","v":"MALE"}]
["FATHER :  ",{"$f":"VLOOKUP(I1323,Student_data,7,0)","v":"RAJ"},null,"SECTION : ",{"$f":"IF('School Info'!$F$8=\"\",\"\",'School Info'!$F$8)","v":"A"},"S.No. : ",{"$f":"VLOOKUP(I1323,Student_data,2,0)","v":0}]
["MOTHER :  ",{"$f":"VLOOKUP(I1323,Student_data,8,0)","v":"DEVI"},null,"School DISE Code :",null,{"$f":"IF('School Info'!$B$5=\"\",\"\",'School Info'!$B$5)","v":123456890}]
[]
["SUBJECT","DATE","DAY","TIME "]
[{"$f":"IF('School Info'!$J$5=\"\",\"\",'School Info'!$J$5)","v":"HINDI"},{"$f":"IF('School Info'!$K$5=\"\",\"\",'School Info'!$K$5)","v":"2001-01-01"},{"$f":"IF('School Info'!$L$5=\"\",\"\",'School Info'!$L$5)","v":"MONDAY"},{"$f":"IF('School Info'!$M$5=\"\",\"\",'School Info'!$M$5)","v":"10:00AM TO 12:00PM"}]
[{"$f":"IF('School Info'!$J$6=\"\",\"\",'School Info'!$J$6)","v":"ENGLISH"},{"$f":"IF('School Info'!$K$6=\"\",\"\",'School Info'!$K$6)","v":"2001-01-01"},{"$f":"IF('School Info'!$L$6=\"\",\"\",'School Info'!$L$6)","v":"TUESDAY"},{"$f":"IF('School Info'!$M$6=\"\",\"\",'School Info'!$M$6)","v":"10:00AM TO 12:00PM"}]
[{"$f":"IF('School Info'!$J$7=\"\",\"\",'School Info'!$J$7)","v":"SCIENCE"},{"$f":"IF('School Info'!$K$7=\"\",\"\",'School Info'!$K$7)","v":"2001-01-01"},{"$f":"IF('School Info'!$L$7=\"\",\"\",'School Info'!$L$7)","v":"WEDNESDAY"},{"$f":"IF('School Info'!$M$7=\"\",\"\",'School Info'!$M$7)","v":"10:00AM TO 12:00PM"}]
[{"$f":"IF('School Info'!$J$8=\"\",\"\",'School Info'!$J$8)","v":"MATH"},{"$f":"IF('School Info'!$K$8=\"\",\"\",'School Info'!$K$8)","v":"2001-01-01"},{"$f":"IF('School Info'!$L$8=\"\",\"\",'School Info'!$L$8)","v":"THURSDAY"},{"$f":"IF('School Info'!$M$8=\"\",\"\",'School Info'!$M$8)","v":"10:00AM TO 12:00PM"}]
[{"$f":"IF('School Info'!$J$9=\"\",\"\",'School Info'!$J$9)","v":"SOCIAL SCIENCE"},{"$f":"IF('School Info'!$K$9=\"\",\"\",'School Info'!$K$9)","v":"2001-01-01"},{"$f":"IF('School Info'!$L$9=\"\",\"\",'School Info'!$L$9)","v":"FRIDAY"},{"$f":"IF('School Info'!$M$9=\"\",\"\",'School Info'!$M$9)","v":"10:00AM TO 12:00PM"}]
[{"$f":"IF('School Info'!$J$10=\"\",\"\",'School Info'!$J$10)","v":"SANSKRIT"},{"$f":"IF('School Info'!$K$10=\"\",\"\",'School Info'!$K$10)","v":"2001-01-01"},{"$f":"IF('School Info'!$L$10=\"\",\"\",'School Info'!$L$10)","v":"SATURDAY"},{"$f":"IF('School Info'!$M$10=\"\",\"\",'School Info'!$M$10)","v":"10:00AM TO 12:00PM"}]
[{"$f":"IF('School Info'!$J$11=\"\",\"\",'School Info'!$J$11)","v":""},{"$f":"IF('School Info'!$K$11=\"\",\"\",'School Info'!$K$11)","v":"2001-01-02"},{"$f":"IF('School Info'!$L$11=\"\",\"\",'School Info'!$L$11)","v":"SUNDAY"},{"$f":"IF('School Info'!$M$11=\"\",\"\",'School Info'!$M$11)","v":"10:00AM TO 12:00PM"}]
[{"$f":"IF('School Info'!$J$12=\"\",\"\",'School Info'!$J$12)","v":""},{"$f":"IF('School Info'!$K$12=\"\",\"\",'School Info'!$K$12)","v":"2001-01-03"},{"$f":"IF('School Info'!$L$12=\"\",\"\",'School Info'!$L$12)","v":"MONDAY"},{"$f":"IF('School Info'!$M$12=\"\",\"\",'School Info'!$M$12)","v":"10:00AM TO 12:00PM"}]
[{"$f":"IF('School Info'!$J$13=\"\",\"\",'School Info'!$J$13)","v":""},{"$f":"IF('School Info'!$K$13=\"\",\"\",'School Info'!$K$13)","v":"2001-01-04"},{"$f":"IF('School Info'!$L$13=\"\",\"\",'School Info'!$L$13)","v":"TUESDAY"},{"$f":"IF('School Info'!$M$13=\"\",\"\",'School Info'!$M$13)","v":"10:00AM TO 12:00PM"}]
[{"$f":"IF('School Info'!$J$14=\"\",\"\",'School Info'!$J$14)","v":""},{"$f":"IF('School Info'!$K$14=\"\",\"\",'School Info'!$K$14)","v":""},{"$f":"IF('School Info'!$L$14=\"\",\"\",'School Info'!$L$14)","v":""},{"$f":"IF('School Info'!$M$14=\"\",\"\",'School Info'!$M$14)","v":""}]
[]
["Note :"]
["1. परीक्षार्थी अपना प्रवेश पत्र रोजाना साथ लेकर आये | (Candidates should bring their admit card with them daily.)"]
["2. परीक्षार्थी परीक्षा केंद्र पर आधा घंटे पहले पहुचें | (Candidates should reach the examination center half an hour before.)"]
["3. परीक्षार्थी परीक्षा हेतु आवश्यक सामग्री साथ लेकर आवें | (Candidates should bring with them the necessary materials for the examination.)"]
[]
[]
[]
[]
[]
["Sig. Exam Incharge",null,null,null,null,null,"Sig. Principal "]
[".------------------------------------------------------- Cut Here------------------------------------------------------"]
[{"$f":"IF('School Info'!$B$4=\"\",\"\",'School Info'!$B$4)","v":"Mahatma Gandhi Government School Bar"}]
[null,null,"School Aff. Code :",null,{"$f":"IF('School Info'!$F$5=\"\",\"\",'School Info'!$F$5)","v":123456}]
[null,null,{"$f":"IF('School Info'!$H$5=\"\",\"\",'School Info'!$H$5)","v":"HALF YEARLY EXAM"},null,{"$f":"IF('School Info'!$H$7=\"\",\"\",'School Info'!$H$7)","v":"2025-26"}]
[null,null,"ADMIT CARD",null,null,null,null,null,{"$f":"I1323+1","v":42}]
[]
["ROLL NO :  ",{"$f":"VLOOKUP(I1356,Student_data,3,0)","v":142},null,"CLASS : ",{"$f":"IF('School Info'!$B$7=\"\",\"\",'School Info'!$B$7)","v":6},"DOB :",{"$f":"VLOOKUP(I1356,Student_data,4,0)","v":"2042-01-01"}]
["NAME :  ",{"$f":"VLOOKUP(I1356,Student_data,6,0)","v":"MONU"},null,"MEDUIM : ",{"$f":"IF('School Info'!$E$7=\"\",\"\",'School Info'!$E$7)","v":"HINDI"},"GENDER :",{"$f":"VLOOKUP(I1356,Student_data,5,0)","v":"MALE"}]
["FATHER :  ",{"$f":"VLOOKUP(I1356,Student_data,7,0)","v":"RAAA"},null,"SECTION : ",{"$f":"IF('School Info'!$F$8=\"\",\"\",'School Info'!$F$8)","v":"A"},"S.No. : ",{"$f":"VLOOKUP(I1356,Student_data,2,0)","v":0}]
["MOTHER :  ",{"$f":"VLOOKUP(I1356,Student_data,8,0)","v":"DDD"},null,"School DISE Code :",null,{"$f":"IF('School Info'!$B$5=\"\",\"\",'School Info'!$B$5)","v":123456890}]
[]
["SUBJECT","DATE","DAY","TIME "]
[{"$f":"IF('School Info'!$J$5=\"\",\"\",'School Info'!$J$5)","v":"HINDI"},{"$f":"IF('School Info'!$K$5=\"\",\"\",'School Info'!$K$5)","v":"2001-01-01"},{"$f":"IF('School Info'!$L$5=\"\",\"\",'School Info'!$L$5)","v":"MONDAY"},{"$f":"IF('School Info'!$M$5=\"\",\"\",'School Info'!$M$5)","v":"10:00AM TO 12:00PM"}]
[{"$f":"IF('School Info'!$J$6=\"\",\"\",'School Info'!$J$6)","v":"ENGLISH"},{"$f":"IF('School Info'!$K$6=\"\",\"\",'School Info'!$K$6)","v":"2001-01-01"},{"$f":"IF('School Info'!$L$6=\"\",\"\",'School Info'!$L$6)","v":"TUESDAY"},{"$f":"IF('School Info'!$M$6=\"\",\"\",'School Info'!$M$6)","v":"10:00AM TO 12:00PM"}]
[{"$f":"IF('School Info'!$J$7=\"\",\"\",'School Info'!$J$7)","v":"SCIENCE"},{"$f":"IF('School Info'!$K$7=\"\",\"\",'School Info'!$K$7)","v":"2001-01-01"},{"$f":"IF('School Info'!$L$7=\"\",\"\",'School Info'!$L$7)","v":"WEDNESDAY"},{"$f":"IF('School Info'!$M$7=\"\",\"\",'School Info'!$M$7)","v":"10:00AM TO 12:00PM"}]
[{"$f":"IF('School Info'!$J$8=\"\",\"\",'School Info'!$J$8)","v":"MATH"},{"$f":"IF('School Info'!$K$8=\"\",\"\",'School Info'!$K$8)","v":"2001-01-01"},{"$f":"IF('School Info'!$L$8=\"\",\"\",'School Info'!$L$8)","v":"THURSDAY"},{"$f":"IF('School Info'!$M$8=\"\",\"\",'School Info'!$M$8)","v":"10:00AM TO 12:00PM"}]
[{"$f":"IF('School Info'!$J$9=\"\",\"\",'School Info'!$J$9)","v":"SOCIAL SCIENCE"},{"$f":"IF('School Info'!$K$9=\"\",\"\",'School Info'!$K$9)","v":"2001-01-01"},{"$f":"IF('School Info'!$L$9=\"\",\"\",'School Info'!$L$9)","v":"FRIDAY"},{"$f":"IF('School Info'!$M$9=\"\",\"\",'School Info'!$M$9)","v":"10:00AM TO 12:00PM"}]
[{"$f":"IF('School Info'!$J$10=\"\",\"\",'School Info'!$J$10)","v":"SANSKRIT"},{"$f":"IF('School Info'!$K$10=\"\",\"\",'School Info'!$K$10)","v":"2001-01-01"},{"$f":"IF('School Info'!$L$10=\"\",\"\",'School Info'!$L$10)","v":"SATURDAY"},{"$f":"IF('School Info'!$M$10=\"\",\"\",'School Info'!$M$10)","v":"10:00AM TO 12:00PM"}]
[{"$f":"IF('School Info'!$J$11=\"\",\"\",'School Info'!$J$11)","v":""},{"$f":"IF('School Info'!$K$11=\"\",\"\",'School Info'!$K$11)","v":"2001-01-02"},{"$f":"IF('School Info'!$L$11=\"\",\"\",'School Info'!$L$11)","v":"SUNDAY"},{"$f":"IF('School Info'!$M$11=\"\",\"\",'School Info'!$M$11)","v":"10:00AM TO 12:00PM"}]
[{"$f":"IF('School Info'!$J$12=\"\",\"\",'School Info'!$J$12)","v":""},{"$f":"IF('School Info'!$K$12=\"\",\"\",'School Info'!$K$12)","v":"2001-01-03"},{"$f":"IF('School Info'!$L$12=\"\",\"\",'School Info'!$L$12)","v":"MONDAY"},{"$f":"IF('School Info'!$M$12=\"\",\"\",'School Info'!$M$12)","v":"10:00AM TO 12:00PM"}]
[{"$f":"IF('School Info'!$J$13=\"\",\"\",'School Info'!$J$13)","v":""},{"$f":"IF('School Info'!$K$13=\"\",\"\",'School Info'!$K$13)","v":"2001-01-04"},{"$f":"IF('School Info'!$L$13=\"\",\"\",'School Info'!$L$13)","v":"TUESDAY"},{"$f":"IF('School Info'!$M$13=\"\",\"\",'School Info'!$M$13)","v":"10:00AM TO 12:00PM"}]
[{"$f":"IF('School Info'!$J$14=\"\",\"\",'School Info'!$J$14)","v":""},{"$f":"IF('School Info'!$K$14=\"\",\"\",'School Info'!$K$14)","v":""},{"$f":"IF('School Info'!$L$14=\"\",\"\",'School Info'!$L$14)","v":""},{"$f":"IF('School Info'!$M$14=\"\",\"\",'School Info'!$M$14)","v":""}]
[]
["Note :"]
["1. परीक्षार्थी अपना प्रवेश पत्र रोजाना साथ लेकर आये | (Candidates should bring their admit card with them daily.)"]
["2. परीक्षार्थी परीक्षा केंद्र पर आधा घंटे पहले पहुचें | (Candidates should reach the examination center half an hour before.)"]
["3. परीक्षार्थी परीक्षा हेतु आवश्यक सामग्री साथ लेकर आवें | (Candidates should bring with them the necessary materials for the examination.)"]
[]
[]
[]
[]
[]
["Sig. Exam Incharge",null,null,null,null,null,"Sig. Principal "]
[]
[{"$f":"IF('School Info'!$B$4=\"\",\"\",'School Info'!$B$4)","v":"Mahatma Gandhi Government School Bar"}]
[null,null,"School Aff. Code :",null,{"$f":"IF('School Info'!$F$5=\"\",\"\",'School Info'!$F$5)","v":123456}]
[null,null,{"$f":"IF('School Info'!$H$5=\"\",\"\",'School Info'!$H$5)","v":"HALF YEARLY EXAM"},null,{"$f":"IF('School Info'!$H$7=\"\",\"\",'School Info'!$H$7)","v":"2025-26"}]
[null,null,"ADMIT CARD",null,null,null,null,null,{"$f":"I1356+1","v":43}]
[]
["ROLL NO :  ",{"$f":"VLOOKUP(I1389,Student_data,3,0)","v":143},null,"CLASS : ",{"$f":"IF('School Info'!$B$7=\"\",\"\",'School Info'!$B$7)","v":6},"DOB :",{"$f":"VLOOKUP(I1389,Student_data,4,0)","v":"2043-01-01"}]
["NAME :  ",{"$f":"VLOOKUP(I1389,Student_data,6,0)","v":"SONU"},null,"MEDUIM : ",{"$f":"IF('School Info'!$E$7=\"\",\"\",'School Info'!$E$7)","v":"HINDI"},"GENDER :",{"$f":"VLOOKUP(I1389,Student_data,5,0)","v":"MALE"}]
["FATHER :  ",{"$f":"VLOOKUP(I1389,Student_data,7,0)","v":"AAA"},null,"SECTION : ",{"$f":"IF('School Info'!$F$8=\"\",\"\",'School Info'!$F$8)","v":"A"},"S.No. : ",{"$f":"VLOOKUP(I1389,Student_data,2,0)","v":0}]
["MOTHER :  ",{"$f":"VLOOKUP(I1389,Student_data,8,0)","v":"DDS"},null,"School DISE Code :",null,{"$f":"IF('School Info'!$B$5=\"\",\"\",'School Info'!$B$5)","v":123456890}]
[]
["SUBJECT","DATE","DAY","TIME "]
[{"$f":"IF('School Info'!$J$5=\"\",\"\",'School Info'!$J$5)","v":"HINDI"},{"$f":"IF('School Info'!$K$5=\"\",\"\",'School Info'!$K$5)","v":"2001-01-01"},{"$f":"IF('School Info'!$L$5=\"\",\"\",'School Info'!$L$5)","v":"MONDAY"},{"$f":"IF('School Info'!$M$5=\"\",\"\",'School Info'!$M$5)","v":"10:00AM TO 12:00PM"}]
[{"$f":"IF('School Info'!$J$6=\"\",\"\",'School Info'!$J$6)","v":"ENGLISH"},{"$f":"IF('School Info'!$K$6=\"\",\"\",'School Info'!$K$6)","v":"2001-01-01"},{"$f":"IF('School Info'!$L$6=\"\",\"\",'School Info'!$L$6)","v":"TUESDAY"},{"$f":"IF('School Info'!$M$6=\"\",\"\",'School Info'!$M$6)","v":"10:00AM TO 12:00PM"}]
[{"$f":"IF('School Info'!$J$7=\"\",\"\",'School Info'!$J$7)","v":"SCIENCE"},{"$f":"IF('School Info'!$K$7=\"\",\"\",'School Info'!$K$7)","v":"2001-01-01"},{"$f":"IF('School Info'!$L$7=\"\",\"\",'School Info'!$L$7)","v":"WEDNESDAY"},{"$f":"IF('School Info'!$M$7=\"\",\"\",'School Info'!$M$7)","v":"10:00AM TO 12:00PM"}]
[{"$f":"IF('School Info'!$J$8=\"\",\"\",'School Info'!$J$8)","v":"MATH"},{"$f":"IF('School Info'!$K$8=\"\",\"\",'School Info'!$K$8)","v":"2001-01-01"},{"$f":"IF('School Info'!$L$8=\"\",\"\",'School Info'!$L$8)","v":"THURSDAY"},{"$f":"IF('School Info'!$M$8=\"\",\"\",'School Info'!$M$8)","v":"10:00AM TO 12:00PM"}]
[{"$f":"IF('School Info'!$J$9=\"\",\"\",'School Info'!$J$9)","v":"SOCIAL SCIENCE"},{"$f":"IF('School Info'!$K$9=\"\",\"\",'School Info'!$K$9)","v":"2001-01-01"},{"$f":"IF('School Info'!$L$9=\"\",\"\",'School Info'!$L$9)","v":"FRIDAY"},{"$f":"IF('School Info'!$M$9=\"\",\"\",'School Info'!$M$9)","v":"10:00AM TO 12:00PM"}]
[{"$f":"IF('School Info'!$J$10=\"\",\"\",'School Info'!$J$10)","v":"SANSKRIT"},{"$f":"IF('School Info'!$K$10=\"\",\"\",'School Info'!$K$10)","v":"2001-01-01"},{"$f":"IF('School Info'!$L$10=\"\",\"\",'School Info'!$L$10)","v":"SATURDAY"},{"$f":"IF('School Info'!$M$10=\"\",\"\",'School Info'!$M$10)","v":"10:00AM TO 12:00PM"}]
[]
["Note :"]
["1. परीक्षार्थी अपना प्रवेश पत्र रोजाना साथ लेकर आये | (Candidates should bring their admit card with them daily.)"]
["2. परीक्षार्थी परीक्षा केंद्र पर आधा घंटे पहले पहुचें | (Candidates should reach the examination center half an hour before.)"]
["3. परीक्षार्थी परीक्षा हेतु आवश्यक सामग्री साथ लेकर आवें | (Candidates should bring with them the necessary materials for the examination.)"]
[]
[]
[]
[]
[]
["Sig. Exam Incharge",null,null,null,null,null,"Sig. Principal "]
[".------------------------------------------------------- Cut Here------------------------------------------------------"]
[{"$f":"IF('School Info'!$B$4=\"\",\"\",'School Info'!$B$4)","v":"Mahatma Gandhi Government School Bar"}]
[null,null,"School Aff. Code :",null,{"$f":"IF('School Info'!$F$5=\"\",\"\",'School Info'!$F$5)","v":123456}]
[null,null,{"$f":"IF('School Info'!$H$5=\"\",\"\",'School Info'!$H$5)","v":"HALF YEARLY EXAM"},null,{"$f":"IF('School Info'!$H$7=\"\",\"\",'School Info'!$H$7)","v":"2025-26"}]
[null,null,"ADMIT CARD",null,null,null,null,null,{"$f":"I1389+1","v":44}]
[]
["ROLL NO :  ",{"$f":"VLOOKUP(I1418,Student_data,3,0)","v":144},null,"CLASS : ",{"$f":"IF('School Info'!$B$7=\"\",\"\",'School Info'!$B$7)","v":6},"DOB :",{"$f":"VLOOKUP(I1418,Student_data,4,0)","v":"2044-01-01"}]
["NAME :  ",{"$f":"VLOOKUP(I1418,Student_data,6,0)","v":"KARNA"},null,"MEDUIM : ",{"$f":"IF('School Info'!$E$7=\"\",\"\",'School Info'!$E$7)","v":"HINDI"},"GENDER :",{"$f":"VLOOKUP(I1418,Student_data,5,0)","v":"MALE"}]
["FATHER :  ",{"$f":"VLOOKUP(I1418,Student_data,7,0)","v":"BBB"},null,"SECTION : ",{"$f":"IF('School Info'!$F$8=\"\",\"\",'School Info'!$F$8)","v":"A"},"S.No. : ",{"$f":"VLOOKUP(I1418,Student_data,2,0)","v":0}]
["MOTHER :  ",{"$f":"VLOOKUP(I1418,Student_data,8,0)","v":"SSDDF"},null,"School DISE Code :",null,{"$f":"IF('School Info'!$B$5=\"\",\"\",'School Info'!$B$5)","v":123456890}]
[]
["SUBJECT","DATE","DAY","TIME "]
[{"$f":"IF('School Info'!$J$5=\"\",\"\",'School Info'!$J$5)","v":"HINDI"},{"$f":"IF('School Info'!$K$5=\"\",\"\",'School Info'!$K$5)","v":"2001-01-01"},{"$f":"IF('School Info'!$L$5=\"\",\"\",'School Info'!$L$5)","v":"MONDAY"},{"$f":"IF('School Info'!$M$5=\"\",\"\",'School Info'!$M$5)","v":"10:00AM TO 12:00PM"}]
[{"$f":"IF('School Info'!$J$6=\"\",\"\",'School Info'!$J$6)","v":"ENGLISH"},{"$f":"IF('School Info'!$K$6=\"\",\"\",'School Info'!$K$6)","v":"2001-01-01"},{"$f":"IF('School Info'!$L$6=\"\",\"\",'School Info'!$L$6)","v":"TUESDAY"},{"$f":"IF('School Info'!$M$6=\"\",\"\",'School Info'!$M$6)","v":"10:00AM TO 12:00PM"}]
[{"$f":"IF('School Info'!$J$7=\"\",\"\",'School Info'!$J$7)","v":"SCIENCE"},{"$f":"IF('School Info'!$K$7=\"\",\"\",'School Info'!$K$7)","v":"2001-01-01"},{"$f":"IF('School Info'!$L$7=\"\",\"\",'School Info'!$L$7)","v":"WEDNESDAY"},{"$f":"IF('School Info'!$M$7=\"\",\"\",'School Info'!$M$7)","v":"10:00AM TO 12:00PM"}]
[{"$f":"IF('School Info'!$J$8=\"\",\"\",'School Info'!$J$8)","v":"MATH"},{"$f":"IF('School Info'!$K$8=\"\",\"\",'School Info'!$K$8)","v":"2001-01-01"},{"$f":"IF('School Info'!$L$8=\"\",\"\",'School Info'!$L$8)","v":"THURSDAY"},{"$f":"IF('School Info'!$M$8=\"\",\"\",'School Info'!$M$8)","v":"10:00AM TO 12:00PM"}]
[{"$f":"IF('School Info'!$J$9=\"\",\"\",'School Info'!$J$9)","v":"SOCIAL SCIENCE"},{"$f":"IF('School Info'!$K$9=\"\",\"\",'School Info'!$K$9)","v":"2001-01-01"},{"$f":"IF('School Info'!$L$9=\"\",\"\",'School Info'!$L$9)","v":"FRIDAY"},{"$f":"IF('School Info'!$M$9=\"\",\"\",'School Info'!$M$9)","v":"10:00AM TO 12:00PM"}]
[{"$f":"IF('School Info'!$J$10=\"\",\"\",'School Info'!$J$10)","v":"SANSKRIT"},{"$f":"IF('School Info'!$K$10=\"\",\"\",'School Info'!$K$10)","v":"2001-01-01"},{"$f":"IF('School Info'!$L$10=\"\",\"\",'School Info'!$L$10)","v":"SATURDAY"},{"$f":"IF('School Info'!$M$10=\"\",\"\",'School Info'!$M$10)","v":"10:00AM TO 12:00PM"}]
[]
["Note :"]
["1. परीक्षार्थी अपना प्रवेश पत्र रोजाना साथ लेकर आये | (Candidates should bring their admit card with them daily.)"]
["2. परीक्षार्थी परीक्षा केंद्र पर आधा घंटे पहले पहुचें | (Candidates should reach the examination center half an hour before.)"]
["3. परीक्षार्थी परीक्षा हेतु आवश्यक सामग्री साथ लेकर आवें | (Candidates should bring with them the necessary materials for the examination.)"]
[]
[]
[]
[]
[]
["Sig. Exam Incharge",null,null,null,null,null,"Sig. Principal "]
[]
[{"$f":"IF('School Info'!$B$4=\"\",\"\",'School Info'!$B$4)","v":"Mahatma Gandhi Government School Bar"}]
[null,null,"School Aff. Code :",null,{"$f":"IF('School Info'!$F$5=\"\",\"\",'School Info'!$F$5)","v":123456}]
[null,null,{"$f":"IF('School Info'!$H$5=\"\",\"\",'School Info'!$H$5)","v":"HALF YEARLY EXAM"},null,{"$f":"IF('School Info'!$H$7=\"\",\"\",'School Info'!$H$7)","v":"2025-26"}]
[null,null,"ADMIT CARD",null,null,null,null,null,{"$f":"I1418+1","v":45}]
[]
["ROLL NO :  ",{"$f":"VLOOKUP(I1447,Student_data,3,0)","v":145},null,"CLASS : ",{"$f":"IF('School Info'!$B$7=\"\",\"\",'School Info'!$B$7)","v":6},"DOB :",{"$f":"VLOOKUP(I1447,Student_data,4,0)","v":"2045-01-01"}]
["NAME :  ",{"$f":"VLOOKUP(I1447,Student_data,6,0)","v":"RAJA  "},null,"MEDUIM : ",{"$f":"IF('School Info'!$E$7=\"\",\"\",'School Info'!$E$7)","v":"HINDI"},"GENDER :",{"$f":"VLOOKUP(I1447,Student_data,5,0)","v":"MALE"}]
["FATHER :  ",{"$f":"VLOOKUP(I1447,Student_data,7,0)","v":"DFD"},null,"SECTION : ",{"$f":"IF('School Info'!$F$8=\"\",\"\",'School Info'!$F$8)","v":"A"},"S.No. : ",{"$f":"VLOOKUP(I1447,Student_data,2,0)","v":0}]
["MOTHER :  ",{"$f":"VLOOKUP(I1447,Student_data,8,0)","v":"GAG"},null,"School DISE Code :",null,{"$f":"IF('School Info'!$B$5=\"\",\"\",'School Info'!$B$5)","v":123456890}]
[]
["SUBJECT","DATE","DAY","TIME "]
[{"$f":"IF('School Info'!$J$5=\"\",\"\",'School Info'!$J$5)","v":"HINDI"},{"$f":"IF('School Info'!$K$5=\"\",\"\",'School Info'!$K$5)","v":"2001-01-01"},{"$f":"IF('School Info'!$L$5=\"\",\"\",'School Info'!$L$5)","v":"MONDAY"},{"$f":"IF('School Info'!$M$5=\"\",\"\",'School Info'!$M$5)","v":"10:00AM TO 12:00PM"}]
[{"$f":"IF('School Info'!$J$6=\"\",\"\",'School Info'!$J$6)","v":"ENGLISH"},{"$f":"IF('School Info'!$K$6=\"\",\"\",'School Info'!$K$6)","v":"2001-01-01"},{"$f":"IF('School Info'!$L$6=\"\",\"\",'School Info'!$L$6)","v":"TUESDAY"},{"$f":"IF('School Info'!$M$6=\"\",\"\",'School Info'!$M$6)","v":"10:00AM TO 12:00PM"}]
[{"$f":"IF('School Info'!$J$7=\"\",\"\",'School Info'!$J$7)","v":"SCIENCE"},{"$f":"IF('School Info'!$K$7=\"\",\"\",'School Info'!$K$7)","v":"2001-01-01"},{"$f":"IF('School Info'!$L$7=\"\",\"\",'School Info'!$L$7)","v":"WEDNESDAY"},{"$f":"IF('School Info'!$M$7=\"\",\"\",'School Info'!$M$7)","v":"10:00AM TO 12:00PM"}]
[{"$f":"IF('School Info'!$J$8=\"\",\"\",'School Info'!$J$8)","v":"MATH"},{"$f":"IF('School Info'!$K$8=\"\",\"\",'School Info'!$K$8)","v":"2001-01-01"},{"$f":"IF('School Info'!$L$8=\"\",\"\",'School Info'!$L$8)","v":"THURSDAY"},{"$f":"IF('School Info'!$M$8=\"\",\"\",'School Info'!$M$8)","v":"10:00AM TO 12:00PM"}]
[{"$f":"IF('School Info'!$J$9=\"\",\"\",'School Info'!$J$9)","v":"SOCIAL SCIENCE"},{"$f":"IF('School Info'!$K$9=\"\",\"\",'School Info'!$K$9)","v":"2001-01-01"},{"$f":"IF('School Info'!$L$9=\"\",\"\",'School Info'!$L$9)","v":"FRIDAY"},{"$f":"IF('School Info'!$M$9=\"\",\"\",'School Info'!$M$9)","v":"10:00AM TO 12:00PM"}]
[{"$f":"IF('School Info'!$J$10=\"\",\"\",'School Info'!$J$10)","v":"SANSKRIT"},{"$f":"IF('School Info'!$K$10=\"\",\"\",'School Info'!$K$10)","v":"2001-01-01"},{"$f":"IF('School Info'!$L$10=\"\",\"\",'School Info'!$L$10)","v":"SATURDAY"},{"$f":"IF('School Info'!$M$10=\"\",\"\",'School Info'!$M$10)","v":"10:00AM TO 12:00PM"}]
[]
["Note :"]
["1. परीक्षार्थी अपना प्रवेश पत्र रोजाना साथ लेकर आये | (Candidates should bring their admit card with them daily.)"]
["2. परीक्षार्थी परीक्षा केंद्र पर आधा घंटे पहले पहुचें | (Candidates should reach the examination center half an hour before.)"]
["3. परीक्षार्थी परीक्षा हेतु आवश्यक सामग्री साथ लेकर आवें | (Candidates should bring with them the necessary materials for the examination.)"]
[]
[]
[]
[]
[]
["Sig. Exam Incharge",null,null,null,null,null,"Sig. Principal "]
[".------------------------------------------------------- Cut Here------------------------------------------------------"]
[{"$f":"IF('School Info'!$B$4=\"\",\"\",'School Info'!$B$4)","v":"Mahatma Gandhi Government School Bar"}]
[null,null,"School Aff. Code :",null,{"$f":"IF('School Info'!$F$5=\"\",\"\",'School Info'!$F$5)","v":123456}]
[null,null,{"$f":"IF('School Info'!$H$5=\"\",\"\",'School Info'!$H$5)","v":"HALF YEARLY EXAM"},null,{"$f":"IF('School Info'!$H$7=\"\",\"\",'School Info'!$H$7)","v":"2025-26"}]
[null,null,"ADMIT CARD",null,null,null,null,null,{"$f":"I1447+1","v":46}]
[]
["ROLL NO :  ",{"$f":"VLOOKUP(I1476,Student_data,3,0)","v":146},null,"CLASS : ",{"$f":"IF('School Info'!$B$7=\"\",\"\",'School Info'!$B$7)","v":6},"DOB :",{"$f":"VLOOKUP(I1476,Student_data,4,0)","v":"2046-01-01"}]
["NAME :  ",{"$f":"VLOOKUP(I1476,Student_data,6,0)","v":"RAJ GURUJI"},null,"MEDUIM : ",{"$f":"IF('School Info'!$E$7=\"\",\"\",'School Info'!$E$7)","v":"HINDI"},"GENDER :",{"$f":"VLOOKUP(I1476,Student_data,5,0)","v":"MALE"}]
["FATHER :  ",{"$f":"VLOOKUP(I1476,Student_data,7,0)","v":"RAJ"},null,"SECTION : ",{"$f":"IF('School Info'!$F$8=\"\",\"\",'School Info'!$F$8)","v":"A"},"S.No. : ",{"$f":"VLOOKUP(I1476,Student_data,2,0)","v":0}]
["MOTHER :  ",{"$f":"VLOOKUP(I1476,Student_data,8,0)","v":"DEVI"},null,"School DISE Code :",null,{"$f":"IF('School Info'!$B$5=\"\",\"\",'School Info'!$B$5)","v":123456890}]
[]
["SUBJECT","DATE","DAY","TIME "]
[{"$f":"IF('School Info'!$J$5=\"\",\"\",'School Info'!$J$5)","v":"HINDI"},{"$f":"IF('School Info'!$K$5=\"\",\"\",'School Info'!$K$5)","v":"2001-01-01"},{"$f":"IF('School Info'!$L$5=\"\",\"\",'School Info'!$L$5)","v":"MONDAY"},{"$f":"IF('School Info'!$M$5=\"\",\"\",'School Info'!$M$5)","v":"10:00AM TO 12:00PM"}]
[{"$f":"IF('School Info'!$J$6=\"\",\"\",'School Info'!$J$6)","v":"ENGLISH"},{"$f":"IF('School Info'!$K$6=\"\",\"\",'School Info'!$K$6)","v":"2001-01-01"},{"$f":"IF('School Info'!$L$6=\"\",\"\",'School Info'!$L$6)","v":"TUESDAY"},{"$f":"IF('School Info'!$M$6=\"\",\"\",'School Info'!$M$6)","v":"10:00AM TO 12:00PM"}]
[{"$f":"IF('School Info'!$J$7=\"\",\"\",'School Info'!$J$7)","v":"SCIENCE"},{"$f":"IF('School Info'!$K$7=\"\",\"\",'School Info'!$K$7)","v":"2001-01-01"},{"$f":"IF('School Info'!$L$7=\"\",\"\",'School Info'!$L$7)","v":"WEDNESDAY"},{"$f":"IF('School Info'!$M$7=\"\",\"\",'School Info'!$M$7)","v":"10:00AM TO 12:00PM"}]
[{"$f":"IF('School Info'!$J$8=\"\",\"\",'School Info'!$J$8)","v":"MATH"},{"$f":"IF('School Info'!$K$8=\"\",\"\",'School Info'!$K$8)","v":"2001-01-01"},{"$f":"IF('School Info'!$L$8=\"\",\"\",'School Info'!$L$8)","v":"THURSDAY"},{"$f":"IF('School Info'!$M$8=\"\",\"\",'School Info'!$M$8)","v":"10:00AM TO 12:00PM"}]
[{"$f":"IF('School Info'!$J$9=\"\",\"\",'School Info'!$J$9)","v":"SOCIAL SCIENCE"},{"$f":"IF('School Info'!$K$9=\"\",\"\",'School Info'!$K$9)","v":"2001-01-01"},{"$f":"IF('School Info'!$L$9=\"\",\"\",'School Info'!$L$9)","v":"FRIDAY"},{"$f":"IF('School Info'!$M$9=\"\",\"\",'School Info'!$M$9)","v":"10:00AM TO 12:00PM"}]
[{"$f":"IF('School Info'!$J$10=\"\",\"\",'School Info'!$J$10)","v":"SANSKRIT"},{"$f":"IF('School Info'!$K$10=\"\",\"\",'School Info'!$K$10)","v":"2001-01-01"},{"$f":"IF('School Info'!$L$10=\"\",\"\",'School Info'!$L$10)","v":"SATURDAY"},{"$f":"IF('School Info'!$M$10=\"\",\"\",'School Info'!$M$10)","v":"10:00AM TO 12:00PM"}]
[]
["Note :"]
["1. परीक्षार्थी अपना प्रवेश पत्र रोजाना साथ लेकर आये | (Candidates should bring their admit card with them daily.)"]
["2. परीक्षार्थी परीक्षा केंद्र पर आधा घंटे पहले पहुचें | (Candidates should reach the examination center half an hour before.)"]
["3. परीक्षार्थी परीक्षा हेतु आवश्यक सामग्री साथ लेकर आवें | (Candidates should bring with them the necessary materials for the examination.)"]
[]
[]
[]
[]
[]
["Sig. Exam Incharge",null,null,null,null,null,"Sig. Principal "]
[]
[{"$f":"IF('School Info'!$B$4=\"\",\"\",'School Info'!$B$4)","v":"Mahatma Gandhi Government School Bar"}]
[null,null,"School Aff. Code :",null,{"$f":"IF('School Info'!$F$5=\"\",\"\",'School Info'!$F$5)","v":123456}]
[null,null,{"$f":"IF('School Info'!$H$5=\"\",\"\",'School Info'!$H$5)","v":"HALF YEARLY EXAM"},null,{"$f":"IF('School Info'!$H$7=\"\",\"\",'School Info'!$H$7)","v":"2025-26"}]
[null,null,"ADMIT CARD",null,null,null,null,null,{"$f":"I1476+1","v":47}]
[]
["ROLL NO :  ",{"$f":"VLOOKUP(I1505,Student_data,3,0)","v":147},null,"CLASS : ",{"$f":"IF('School Info'!$B$7=\"\",\"\",'School Info'!$B$7)","v":6},"DOB :",{"$f":"VLOOKUP(I1505,Student_data,4,0)","v":"2047-01-01"}]
["NAME :  ",{"$f":"VLOOKUP(I1505,Student_data,6,0)","v":"MONU"},null,"MEDUIM : ",{"$f":"IF('School Info'!$E$7=\"\",\"\",'School Info'!$E$7)","v":"HINDI"},"GENDER :",{"$f":"VLOOKUP(I1505,Student_data,5,0)","v":"MALE"}]
["FATHER :  ",{"$f":"VLOOKUP(I1505,Student_data,7,0)","v":"RAAA"},null,"SECTION : ",{"$f":"IF('School Info'!$F$8=\"\",\"\",'School Info'!$F$8)","v":"A"},"S.No. : ",{"$f":"VLOOKUP(I1505,Student_data,2,0)","v":0}]
["MOTHER :  ",{"$f":"VLOOKUP(I1505,Student_data,8,0)","v":"DDD"},null,"School DISE Code :",null,{"$f":"IF('School Info'!$B$5=\"\",\"\",'School Info'!$B$5)","v":123456890}]
[]
["SUBJECT","DATE","DAY","TIME "]
[{"$f":"IF('School Info'!$J$5=\"\",\"\",'School Info'!$J$5)","v":"HINDI"},{"$f":"IF('School Info'!$K$5=\"\",\"\",'School Info'!$K$5)","v":"2001-01-01"},{"$f":"IF('School Info'!$L$5=\"\",\"\",'School Info'!$L$5)","v":"MONDAY"},{"$f":"IF('School Info'!$M$5=\"\",\"\",'School Info'!$M$5)","v":"10:00AM TO 12:00PM"}]
[{"$f":"IF('School Info'!$J$6=\"\",\"\",'School Info'!$J$6)","v":"ENGLISH"},{"$f":"IF('School Info'!$K$6=\"\",\"\",'School Info'!$K$6)","v":"2001-01-01"},{"$f":"IF('School Info'!$L$6=\"\",\"\",'School Info'!$L$6)","v":"TUESDAY"},{"$f":"IF('School Info'!$M$6=\"\",\"\",'School Info'!$M$6)","v":"10:00AM TO 12:00PM"}]
[{"$f":"IF('School Info'!$J$7=\"\",\"\",'School Info'!$J$7)","v":"SCIENCE"},{"$f":"IF('School Info'!$K$7=\"\",\"\",'School Info'!$K$7)","v":"2001-01-01"},{"$f":"IF('School Info'!$L$7=\"\",\"\",'School Info'!$L$7)","v":"WEDNESDAY"},{"$f":"IF('School Info'!$M$7=\"\",\"\",'School Info'!$M$7)","v":"10:00AM TO 12:00PM"}]
[{"$f":"IF('School Info'!$J$8=\"\",\"\",'School Info'!$J$8)","v":"MATH"},{"$f":"IF('School Info'!$K$8=\"\",\"\",'School Info'!$K$8)","v":"2001-01-01"},{"$f":"IF('School Info'!$L$8=\"\",\"\",'School Info'!$L$8)","v":"THURSDAY"},{"$f":"IF('School Info'!$M$8=\"\",\"\",'School Info'!$M$8)","v":"10:00AM TO 12:00PM"}]
[{"$f":"IF('School Info'!$J$9=\"\",\"\",'School Info'!$J$9)","v":"SOCIAL SCIENCE"},{"$f":"IF('School Info'!$K$9=\"\",\"\",'School Info'!$K$9)","v":"2001-01-01"},{"$f":"IF('School Info'!$L$9=\"\",\"\",'School Info'!$L$9)","v":"FRIDAY"},{"$f":"IF('School Info'!$M$9=\"\",\"\",'School Info'!$M$9)","v":"10:00AM TO 12:00PM"}]
[{"$f":"IF('School Info'!$J$10=\"\",\"\",'School Info'!$J$10)","v":"SANSKRIT"},{"$f":"IF('School Info'!$K$10=\"\",\"\",'School Info'!$K$10)","v":"2001-01-01"},{"$f":"IF('School Info'!$L$10=\"\",\"\",'School Info'!$L$10)","v":"SATURDAY"},{"$f":"IF('School Info'!$M$10=\"\",\"\",'School Info'!$M$10)","v":"10:00AM TO 12:00PM"}]
[]
["Note :"]
["1. परीक्षार्थी अपना प्रवेश पत्र रोजाना साथ लेकर आये | (Candidates should bring their admit card with them daily.)"]
["2. परीक्षार्थी परीक्षा केंद्र पर आधा घंटे पहले पहुचें | (Candidates should reach the examination center half an hour before.)"]
["3. परीक्षार्थी परीक्षा हेतु आवश्यक सामग्री साथ लेकर आवें | (Candidates should bring with them the necessary materials for the examination.)"]
[]
[]
[]
[]
[]
["Sig. Exam Incharge",null,null,null,null,null,"Sig. Principal "]
[".------------------------------------------------------- Cut Here------------------------------------------------------"]
[{"$f":"IF('School Info'!$B$4=\"\",\"\",'School Info'!$B$4)","v":"Mahatma Gandhi Government School Bar"}]
[null,null,"School Aff. Code :",null,{"$f":"IF('School Info'!$F$5=\"\",\"\",'School Info'!$F$5)","v":123456}]
[null,null,{"$f":"IF('School Info'!$H$5=\"\",\"\",'School Info'!$H$5)","v":"HALF YEARLY EXAM"},null,{"$f":"IF('School Info'!$H$7=\"\",\"\",'School Info'!$H$7)","v":"2025-26"}]
[null,null,"ADMIT CARD",null,null,null,null,null,{"$f":"I1505+1","v":48}]
[]
["ROLL NO :  ",{"$f":"VLOOKUP(I1534,Student_data,3,0)","v":148},null,"CLASS : ",{"$f":"IF('School Info'!$B$7=\"\",\"\",'School Info'!$B$7)","v":6},"DOB :",{"$f":"VLOOKUP(I1534,Student_data,4,0)","v":"2048-01-01"}]
["NAME :  ",{"$f":"VLOOKUP(I1534,Student_data,6,0)","v":"SONU"},null,"MEDUIM : ",{"$f":"IF('School Info'!$E$7=\"\",\"\",'School Info'!$E$7)","v":"HINDI"},"GENDER :",{"$f":"VLOOKUP(I1534,Student_data,5,0)","v":"MALE"}]
["FATHER :  ",{"$f":"VLOOKUP(I1534,Student_data,7,0)","v":"AAA"},null,"SECTION : ",{"$f":"IF('School Info'!$F$8=\"\",\"\",'School Info'!$F$8)","v":"A"},"S.No. : ",{"$f":"VLOOKUP(I1534,Student_data,2,0)","v":0}]
["MOTHER :  ",{"$f":"VLOOKUP(I1534,Student_data,8,0)","v":"DDS"},null,"School DISE Code :",null,{"$f":"IF('School Info'!$B$5=\"\",\"\",'School Info'!$B$5)","v":123456890}]
[]
["SUBJECT","DATE","DAY","TIME "]
[{"$f":"IF('School Info'!$J$5=\"\",\"\",'School Info'!$J$5)","v":"HINDI"},{"$f":"IF('School Info'!$K$5=\"\",\"\",'School Info'!$K$5)","v":"2001-01-01"},{"$f":"IF('School Info'!$L$5=\"\",\"\",'School Info'!$L$5)","v":"MONDAY"},{"$f":"IF('School Info'!$M$5=\"\",\"\",'School Info'!$M$5)","v":"10:00AM TO 12:00PM"}]
[{"$f":"IF('School Info'!$J$6=\"\",\"\",'School Info'!$J$6)","v":"ENGLISH"},{"$f":"IF('School Info'!$K$6=\"\",\"\",'School Info'!$K$6)","v":"2001-01-01"},{"$f":"IF('School Info'!$L$6=\"\",\"\",'School Info'!$L$6)","v":"TUESDAY"},{"$f":"IF('School Info'!$M$6=\"\",\"\",'School Info'!$M$6)","v":"10:00AM TO 12:00PM"}]
[{"$f":"IF('School Info'!$J$7=\"\",\"\",'School Info'!$J$7)","v":"SCIENCE"},{"$f":"IF('School Info'!$K$7=\"\",\"\",'School Info'!$K$7)","v":"2001-01-01"},{"$f":"IF('School Info'!$L$7=\"\",\"\",'School Info'!$L$7)","v":"WEDNESDAY"},{"$f":"IF('School Info'!$M$7=\"\",\"\",'School Info'!$M$7)","v":"10:00AM TO 12:00PM"}]
[{"$f":"IF('School Info'!$J$8=\"\",\"\",'School Info'!$J$8)","v":"MATH"},{"$f":"IF('School Info'!$K$8=\"\",\"\",'School Info'!$K$8)","v":"2001-01-01"},{"$f":"IF('School Info'!$L$8=\"\",\"\",'School Info'!$L$8)","v":"THURSDAY"},{"$f":"IF('School Info'!$M$8=\"\",\"\",'School Info'!$M$8)","v":"10:00AM TO 12:00PM"}]
[{"$f":"IF('School Info'!$J$9=\"\",\"\",'School Info'!$J$9)","v":"SOCIAL SCIENCE"},{"$f":"IF('School Info'!$K$9=\"\",\"\",'School Info'!$K$9)","v":"2001-01-01"},{"$f":"IF('School Info'!$L$9=\"\",\"\",'School Info'!$L$9)","v":"FRIDAY"},{"$f":"IF('School Info'!$M$9=\"\",\"\",'School Info'!$M$9)","v":"10:00AM TO 12:00PM"}]
[{"$f":"IF('School Info'!$J$10=\"\",\"\",'School Info'!$J$10)","v":"SANSKRIT"},{"$f":"IF('School Info'!$K$10=\"\",\"\",'School Info'!$K$10)","v":"2001-01-01"},{"$f":"IF('School Info'!$L$10=\"\",\"\",'School Info'!$L$10)","v":"SATURDAY"},{"$f":"IF('School Info'!$M$10=\"\",\"\",'School Info'!$M$10)","v":"10:00AM TO 12:00PM"}]
[]
["Note :"]
["1. परीक्षार्थी अपना प्रवेश पत्र रोजाना साथ लेकर आये | (Candidates should bring their admit card with them daily.)"]
["2. परीक्षार्थी परीक्षा केंद्र पर आधा घंटे पहले पहुचें | (Candidates should reach the examination center half an hour before.)"]
["3. परीक्षार्थी परीक्षा हेतु आवश्यक सामग्री साथ लेकर आवें | (Candidates should bring with them the necessary materials for the examination.)"]
[]
[]
[]
[]
[]
["Sig. Exam Incharge",null,null,null,null,null,"Sig. Principal "]
[]
[{"$f":"IF('School Info'!$B$4=\"\",\"\",'School Info'!$B$4)","v":"Mahatma Gandhi Government School Bar"}]
[null,null,"School Aff. Code :",null,{"$f":"IF('School Info'!$F$5=\"\",\"\",'School Info'!$F$5)","v":123456}]
[null,null,{"$f":"IF('School Info'!$H$5=\"\",\"\",'School Info'!$H$5)","v":"HALF YEARLY EXAM"},null,{"$f":"IF('School Info'!$H$7=\"\",\"\",'School Info'!$H$7)","v":"2025-26"}]
[null,null,"ADMIT CARD",null,null,null,null,null,{"$f":"I1534+1","v":49}]
[]
["ROLL NO :  ",{"$f":"VLOOKUP(I1563,Student_data,3,0)","v":149},null,"CLASS : ",{"$f":"IF('School Info'!$B$7=\"\",\"\",'School Info'!$B$7)","v":6},"DOB :",{"$f":"VLOOKUP(I1563,Student_data,4,0)","v":"2049-01-01"}]
["NAME :  ",{"$f":"VLOOKUP(I1563,Student_data,6,0)","v":"KARNA"},null,"MEDUIM : ",{"$f":"IF('School Info'!$E$7=\"\",\"\",'School Info'!$E$7)","v":"HINDI"},"GENDER :",{"$f":"VLOOKUP(I1563,Student_data,5,0)","v":"MALE"}]
["FATHER :  ",{"$f":"VLOOKUP(I1563,Student_data,7,0)","v":"BBB"},null,"SECTION : ",{"$f":"IF('School Info'!$F$8=\"\",\"\",'School Info'!$F$8)","v":"A"},"S.No. : ",{"$f":"VLOOKUP(I1563,Student_data,2,0)","v":0}]
["MOTHER :  ",{"$f":"VLOOKUP(I1563,Student_data,8,0)","v":"SSDDF"},null,"School DISE Code :",null,{"$f":"IF('School Info'!$B$5=\"\",\"\",'School Info'!$B$5)","v":123456890}]
[]
["SUBJECT","DATE","DAY","TIME "]
[{"$f":"IF('School Info'!$J$5=\"\",\"\",'School Info'!$J$5)","v":"HINDI"},{"$f":"IF('School Info'!$K$5=\"\",\"\",'School Info'!$K$5)","v":"2001-01-01"},{"$f":"IF('School Info'!$L$5=\"\",\"\",'School Info'!$L$5)","v":"MONDAY"},{"$f":"IF('School Info'!$M$5=\"\",\"\",'School Info'!$M$5)","v":"10:00AM TO 12:00PM"}]
[{"$f":"IF('School Info'!$J$6=\"\",\"\",'School Info'!$J$6)","v":"ENGLISH"},{"$f":"IF('School Info'!$K$6=\"\",\"\",'School Info'!$K$6)","v":"2001-01-01"},{"$f":"IF('School Info'!$L$6=\"\",\"\",'School Info'!$L$6)","v":"TUESDAY"},{"$f":"IF('School Info'!$M$6=\"\",\"\",'School Info'!$M$6)","v":"10:00AM TO 12:00PM"}]
[{"$f":"IF('School Info'!$J$7=\"\",\"\",'School Info'!$J$7)","v":"SCIENCE"},{"$f":"IF('School Info'!$K$7=\"\",\"\",'School Info'!$K$7)","v":"2001-01-01"},{"$f":"IF('School Info'!$L$7=\"\",\"\",'School Info'!$L$7)","v":"WEDNESDAY"},{"$f":"IF('School Info'!$M$7=\"\",\"\",'School Info'!$M$7)","v":"10:00AM TO 12:00PM"}]
[{"$f":"IF('School Info'!$J$8=\"\",\"\",'School Info'!$J$8)","v":"MATH"},{"$f":"IF('School Info'!$K$8=\"\",\"\",'School Info'!$K$8)","v":"2001-01-01"},{"$f":"IF('School Info'!$L$8=\"\",\"\",'School Info'!$L$8)","v":"THURSDAY"},{"$f":"IF('School Info'!$M$8=\"\",\"\",'School Info'!$M$8)","v":"10:00AM TO 12:00PM"}]
[{"$f":"IF('School Info'!$J$9=\"\",\"\",'School Info'!$J$9)","v":"SOCIAL SCIENCE"},{"$f":"IF('School Info'!$K$9=\"\",\"\",'School Info'!$K$9)","v":"2001-01-01"},{"$f":"IF('School Info'!$L$9=\"\",\"\",'School Info'!$L$9)","v":"FRIDAY"},{"$f":"IF('School Info'!$M$9=\"\",\"\",'School Info'!$M$9)","v":"10:00AM TO 12:00PM"}]
[{"$f":"IF('School Info'!$J$10=\"\",\"\",'School Info'!$J$10)","v":"SANSKRIT"},{"$f":"IF('School Info'!$K$10=\"\",\"\",'School Info'!$K$10)","v":"2001-01-01"},{"$f":"IF('School Info'!$L$10=\"\",\"\",'School Info'!$L$10)","v":"SATURDAY"},{"$f":"IF('School Info'!$M$10=\"\",\"\",'School Info'!$M$10)","v":"10:00AM TO 12:00PM"}]
[]
["Note :"]
["1. परीक्षार्थी अपना प्रवेश पत्र रोजाना साथ लेकर आये | (Candidates should bring their admit card with them daily.)"]
["2. परीक्षार्थी परीक्षा केंद्र पर आधा घंटे पहले पहुचें | (Candidates should reach the examination center half an hour before.)"]
["3. परीक्षार्थी परीक्षा हेतु आवश्यक सामग्री साथ लेकर आवें | (Candidates should bring with them the necessary materials for the examination.)"]
[]
[]
[]
[]
[]
["Sig. Exam Incharge",null,null,null,null,null,"Sig. Principal "]
[".------------------------------------------------------- Cut Here------------------------------------------------------"]
[{"$f":"IF('School Info'!$B$4=\"\",\"\",'School Info'!$B$4)","v":"Mahatma Gandhi Government School Bar"}]
[null,null,"School Aff. Code :",null,{"$f":"IF('School Info'!$F$5=\"\",\"\",'School Info'!$F$5)","v":123456}]
[null,null,{"$f":"IF('School Info'!$H$5=\"\",\"\",'School Info'!$H$5)","v":"HALF YEARLY EXAM"},null,{"$f":"IF('School Info'!$H$7=\"\",\"\",'School Info'!$H$7)","v":"2025-26"}]
[null,null,"ADMIT CARD",null,null,null,null,null,{"$f":"I1563+1","v":50}]
[]
["ROLL NO :  ",{"$f":"VLOOKUP(I1592,Student_data,3,0)","v":150},null,"CLASS : ",{"$f":"IF('School Info'!$B$7=\"\",\"\",'School Info'!$B$7)","v":6},"DOB :",{"$f":"VLOOKUP(I1592,Student_data,4,0)","v":"2050-01-01"}]
["NAME :  ",{"$f":"VLOOKUP(I1592,Student_data,6,0)","v":"RAJA  "},null,"MEDUIM : ",{"$f":"IF('School Info'!$E$7=\"\",\"\",'School Info'!$E$7)","v":"HINDI"},"GENDER :",{"$f":"VLOOKUP(I1592,Student_data,5,0)","v":"MALE"}]
["FATHER :  ",{"$f":"VLOOKUP(I1592,Student_data,7,0)","v":"DFD"},null,"SECTION : ",{"$f":"IF('School Info'!$F$8=\"\",\"\",'School Info'!$F$8)","v":"A"},"S.No. : ",{"$f":"VLOOKUP(I1592,Student_data,2,0)","v":0}]
["MOTHER :  ",{"$f":"VLOOKUP(I1592,Student_data,8,0)","v":"GAG"},null,"School DISE Code :",null,{"$f":"IF('School Info'!$B$5=\"\",\"\",'School Info'!$B$5)","v":123456890}]
[]
["SUBJECT","DATE","DAY","TIME "]
[{"$f":"IF('School Info'!$J$5=\"\",\"\",'School Info'!$J$5)","v":"HINDI"},{"$f":"IF('School Info'!$K$5=\"\",\"\",'School Info'!$K$5)","v":"2001-01-01"},{"$f":"IF('School Info'!$L$5=\"\",\"\",'School Info'!$L$5)","v":"MONDAY"},{"$f":"IF('School Info'!$M$5=\"\",\"\",'School Info'!$M$5)","v":"10:00AM TO 12:00PM"}]
[{"$f":"IF('School Info'!$J$6=\"\",\"\",'School Info'!$J$6)","v":"ENGLISH"},{"$f":"IF('School Info'!$K$6=\"\",\"\",'School Info'!$K$6)","v":"2001-01-01"},{"$f":"IF('School Info'!$L$6=\"\",\"\",'School Info'!$L$6)","v":"TUESDAY"},{"$f":"IF('School Info'!$M$6=\"\",\"\",'School Info'!$M$6)","v":"10:00AM TO 12:00PM"}]
[{"$f":"IF('School Info'!$J$7=\"\",\"\",'School Info'!$J$7)","v":"SCIENCE"},{"$f":"IF('School Info'!$K$7=\"\",\"\",'School Info'!$K$7)","v":"2001-01-01"},{"$f":"IF('School Info'!$L$7=\"\",\"\",'School Info'!$L$7)","v":"WEDNESDAY"},{"$f":"IF('School Info'!$M$7=\"\",\"\",'School Info'!$M$7)","v":"10:00AM TO 12:00PM"}]
[{"$f":"IF('School Info'!$J$8=\"\",\"\",'School Info'!$J$8)","v":"MATH"},{"$f":"IF('School Info'!$K$8=\"\",\"\",'School Info'!$K$8)","v":"2001-01-01"},{"$f":"IF('School Info'!$L$8=\"\",\"\",'School Info'!$L$8)","v":"THURSDAY"},{"$f":"IF('School Info'!$M$8=\"\",\"\",'School Info'!$M$8)","v":"10:00AM TO 12:00PM"}]
[{"$f":"IF('School Info'!$J$9=\"\",\"\",'School Info'!$J$9)","v":"SOCIAL SCIENCE"},{"$f":"IF('School Info'!$K$9=\"\",\"\",'School Info'!$K$9)","v":"2001-01-01"},{"$f":"IF('School Info'!$L$9=\"\",\"\",'School Info'!$L$9)","v":"FRIDAY"},{"$f":"IF('School Info'!$M$9=\"\",\"\",'School Info'!$M$9)","v":"10:00AM TO 12:00PM"}]
[{"$f":"IF('School Info'!$J$10=\"\",\"\",'School Info'!$J$10)","v":"SANSKRIT"},{"$f":"IF('School Info'!$K$10=\"\",\"\",'School Info'!$K$10)","v":"2001-01-01"},{"$f":"IF('School Info'!$L$10=\"\",\"\",'School Info'!$L$10)","v":"SATURDAY"},{"$f":"IF('School Info'!$M$10=\"\",\"\",'School Info'!$M$10)","v":"10:00AM TO 12:00PM"}]
[]
["Note :"]
["1. परीक्षार्थी अपना प्रवेश पत्र रोजाना साथ लेकर आये | (Candidates should bring their admit card with them daily.)"]
["2. परीक्षार्थी परीक्षा केंद्र पर आधा घंटे पहले पहुचें | (Candidates should reach the examination center half an hour before.)"]
["3. परीक्षार्थी परीक्षा हेतु आवश्यक सामग्री साथ लेकर आवें | (Candidates should bring with them the necessary materials for the examination.)"]
[]
[]
[]
[]
[]
["Sig. Exam Incharge",null,null,null,null,null,"Sig. Principal "]
[]
[{"$f":"IF('School Info'!$B$4=\"\",\"\",'School Info'!$B$4)","v":"Mahatma Gandhi Government School Bar"}]
[null,null,"School Aff. Code :",null,{"$f":"IF('School Info'!$F$5=\"\",\"\",'School Info'!$F$5)","v":123456}]
[null,null,{"$f":"IF('School Info'!$H$5=\"\",\"\",'School Info'!$H$5)","v":"HALF YEARLY EXAM"},null,{"$f":"IF('School Info'!$H$7=\"\",\"\",'School Info'!$H$7)","v":"2025-26"}]
[null,null,"ADMIT CARD",null,null,null,null,null,{"$f":"I1592+1","v":51}]
[]
["ROLL NO :  ",{"$f":"VLOOKUP(I1621,Student_data,3,0)","v":151},null,"CLASS : ",{"$f":"IF('School Info'!$B$7=\"\",\"\",'School Info'!$B$7)","v":6},"DOB :",{"$f":"VLOOKUP(I1621,Student_data,4,0)","v":"2051-01-01"}]
["NAME :  ",{"$f":"VLOOKUP(I1621,Student_data,6,0)","v":"RAJ GURUJI"},null,"MEDUIM : ",{"$f":"IF('School Info'!$E$7=\"\",\"\",'School Info'!$E$7)","v":"HINDI"},"GENDER :",{"$f":"VLOOKUP(I1621,Student_data,5,0)","v":"MALE"}]
["FATHER :  ",{"$f":"VLOOKUP(I1621,Student_data,7,0)","v":"RAJ"},null,"SECTION : ",{"$f":"IF('School Info'!$F$8=\"\",\"\",'School Info'!$F$8)","v":"A"},"S.No. : ",{"$f":"VLOOKUP(I1621,Student_data,2,0)","v":0}]
["MOTHER :  ",{"$f":"VLOOKUP(I1621,Student_data,8,0)","v":"DEVI"},null,"School DISE Code :",null,{"$f":"IF('School Info'!$B$5=\"\",\"\",'School Info'!$B$5)","v":123456890}]
[]
["SUBJECT","DATE","DAY","TIME "]
[{"$f":"IF('School Info'!$J$5=\"\",\"\",'School Info'!$J$5)","v":"HINDI"},{"$f":"IF('School Info'!$K$5=\"\",\"\",'School Info'!$K$5)","v":"2001-01-01"},{"$f":"IF('School Info'!$L$5=\"\",\"\",'School Info'!$L$5)","v":"MONDAY"},{"$f":"IF('School Info'!$M$5=\"\",\"\",'School Info'!$M$5)","v":"10:00AM TO 12:00PM"}]
[{"$f":"IF('School Info'!$J$6=\"\",\"\",'School Info'!$J$6)","v":"ENGLISH"},{"$f":"IF('School Info'!$K$6=\"\",\"\",'School Info'!$K$6)","v":"2001-01-01"},{"$f":"IF('School Info'!$L$6=\"\",\"\",'School Info'!$L$6)","v":"TUESDAY"},{"$f":"IF('School Info'!$M$6=\"\",\"\",'School Info'!$M$6)","v":"10:00AM TO 12:00PM"}]
[{"$f":"IF('School Info'!$J$7=\"\",\"\",'School Info'!$J$7)","v":"SCIENCE"},{"$f":"IF('School Info'!$K$7=\"\",\"\",'School Info'!$K$7)","v":"2001-01-01"},{"$f":"IF('School Info'!$L$7=\"\",\"\",'School Info'!$L$7)","v":"WEDNESDAY"},{"$f":"IF('School Info'!$M$7=\"\",\"\",'School Info'!$M$7)","v":"10:00AM TO 12:00PM"}]
[{"$f":"IF('School Info'!$J$8=\"\",\"\",'School Info'!$J$8)","v":"MATH"},{"$f":"IF('School Info'!$K$8=\"\",\"\",'School Info'!$K$8)","v":"2001-01-01"},{"$f":"IF('School Info'!$L$8=\"\",\"\",'School Info'!$L$8)","v":"THURSDAY"},{"$f":"IF('School Info'!$M$8=\"\",\"\",'School Info'!$M$8)","v":"10:00AM TO 12:00PM"}]
[{"$f":"IF('School Info'!$J$9=\"\",\"\",'School Info'!$J$9)","v":"SOCIAL SCIENCE"},{"$f":"IF('School Info'!$K$9=\"\",\"\",'School Info'!$K$9)","v":"2001-01-01"},{"$f":"IF('School Info'!$L$9=\"\",\"\",'School Info'!$L$9)","v":"FRIDAY"},{"$f":"IF('School Info'!$M$9=\"\",\"\",'School Info'!$M$9)","v":"10:00AM TO 12:00PM"}]
[{"$f":"IF('School Info'!$J$10=\"\",\"\",'School Info'!$J$10)","v":"SANSKRIT"},{"$f":"IF('School Info'!$K$10=\"\",\"\",'School Info'!$K$10)","v":"2001-01-01"},{"$f":"IF('School Info'!$L$10=\"\",\"\",'School Info'!$L$10)","v":"SATURDAY"},{"$f":"IF('School Info'!$M$10=\"\",\"\",'School Info'!$M$10)","v":"10:00AM TO 12:00PM"}]
[]
["Note :"]
["1. परीक्षार्थी अपना प्रवेश पत्र रोजाना साथ लेकर आये | (Candidates should bring their admit card with them daily.)"]
["2. परीक्षार्थी परीक्षा केंद्र पर आधा घंटे पहले पहुचें | (Candidates should reach the examination center half an hour before.)"]
["3. परीक्षार्थी परीक्षा हेतु आवश्यक सामग्री साथ लेकर आवें | (Candidates should bring with them the necessary materials for the examination.)"]
[]
[]
[]
[]
[]
["Sig. Exam Incharge",null,null,null,null,null,"Sig. Principal "]
[".------------------------------------------------------- Cut Here------------------------------------------------------"]
[{"$f":"IF('School Info'!$B$4=\"\",\"\",'School Info'!$B$4)","v":"Mahatma Gandhi Government School Bar"}]
[null,null,"School Aff. Code :",null,{"$f":"IF('School Info'!$F$5=\"\",\"\",'School Info'!$F$5)","v":123456}]
[null,null,{"$f":"IF('School Info'!$H$5=\"\",\"\",'School Info'!$H$5)","v":"HALF YEARLY EXAM"},null,{"$f":"IF('School Info'!$H$7=\"\",\"\",'School Info'!$H$7)","v":"2025-26"}]
[null,null,"ADMIT CARD",null,null,null,null,null,{"$f":"I1621+1","v":52}]
[]
["ROLL NO :  ",{"$f":"VLOOKUP(I1650,Student_data,3,0)","v":152},null,"CLASS : ",{"$f":"IF('School Info'!$B$7=\"\",\"\",'School Info'!$B$7)","v":6},"DOB :",{"$f":"VLOOKUP(I1650,Student_data,4,0)","v":"2052-01-01"}]
["NAME :  ",{"$f":"VLOOKUP(I1650,Student_data,6,0)","v":"MONU"},null,"MEDUIM : ",{"$f":"IF('School Info'!$E$7=\"\",\"\",'School Info'!$E$7)","v":"HINDI"},"GENDER :",{"$f":"VLOOKUP(I1650,Student_data,5,0)","v":"MALE"}]
["FATHER :  ",{"$f":"VLOOKUP(I1650,Student_data,7,0)","v":"RAAA"},null,"SECTION : ",{"$f":"IF('School Info'!$F$8=\"\",\"\",'School Info'!$F$8)","v":"A"},"S.No. : ",{"$f":"VLOOKUP(I1650,Student_data,2,0)","v":0}]
["MOTHER :  ",{"$f":"VLOOKUP(I1650,Student_data,8,0)","v":"DDD"},null,"School DISE Code :",null,{"$f":"IF('School Info'!$B$5=\"\",\"\",'School Info'!$B$5)","v":123456890}]
[]
["SUBJECT","DATE","DAY","TIME "]
[{"$f":"IF('School Info'!$J$5=\"\",\"\",'School Info'!$J$5)","v":"HINDI"},{"$f":"IF('School Info'!$K$5=\"\",\"\",'School Info'!$K$5)","v":"2001-01-01"},{"$f":"IF('School Info'!$L$5=\"\",\"\",'School Info'!$L$5)","v":"MONDAY"},{"$f":"IF('School Info'!$M$5=\"\",\"\",'School Info'!$M$5)","v":"10:00AM TO 12:00PM"}]
[{"$f":"IF('School Info'!$J$6=\"\",\"\",'School Info'!$J$6)","v":"ENGLISH"},{"$f":"IF('School Info'!$K$6=\"\",\"\",'School Info'!$K$6)","v":"2001-01-01"},{"$f":"IF('School Info'!$L$6=\"\",\"\",'School Info'!$L$6)","v":"TUESDAY"},{"$f":"IF('School Info'!$M$6=\"\",\"\",'School Info'!$M$6)","v":"10:00AM TO 12:00PM"}]
[{"$f":"IF('School Info'!$J$7=\"\",\"\",'School Info'!$J$7)","v":"SCIENCE"},{"$f":"IF('School Info'!$K$7=\"\",\"\",'School Info'!$K$7)","v":"2001-01-01"},{"$f":"IF('School Info'!$L$7=\"\",\"\",'School Info'!$L$7)","v":"WEDNESDAY"},{"$f":"IF('School Info'!$M$7=\"\",\"\",'School Info'!$M$7)","v":"10:00AM TO 12:00PM"}]
[{"$f":"IF('School Info'!$J$8=\"\",\"\",'School Info'!$J$8)","v":"MATH"},{"$f":"IF('School Info'!$K$8=\"\",\"\",'School Info'!$K$8)","v":"2001-01-01"},{"$f":"IF('School Info'!$L$8=\"\",\"\",'School Info'!$L$8)","v":"THURSDAY"},{"$f":"IF('School Info'!$M$8=\"\",\"\",'School Info'!$M$8)","v":"10:00AM TO 12:00PM"}]
[{"$f":"IF('School Info'!$J$9=\"\",\"\",'School Info'!$J$9)","v":"SOCIAL SCIENCE"},{"$f":"IF('School Info'!$K$9=\"\",\"\",'School Info'!$K$9)","v":"2001-01-01"},{"$f":"IF('School Info'!$L$9=\"\",\"\",'School Info'!$L$9)","v":"FRIDAY"},{"$f":"IF('School Info'!$M$9=\"\",\"\",'School Info'!$M$9)","v":"10:00AM TO 12:00PM"}]
[{"$f":"IF('School Info'!$J$10=\"\",\"\",'School Info'!$J$10)","v":"SANSKRIT"},{"$f":"IF('School Info'!$K$10=\"\",\"\",'School Info'!$K$10)","v":"2001-01-01"},{"$f":"IF('School Info'!$L$10=\"\",\"\",'School Info'!$L$10)","v":"SATURDAY"},{"$f":"IF('School Info'!$M$10=\"\",\"\",'School Info'!$M$10)","v":"10:00AM TO 12:00PM"}]
[]
["Note :"]
["1. परीक्षार्थी अपना प्रवेश पत्र रोजाना साथ लेकर आये | (Candidates should bring their admit card with them daily.)"]
["2. परीक्षार्थी परीक्षा केंद्र पर आधा घंटे पहले पहुचें | (Candidates should reach the examination center half an hour before.)"]
["3. परीक्षार्थी परीक्षा हेतु आवश्यक सामग्री साथ लेकर आवें | (Candidates should bring with them the necessary materials for the examination.)"]
[]
[]
[]
[]
[]
["Sig. Exam Incharge",null,null,null,null,null,"Sig. Principal "]
[]
[{"$f":"IF('School Info'!$B$4=\"\",\"\",'School Info'!$B$4)","v":"Mahatma Gandhi Government School Bar"}]
[null,null,"School Aff. Code :",null,{"$f":"IF('School Info'!$F$5=\"\",\"\",'School Info'!$F$5)","v":123456}]
[null,null,{"$f":"IF('School Info'!$H$5=\"\",\"\",'School Info'!$H$5)","v":"HALF YEARLY EXAM"},null,{"$f":"IF('School Info'!$H$7=\"\",\"\",'School Info'!$H$7)","v":"2025-26"}]
[null,null,"ADMIT CARD",null,null,null,null,null,{"$f":"I1650+1","v":53}]
[]
["ROLL NO :  ",{"$f":"VLOOKUP(I1679,Student_data,3,0)","v":153},null,"CLASS : ",{"$f":"IF('School Info'!$B$7=\"\",\"\",'School Info'!$B$7)","v":6},"DOB :",{"$f":"VLOOKUP(I1679,Student_data,4,0)","v":"2053-01-01"}]
["NAME :  ",{"$f":"VLOOKUP(I1679,Student_data,6,0)","v":"SONU"},null,"MEDUIM : ",{"$f":"IF('School Info'!$E$7=\"\",\"\",'School Info'!$E$7)","v":"HINDI"},"GENDER :",{"$f":"VLOOKUP(I1679,Student_data,5,0)","v":"MALE"}]
["FATHER :  ",{"$f":"VLOOKUP(I1679,Student_data,7,0)","v":"AAA"},null,"SECTION : ",{"$f":"IF('School Info'!$F$8=\"\",\"\",'School Info'!$F$8)","v":"A"},"S.No. : ",{"$f":"VLOOKUP(I1679,Student_data,2,0)","v":0}]
["MOTHER :  ",{"$f":"VLOOKUP(I1679,Student_data,8,0)","v":"DDS"},null,"School DISE Code :",null,{"$f":"IF('School Info'!$B$5=\"\",\"\",'School Info'!$B$5)","v":123456890}]
[]
["SUBJECT","DATE","DAY","TIME "]
[{"$f":"IF('School Info'!$J$5=\"\",\"\",'School Info'!$J$5)","v":"HINDI"},{"$f":"IF('School Info'!$K$5=\"\",\"\",'School Info'!$K$5)","v":"2001-01-01"},{"$f":"IF('School Info'!$L$5=\"\",\"\",'School Info'!$L$5)","v":"MONDAY"},{"$f":"IF('School Info'!$M$5=\"\",\"\",'School Info'!$M$5)","v":"10:00AM TO 12:00PM"}]
[{"$f":"IF('School Info'!$J$6=\"\",\"\",'School Info'!$J$6)","v":"ENGLISH"},{"$f":"IF('School Info'!$K$6=\"\",\"\",'School Info'!$K$6)","v":"2001-01-01"},{"$f":"IF('School Info'!$L$6=\"\",\"\",'School Info'!$L$6)","v":"TUESDAY"},{"$f":"IF('School Info'!$M$6=\"\",\"\",'School Info'!$M$6)","v":"10:00AM TO 12:00PM"}]
[{"$f":"IF('School Info'!$J$7=\"\",\"\",'School Info'!$J$7)","v":"SCIENCE"},{"$f":"IF('School Info'!$K$7=\"\",\"\",'School Info'!$K$7)","v":"2001-01-01"},{"$f":"IF('School Info'!$L$7=\"\",\"\",'School Info'!$L$7)","v":"WEDNESDAY"},{"$f":"IF('School Info'!$M$7=\"\",\"\",'School Info'!$M$7)","v":"10:00AM TO 12:00PM"}]
[{"$f":"IF('School Info'!$J$8=\"\",\"\",'School Info'!$J$8)","v":"MATH"},{"$f":"IF('School Info'!$K$8=\"\",\"\",'School Info'!$K$8)","v":"2001-01-01"},{"$f":"IF('School Info'!$L$8=\"\",\"\",'School Info'!$L$8)","v":"THURSDAY"},{"$f":"IF('School Info'!$M$8=\"\",\"\",'School Info'!$M$8)","v":"10:00AM TO 12:00PM"}]
[{"$f":"IF('School Info'!$J$9=\"\",\"\",'School Info'!$J$9)","v":"SOCIAL SCIENCE"},{"$f":"IF('School Info'!$K$9=\"\",\"\",'School Info'!$K$9)","v":"2001-01-01"},{"$f":"IF('School Info'!$L$9=\"\",\"\",'School Info'!$L$9)","v":"FRIDAY"},{"$f":"IF('School Info'!$M$9=\"\",\"\",'School Info'!$M$9)","v":"10:00AM TO 12:00PM"}]
[{"$f":"IF('School Info'!$J$10=\"\",\"\",'School Info'!$J$10)","v":"SANSKRIT"},{"$f":"IF('School Info'!$K$10=\"\",\"\",'School Info'!$K$10)","v":"2001-01-01"},{"$f":"IF('School Info'!$L$10=\"\",\"\",'School Info'!$L$10)","v":"SATURDAY"},{"$f":"IF('School Info'!$M$10=\"\",\"\",'School Info'!$M$10)","v":"10:00AM TO 12:00PM"}]
[]
["Note :"]
["1. परीक्षार्थी अपना प्रवेश पत्र रोजाना साथ लेकर आये | (Candidates should bring their admit card with them daily.)"]
["2. परीक्षार्थी परीक्षा केंद्र पर आधा घंटे पहले पहुचें | (Candidates should reach the examination center half an hour before.)"]
["3. परीक्षार्थी परीक्षा हेतु आवश्यक सामग्री साथ लेकर आवें | (Candidates should bring with them the necessary materials for the examination.)"]
[]
[]
[]
[]
[]
["Sig. Exam Incharge",null,null,null,null,null,"Sig. Principal "]
[".------------------------------------------------------- Cut Here------------------------------------------------------"]
[{"$f":"IF('School Info'!$B$4=\"\",\"\",'School Info'!$B$4)","v":"Mahatma Gandhi Government School Bar"}]
[null,null,"School Aff. Code :",null,{"$f":"IF('School Info'!$F$5=\"\",\"\",'School Info'!$F$5)","v":123456}]
[null,null,{"$f":"IF('School Info'!$H$5=\"\",\"\",'School Info'!$H$5)","v":"HALF YEARLY EXAM"},null,{"$f":"IF('School Info'!$H$7=\"\",\"\",'School Info'!$H$7)","v":"2025-26"}]
[null,null,"ADMIT CARD",null,null,null,null,null,{"$f":"I1679+1","v":54}]
[]
["ROLL NO :  ",{"$f":"VLOOKUP(I1708,Student_data,3,0)","v":154},null,"CLASS : ",{"$f":"IF('School Info'!$B$7=\"\",\"\",'School Info'!$B$7)","v":6},"DOB :",{"$f":"VLOOKUP(I1708,Student_data,4,0)","v":"2054-01-01"}]
["NAME :  ",{"$f":"VLOOKUP(I1708,Student_data,6,0)","v":"KARNA"},null,"MEDUIM : ",{"$f":"IF('School Info'!$E$7=\"\",\"\",'School Info'!$E$7)","v":"HINDI"},"GENDER :",{"$f":"VLOOKUP(I1708,Student_data,5,0)","v":"MALE"}]
["FATHER :  ",{"$f":"VLOOKUP(I1708,Student_data,7,0)","v":"BBB"},null,"SECTION : ",{"$f":"IF('School Info'!$F$8=\"\",\"\",'School Info'!$F$8)","v":"A"},"S.No. : ",{"$f":"VLOOKUP(I1708,Student_data,2,0)","v":0}]
["MOTHER :  ",{"$f":"VLOOKUP(I1708,Student_data,8,0)","v":"SSDDF"},null,"School DISE Code :",null,{"$f":"IF('School Info'!$B$5=\"\",\"\",'School Info'!$B$5)","v":123456890}]
[]
["SUBJECT","DATE","DAY","TIME "]
[{"$f":"IF('School Info'!$J$5=\"\",\"\",'School Info'!$J$5)","v":"HINDI"},{"$f":"IF('School Info'!$K$5=\"\",\"\",'School Info'!$K$5)","v":"2001-01-01"},{"$f":"IF('School Info'!$L$5=\"\",\"\",'School Info'!$L$5)","v":"MONDAY"},{"$f":"IF('School Info'!$M$5=\"\",\"\",'School Info'!$M$5)","v":"10:00AM TO 12:00PM"}]
[{"$f":"IF('School Info'!$J$6=\"\",\"\",'School Info'!$J$6)","v":"ENGLISH"},{"$f":"IF('School Info'!$K$6=\"\",\"\",'School Info'!$K$6)","v":"2001-01-01"},{"$f":"IF('School Info'!$L$6=\"\",\"\",'School Info'!$L$6)","v":"TUESDAY"},{"$f":"IF('School Info'!$M$6=\"\",\"\",'School Info'!$M$6)","v":"10:00AM TO 12:00PM"}]
[{"$f":"IF('School Info'!$J$7=\"\",\"\",'School Info'!$J$7)","v":"SCIENCE"},{"$f":"IF('School Info'!$K$7=\"\",\"\",'School Info'!$K$7)","v":"2001-01-01"},{"$f":"IF('School Info'!$L$7=\"\",\"\",'School Info'!$L$7)","v":"WEDNESDAY"},{"$f":"IF('School Info'!$M$7=\"\",\"\",'School Info'!$M$7)","v":"10:00AM TO 12:00PM"}]
[{"$f":"IF('School Info'!$J$8=\"\",\"\",'School Info'!$J$8)","v":"MATH"},{"$f":"IF('School Info'!$K$8=\"\",\"\",'School Info'!$K$8)","v":"2001-01-01"},{"$f":"IF('School Info'!$L$8=\"\",\"\",'School Info'!$L$8)","v":"THURSDAY"},{"$f":"IF('School Info'!$M$8=\"\",\"\",'School Info'!$M$8)","v":"10:00AM TO 12:00PM"}]
[{"$f":"IF('School Info'!$J$9=\"\",\"\",'School Info'!$J$9)","v":"SOCIAL SCIENCE"},{"$f":"IF('School Info'!$K$9=\"\",\"\",'School Info'!$K$9)","v":"2001-01-01"},{"$f":"IF('School Info'!$L$9=\"\",\"\",'School Info'!$L$9)","v":"FRIDAY"},{"$f":"IF('School Info'!$M$9=\"\",\"\",'School Info'!$M$9)","v":"10:00AM TO 12:00PM"}]
[{"$f":"IF('School Info'!$J$10=\"\",\"\",'School Info'!$J$10)","v":"SANSKRIT"},{"$f":"IF('School Info'!$K$10=\"\",\"\",'School Info'!$K$10)","v":"2001-01-01"},{"$f":"IF('School Info'!$L$10=\"\",\"\",'School Info'!$L$10)","v":"SATURDAY"},{"$f":"IF('School Info'!$M$10=\"\",\"\",'School Info'!$M$10)","v":"10:00AM TO 12:00PM"}]
[]
["Note :"]
["1. परीक्षार्थी अपना प्रवेश पत्र रोजाना साथ लेकर आये | (Candidates should bring their admit card with them daily.)"]
["2. परीक्षार्थी परीक्षा केंद्र पर आधा घंटे पहले पहुचें | (Candidates should reach the examination center half an hour before.)"]
["3. परीक्षार्थी परीक्षा हेतु आवश्यक सामग्री साथ लेकर आवें | (Candidates should bring with them the necessary materials for the examination.)"]
[]
[]
[]
[]
[]
["Sig. Exam Incharge",null,null,null,null,null,"Sig. Principal "]
[]
[{"$f":"IF('School Info'!$B$4=\"\",\"\",'School Info'!$B$4)","v":"Mahatma Gandhi Government School Bar"}]
[null,null,"School Aff. Code :",null,{"$f":"IF('School Info'!$F$5=\"\",\"\",'School Info'!$F$5)","v":123456}]
[null,null,{"$f":"IF('School Info'!$H$5=\"\",\"\",'School Info'!$H$5)","v":"HALF YEARLY EXAM"},null,{"$f":"IF('School Info'!$H$7=\"\",\"\",'School Info'!$H$7)","v":"2025-26"}]
[null,null,"ADMIT CARD",null,null,null,null,null,{"$f":"I1708+1","v":55}]
[]
["ROLL NO :  ",{"$f":"VLOOKUP(I1737,Student_data,3,0)","v":155},null,"CLASS : ",{"$f":"IF('School Info'!$B$7=\"\",\"\",'School Info'!$B$7)","v":6},"DOB :",{"$f":"VLOOKUP(I1737,Student_data,4,0)","v":"2055-01-01"}]
["NAME :  ",{"$f":"VLOOKUP(I1737,Student_data,6,0)","v":"RAJA  "},null,"MEDUIM : ",{"$f":"IF('School Info'!$E$7=\"\",\"\",'School Info'!$E$7)","v":"HINDI"},"GENDER :",{"$f":"VLOOKUP(I1737,Student_data,5,0)","v":"MALE"}]
["FATHER :  ",{"$f":"VLOOKUP(I1737,Student_data,7,0)","v":"DFD"},null,"SECTION : ",{"$f":"IF('School Info'!$F$8=\"\",\"\",'School Info'!$F$8)","v":"A"},"S.No. : ",{"$f":"VLOOKUP(I1737,Student_data,2,0)","v":0}]
["MOTHER :  ",{"$f":"VLOOKUP(I1737,Student_data,8,0)","v":"GAG"},null,"School DISE Code :",null,{"$f":"IF('School Info'!$B$5=\"\",\"\",'School Info'!$B$5)","v":123456890}]
[]
["SUBJECT","DATE","DAY","TIME "]
[{"$f":"IF('School Info'!$J$5=\"\",\"\",'School Info'!$J$5)","v":"HINDI"},{"$f":"IF('School Info'!$K$5=\"\",\"\",'School Info'!$K$5)","v":"2001-01-01"},{"$f":"IF('School Info'!$L$5=\"\",\"\",'School Info'!$L$5)","v":"MONDAY"},{"$f":"IF('School Info'!$M$5=\"\",\"\",'School Info'!$M$5)","v":"10:00AM TO 12:00PM"}]
[{"$f":"IF('School Info'!$J$6=\"\",\"\",'School Info'!$J$6)","v":"ENGLISH"},{"$f":"IF('School Info'!$K$6=\"\",\"\",'School Info'!$K$6)","v":"2001-01-01"},{"$f":"IF('School Info'!$L$6=\"\",\"\",'School Info'!$L$6)","v":"TUESDAY"},{"$f":"IF('School Info'!$M$6=\"\",\"\",'School Info'!$M$6)","v":"10:00AM TO 12:00PM"}]
[{"$f":"IF('School Info'!$J$7=\"\",\"\",'School Info'!$J$7)","v":"SCIENCE"},{"$f":"IF('School Info'!$K$7=\"\",\"\",'School Info'!$K$7)","v":"2001-01-01"},{"$f":"IF('School Info'!$L$7=\"\",\"\",'School Info'!$L$7)","v":"WEDNESDAY"},{"$f":"IF('School Info'!$M$7=\"\",\"\",'School Info'!$M$7)","v":"10:00AM TO 12:00PM"}]
[{"$f":"IF('School Info'!$J$8=\"\",\"\",'School Info'!$J$8)","v":"MATH"},{"$f":"IF('School Info'!$K$8=\"\",\"\",'School Info'!$K$8)","v":"2001-01-01"},{"$f":"IF('School Info'!$L$8=\"\",\"\",'School Info'!$L$8)","v":"THURSDAY"},{"$f":"IF('School Info'!$M$8=\"\",\"\",'School Info'!$M$8)","v":"10:00AM TO 12:00PM"}]
[{"$f":"IF('School Info'!$J$9=\"\",\"\",'School Info'!$J$9)","v":"SOCIAL SCIENCE"},{"$f":"IF('School Info'!$K$9=\"\",\"\",'School Info'!$K$9)","v":"2001-01-01"},{"$f":"IF('School Info'!$L$9=\"\",\"\",'School Info'!$L$9)","v":"FRIDAY"},{"$f":"IF('School Info'!$M$9=\"\",\"\",'School Info'!$M$9)","v":"10:00AM TO 12:00PM"}]
[{"$f":"IF('School Info'!$J$10=\"\",\"\",'School Info'!$J$10)","v":"SANSKRIT"},{"$f":"IF('School Info'!$K$10=\"\",\"\",'School Info'!$K$10)","v":"2001-01-01"},{"$f":"IF('School Info'!$L$10=\"\",\"\",'School Info'!$L$10)","v":"SATURDAY"},{"$f":"IF('School Info'!$M$10=\"\",\"\",'School Info'!$M$10)","v":"10:00AM TO 12:00PM"}]
[]
["Note :"]
["1. परीक्षार्थी अपना प्रवेश पत्र रोजाना साथ लेकर आये | (Candidates should bring their admit card with them daily.)"]
["2. परीक्षार्थी परीक्षा केंद्र पर आधा घंटे पहले पहुचें | (Candidates should reach the examination center half an hour before.)"]
["3. परीक्षार्थी परीक्षा हेतु आवश्यक सामग्री साथ लेकर आवें | (Candidates should bring with them the necessary materials for the examination.)"]
[]
[]
[]
[]
[]
["Sig. Exam Incharge",null,null,null,null,null,"Sig. Principal "]
[".------------------------------------------------------- Cut Here------------------------------------------------------"]
[{"$f":"IF('School Info'!$B$4=\"\",\"\",'School Info'!$B$4)","v":"Mahatma Gandhi Government School Bar"}]
[null,null,"School Aff. Code :",null,{"$f":"IF('School Info'!$F$5=\"\",\"\",'School Info'!$F$5)","v":123456}]
[null,null,{"$f":"IF('School Info'!$H$5=\"\",\"\",'School Info'!$H$5)","v":"HALF YEARLY EXAM"},null,{"$f":"IF('School Info'!$H$7=\"\",\"\",'School Info'!$H$7)","v":"2025-26"}]
[null,null,"ADMIT CARD",null,null,null,null,null,{"$f":"I1737+1","v":56}]
[]
["ROLL NO :  ",{"$f":"VLOOKUP(I1766,Student_data,3,0)","v":156},null,"CLASS : ",{"$f":"IF('School Info'!$B$7=\"\",\"\",'School Info'!$B$7)","v":6},"DOB :",{"$f":"VLOOKUP(I1766,Student_data,4,0)","v":"2056-01-01"}]
["NAME :  ",{"$f":"VLOOKUP(I1766,Student_data,6,0)","v":"RAJ GURUJI"},null,"MEDUIM : ",{"$f":"IF('School Info'!$E$7=\"\",\"\",'School Info'!$E$7)","v":"HINDI"},"GENDER :",{"$f":"VLOOKUP(I1766,Student_data,5,0)","v":"MALE"}]
["FATHER :  ",{"$f":"VLOOKUP(I1766,Student_data,7,0)","v":"RAJ"},null,"SECTION : ",{"$f":"IF('School Info'!$F$8=\"\",\"\",'School Info'!$F$8)","v":"A"},"S.No. : ",{"$f":"VLOOKUP(I1766,Student_data,2,0)","v":0}]
["MOTHER :  ",{"$f":"VLOOKUP(I1766,Student_data,8,0)","v":"DEVI"},null,"School DISE Code :",null,{"$f":"IF('School Info'!$B$5=\"\",\"\",'School Info'!$B$5)","v":123456890}]
[]
["SUBJECT","DATE","DAY","TIME "]
[{"$f":"IF('School Info'!$J$5=\"\",\"\",'School Info'!$J$5)","v":"HINDI"},{"$f":"IF('School Info'!$K$5=\"\",\"\",'School Info'!$K$5)","v":"2001-01-01"},{"$f":"IF('School Info'!$L$5=\"\",\"\",'School Info'!$L$5)","v":"MONDAY"},{"$f":"IF('School Info'!$M$5=\"\",\"\",'School Info'!$M$5)","v":"10:00AM TO 12:00PM"}]
[{"$f":"IF('School Info'!$J$6=\"\",\"\",'School Info'!$J$6)","v":"ENGLISH"},{"$f":"IF('School Info'!$K$6=\"\",\"\",'School Info'!$K$6)","v":"2001-01-01"},{"$f":"IF('School Info'!$L$6=\"\",\"\",'School Info'!$L$6)","v":"TUESDAY"},{"$f":"IF('School Info'!$M$6=\"\",\"\",'School Info'!$M$6)","v":"10:00AM TO 12:00PM"}]
[{"$f":"IF('School Info'!$J$7=\"\",\"\",'School Info'!$J$7)","v":"SCIENCE"},{"$f":"IF('School Info'!$K$7=\"\",\"\",'School Info'!$K$7)","v":"2001-01-01"},{"$f":"IF('School Info'!$L$7=\"\",\"\",'School Info'!$L$7)","v":"WEDNESDAY"},{"$f":"IF('School Info'!$M$7=\"\",\"\",'School Info'!$M$7)","v":"10:00AM TO 12:00PM"}]
[{"$f":"IF('School Info'!$J$8=\"\",\"\",'School Info'!$J$8)","v":"MATH"},{"$f":"IF('School Info'!$K$8=\"\",\"\",'School Info'!$K$8)","v":"2001-01-01"},{"$f":"IF('School Info'!$L$8=\"\",\"\",'School Info'!$L$8)","v":"THURSDAY"},{"$f":"IF('School Info'!$M$8=\"\",\"\",'School Info'!$M$8)","v":"10:00AM TO 12:00PM"}]
[{"$f":"IF('School Info'!$J$9=\"\",\"\",'School Info'!$J$9)","v":"SOCIAL SCIENCE"},{"$f":"IF('School Info'!$K$9=\"\",\"\",'School Info'!$K$9)","v":"2001-01-01"},{"$f":"IF('School Info'!$L$9=\"\",\"\",'School Info'!$L$9)","v":"FRIDAY"},{"$f":"IF('School Info'!$M$9=\"\",\"\",'School Info'!$M$9)","v":"10:00AM TO 12:00PM"}]
[{"$f":"IF('School Info'!$J$10=\"\",\"\",'School Info'!$J$10)","v":"SANSKRIT"},{"$f":"IF('School Info'!$K$10=\"\",\"\",'School Info'!$K$10)","v":"2001-01-01"},{"$f":"IF('School Info'!$L$10=\"\",\"\",'School Info'!$L$10)","v":"SATURDAY"},{"$f":"IF('School Info'!$M$10=\"\",\"\",'School Info'!$M$10)","v":"10:00AM TO 12:00PM"}]
[]
["Note :"]
["1. परीक्षार्थी अपना प्रवेश पत्र रोजाना साथ लेकर आये | (Candidates should bring their admit card with them daily.)"]
["2. परीक्षार्थी परीक्षा केंद्र पर आधा घंटे पहले पहुचें | (Candidates should reach the examination center half an hour before.)"]
["3. परीक्षार्थी परीक्षा हेतु आवश्यक सामग्री साथ लेकर आवें | (Candidates should bring with them the necessary materials for the examination.)"]
[]
[]
[]
[]
[]
["Sig. Exam Incharge",null,null,null,null,null,"Sig. Principal "]
[]
[{"$f":"IF('School Info'!$B$4=\"\",\"\",'School Info'!$B$4)","v":"Mahatma Gandhi Government School Bar"}]
[null,null,"School Aff. Code :",null,{"$f":"IF('School Info'!$F$5=\"\",\"\",'School Info'!$F$5)","v":123456}]
[null,null,{"$f":"IF('School Info'!$H$5=\"\",\"\",'School Info'!$H$5)","v":"HALF YEARLY EXAM"},null,{"$f":"IF('School Info'!$H$7=\"\",\"\",'School Info'!$H$7)","v":"2025-26"}]
[null,null,"ADMIT CARD",null,null,null,null,null,{"$f":"I1766+1","v":57}]
[]
["ROLL NO :  ",{"$f":"VLOOKUP(I1795,Student_data,3,0)","v":157},null,"CLASS : ",{"$f":"IF('School Info'!$B$7=\"\",\"\",'School Info'!$B$7)","v":6},"DOB :",{"$f":"VLOOKUP(I1795,Student_data,4,0)","v":"2057-01-01"}]
["NAME :  ",{"$f":"VLOOKUP(I1795,Student_data,6,0)","v":"MONU"},null,"MEDUIM : ",{"$f":"IF('School Info'!$E$7=\"\",\"\",'School Info'!$E$7)","v":"HINDI"},"GENDER :",{"$f":"VLOOKUP(I1795,Student_data,5,0)","v":"MALE"}]
["FATHER :  ",{"$f":"VLOOKUP(I1795,Student_data,7,0)","v":"RAAA"},null,"SECTION : ",{"$f":"IF('School Info'!$F$8=\"\",\"\",'School Info'!$F$8)","v":"A"},"S.No. : ",{"$f":"VLOOKUP(I1795,Student_data,2,0)","v":0}]
["MOTHER :  ",{"$f":"VLOOKUP(I1795,Student_data,8,0)","v":"DDD"},null,"School DISE Code :",null,{"$f":"IF('School Info'!$B$5=\"\",\"\",'School Info'!$B$5)","v":123456890}]
[]
["SUBJECT","DATE","DAY","TIME "]
[{"$f":"IF('School Info'!$J$5=\"\",\"\",'School Info'!$J$5)","v":"HINDI"},{"$f":"IF('School Info'!$K$5=\"\",\"\",'School Info'!$K$5)","v":"2001-01-01"},{"$f":"IF('School Info'!$L$5=\"\",\"\",'School Info'!$L$5)","v":"MONDAY"},{"$f":"IF('School Info'!$M$5=\"\",\"\",'School Info'!$M$5)","v":"10:00AM TO 12:00PM"}]
[{"$f":"IF('School Info'!$J$6=\"\",\"\",'School Info'!$J$6)","v":"ENGLISH"},{"$f":"IF('School Info'!$K$6=\"\",\"\",'School Info'!$K$6)","v":"2001-01-01"},{"$f":"IF('School Info'!$L$6=\"\",\"\",'School Info'!$L$6)","v":"TUESDAY"},{"$f":"IF('School Info'!$M$6=\"\",\"\",'School Info'!$M$6)","v":"10:00AM TO 12:00PM"}]
[{"$f":"IF('School Info'!$J$7=\"\",\"\",'School Info'!$J$7)","v":"SCIENCE"},{"$f":"IF('School Info'!$K$7=\"\",\"\",'School Info'!$K$7)","v":"2001-01-01"},{"$f":"IF('School Info'!$L$7=\"\",\"\",'School Info'!$L$7)","v":"WEDNESDAY"},{"$f":"IF('School Info'!$M$7=\"\",\"\",'School Info'!$M$7)","v":"10:00AM TO 12:00PM"}]
[{"$f":"IF('School Info'!$J$8=\"\",\"\",'School Info'!$J$8)","v":"MATH"},{"$f":"IF('School Info'!$K$8=\"\",\"\",'School Info'!$K$8)","v":"2001-01-01"},{"$f":"IF('School Info'!$L$8=\"\",\"\",'School Info'!$L$8)","v":"THURSDAY"},{"$f":"IF('School Info'!$M$8=\"\",\"\",'School Info'!$M$8)","v":"10:00AM TO 12:00PM"}]
[{"$f":"IF('School Info'!$J$9=\"\",\"\",'School Info'!$J$9)","v":"SOCIAL SCIENCE"},{"$f":"IF('School Info'!$K$9=\"\",\"\",'School Info'!$K$9)","v":"2001-01-01"},{"$f":"IF('School Info'!$L$9=\"\",\"\",'School Info'!$L$9)","v":"FRIDAY"},{"$f":"IF('School Info'!$M$9=\"\",\"\",'School Info'!$M$9)","v":"10:00AM TO 12:00PM"}]
[{"$f":"IF('School Info'!$J$10=\"\",\"\",'School Info'!$J$10)","v":"SANSKRIT"},{"$f":"IF('School Info'!$K$10=\"\",\"\",'School Info'!$K$10)","v":"2001-01-01"},{"$f":"IF('School Info'!$L$10=\"\",\"\",'School Info'!$L$10)","v":"SATURDAY"},{"$f":"IF('School Info'!$M$10=\"\",\"\",'School Info'!$M$10)","v":"10:00AM TO 12:00PM"}]
[]
["Note :"]
["1. परीक्षार्थी अपना प्रवेश पत्र रोजाना साथ लेकर आये | (Candidates should bring their admit card with them daily.)"]
["2. परीक्षार्थी परीक्षा केंद्र पर आधा घंटे पहले पहुचें | (Candidates should reach the examination center half an hour before.)"]
["3. परीक्षार्थी परीक्षा हेतु आवश्यक सामग्री साथ लेकर आवें | (Candidates should bring with them the necessary materials for the examination.)"]
[]
[]
[]
[]
[]
["Sig. Exam Incharge",null,null,null,null,null,"Sig. Principal "]
[".------------------------------------------------------- Cut Here------------------------------------------------------"]
[{"$f":"IF('School Info'!$B$4=\"\",\"\",'School Info'!$B$4)","v":"Mahatma Gandhi Government School Bar"}]
[null,null,"School Aff. Code :",null,{"$f":"IF('School Info'!$F$5=\"\",\"\",'School Info'!$F$5)","v":123456}]
[null,null,{"$f":"IF('School Info'!$H$5=\"\",\"\",'School Info'!$H$5)","v":"HALF YEARLY EXAM"},null,{"$f":"IF('School Info'!$H$7=\"\",\"\",'School Info'!$H$7)","v":"2025-26"}]
[null,null,"ADMIT CARD",null,null,null,null,null,{"$f":"I1795+1","v":58}]
[]
["ROLL NO :  ",{"$f":"VLOOKUP(I1824,Student_data,3,0)","v":158},null,"CLASS : ",{"$f":"IF('School Info'!$B$7=\"\",\"\",'School Info'!$B$7)","v":6},"DOB :",{"$f":"VLOOKUP(I1824,Student_data,4,0)","v":"2058-01-01"}]
["NAME :  ",{"$f":"VLOOKUP(I1824,Student_data,6,0)","v":"SONU"},null,"MEDUIM : ",{"$f":"IF('School Info'!$E$7=\"\",\"\",'School Info'!$E$7)","v":"HINDI"},"GENDER :",{"$f":"VLOOKUP(I1824,Student_data,5,0)","v":"MALE"}]
["FATHER :  ",{"$f":"VLOOKUP(I1824,Student_data,7,0)","v":"AAA"},null,"SECTION : ",{"$f":"IF('School Info'!$F$8=\"\",\"\",'School Info'!$F$8)","v":"A"},"S.No. : ",{"$f":"VLOOKUP(I1824,Student_data,2,0)","v":0}]
["MOTHER :  ",{"$f":"VLOOKUP(I1824,Student_data,8,0)","v":"DDS"},null,"School DISE Code :",null,{"$f":"IF('School Info'!$B$5=\"\",\"\",'School Info'!$B$5)","v":123456890}]
[]
["SUBJECT","DATE","DAY","TIME "]
[{"$f":"IF('School Info'!$J$5=\"\",\"\",'School Info'!$J$5)","v":"HINDI"},{"$f":"IF('School Info'!$K$5=\"\",\"\",'School Info'!$K$5)","v":"2001-01-01"},{"$f":"IF('School Info'!$L$5=\"\",\"\",'School Info'!$L$5)","v":"MONDAY"},{"$f":"IF('School Info'!$M$5=\"\",\"\",'School Info'!$M$5)","v":"10:00AM TO 12:00PM"}]
[{"$f":"IF('School Info'!$J$6=\"\",\"\",'School Info'!$J$6)","v":"ENGLISH"},{"$f":"IF('School Info'!$K$6=\"\",\"\",'School Info'!$K$6)","v":"2001-01-01"},{"$f":"IF('School Info'!$L$6=\"\",\"\",'School Info'!$L$6)","v":"TUESDAY"},{"$f":"IF('School Info'!$M$6=\"\",\"\",'School Info'!$M$6)","v":"10:00AM TO 12:00PM"}]
[{"$f":"IF('School Info'!$J$7=\"\",\"\",'School Info'!$J$7)","v":"SCIENCE"},{"$f":"IF('School Info'!$K$7=\"\",\"\",'School Info'!$K$7)","v":"2001-01-01"},{"$f":"IF('School Info'!$L$7=\"\",\"\",'School Info'!$L$7)","v":"WEDNESDAY"},{"$f":"IF('School Info'!$M$7=\"\",\"\",'School Info'!$M$7)","v":"10:00AM TO 12:00PM"}]
[{"$f":"IF('School Info'!$J$8=\"\",\"\",'School Info'!$J$8)","v":"MATH"},{"$f":"IF('School Info'!$K$8=\"\",\"\",'School Info'!$K$8)","v":"2001-01-01"},{"$f":"IF('School Info'!$L$8=\"\",\"\",'School Info'!$L$8)","v":"THURSDAY"},{"$f":"IF('School Info'!$M$8=\"\",\"\",'School Info'!$M$8)","v":"10:00AM TO 12:00PM"}]
[{"$f":"IF('School Info'!$J$9=\"\",\"\",'School Info'!$J$9)","v":"SOCIAL SCIENCE"},{"$f":"IF('School Info'!$K$9=\"\",\"\",'School Info'!$K$9)","v":"2001-01-01"},{"$f":"IF('School Info'!$L$9=\"\",\"\",'School Info'!$L$9)","v":"FRIDAY"},{"$f":"IF('School Info'!$M$9=\"\",\"\",'School Info'!$M$9)","v":"10:00AM TO 12:00PM"}]
[{"$f":"IF('School Info'!$J$10=\"\",\"\",'School Info'!$J$10)","v":"SANSKRIT"},{"$f":"IF('School Info'!$K$10=\"\",\"\",'School Info'!$K$10)","v":"2001-01-01"},{"$f":"IF('School Info'!$L$10=\"\",\"\",'School Info'!$L$10)","v":"SATURDAY"},{"$f":"IF('School Info'!$M$10=\"\",\"\",'School Info'!$M$10)","v":"10:00AM TO 12:00PM"}]
[]
["Note :"]
["1. परीक्षार्थी अपना प्रवेश पत्र रोजाना साथ लेकर आये | (Candidates should bring their admit card with them daily.)"]
["2. परीक्षार्थी परीक्षा केंद्र पर आधा घंटे पहले पहुचें | (Candidates should reach the examination center half an hour before.)"]
["3. परीक्षार्थी परीक्षा हेतु आवश्यक सामग्री साथ लेकर आवें | (Candidates should bring with them the necessary materials for the examination.)"]
[]
[]
[]
[]
[]
["Sig. Exam Incharge",null,null,null,null,null,"Sig. Principal "]
[]
[{"$f":"IF('School Info'!$B$4=\"\",\"\",'School Info'!$B$4)","v":"Mahatma Gandhi Government School Bar"}]
[null,null,"School Aff. Code :",null,{"$f":"IF('School Info'!$F$5=\"\",\"\",'School Info'!$F$5)","v":123456}]
[null,null,{"$f":"IF('School Info'!$H$5=\"\",\"\",'School Info'!$H$5)","v":"HALF YEARLY EXAM"},null,{"$f":"IF('School Info'!$H$7=\"\",\"\",'School Info'!$H$7)","v":"2025-26"}]
[null,null,"ADMIT CARD",null,null,null,null,null,{"$f":"I1824+1","v":59}]
[]
["ROLL NO :  ",{"$f":"VLOOKUP(I1853,Student_data,3,0)","v":159},null,"CLASS : ",{"$f":"IF('School Info'!$B$7=\"\",\"\",'School Info'!$B$7)","v":6},"DOB :",{"$f":"VLOOKUP(I1853,Student_data,4,0)","v":"2059-01-01"}]
["NAME :  ",{"$f":"VLOOKUP(I1853,Student_data,6,0)","v":"KARNA"},null,"MEDUIM : ",{"$f":"IF('School Info'!$E$7=\"\",\"\",'School Info'!$E$7)","v":"HINDI"},"GENDER :",{"$f":"VLOOKUP(I1853,Student_data,5,0)","v":"MALE"}]
["FATHER :  ",{"$f":"VLOOKUP(I1853,Student_data,7,0)","v":"BBB"},null,"SECTION : ",{"$f":"IF('School Info'!$F$8=\"\",\"\",'School Info'!$F$8)","v":"A"},"S.No. : ",{"$f":"VLOOKUP(I1853,Student_data,2,0)","v":0}]
["MOTHER :  ",{"$f":"VLOOKUP(I1853,Student_data,8,0)","v":"SSDDF"},null,"School DISE Code :",null,{"$f":"IF('School Info'!$B$5=\"\",\"\",'School Info'!$B$5)","v":123456890}]
[]
["SUBJECT","DATE","DAY","TIME "]
[{"$f":"IF('School Info'!$J$5=\"\",\"\",'School Info'!$J$5)","v":"HINDI"},{"$f":"IF('School Info'!$K$5=\"\",\"\",'School Info'!$K$5)","v":"2001-01-01"},{"$f":"IF('School Info'!$L$5=\"\",\"\",'School Info'!$L$5)","v":"MONDAY"},{"$f":"IF('School Info'!$M$5=\"\",\"\",'School Info'!$M$5)","v":"10:00AM TO 12:00PM"}]
[{"$f":"IF('School Info'!$J$6=\"\",\"\",'School Info'!$J$6)","v":"ENGLISH"},{"$f":"IF('School Info'!$K$6=\"\",\"\",'School Info'!$K$6)","v":"2001-01-01"},{"$f":"IF('School Info'!$L$6=\"\",\"\",'School Info'!$L$6)","v":"TUESDAY"},{"$f":"IF('School Info'!$M$6=\"\",\"\",'School Info'!$M$6)","v":"10:00AM TO 12:00PM"}]
[{"$f":"IF('School Info'!$J$7=\"\",\"\",'School Info'!$J$7)","v":"SCIENCE"},{"$f":"IF('School Info'!$K$7=\"\",\"\",'School Info'!$K$7)","v":"2001-01-01"},{"$f":"IF('School Info'!$L$7=\"\",\"\",'School Info'!$L$7)","v":"WEDNESDAY"},{"$f":"IF('School Info'!$M$7=\"\",\"\",'School Info'!$M$7)","v":"10:00AM TO 12:00PM"}]
[{"$f":"IF('School Info'!$J$8=\"\",\"\",'School Info'!$J$8)","v":"MATH"},{"$f":"IF('School Info'!$K$8=\"\",\"\",'School Info'!$K$8)","v":"2001-01-01"},{"$f":"IF('School Info'!$L$8=\"\",\"\",'School Info'!$L$8)","v":"THURSDAY"},{"$f":"IF('School Info'!$M$8=\"\",\"\",'School Info'!$M$8)","v":"10:00AM TO 12:00PM"}]
[{"$f":"IF('School Info'!$J$9=\"\",\"\",'School Info'!$J$9)","v":"SOCIAL SCIENCE"},{"$f":"IF('School Info'!$K$9=\"\",\"\",'School Info'!$K$9)","v":"2001-01-01"},{"$f":"IF('School Info'!$L$9=\"\",\"\",'School Info'!$L$9)","v":"FRIDAY"},{"$f":"IF('School Info'!$M$9=\"\",\"\",'School Info'!$M$9)","v":"10:00AM TO 12:00PM"}]
[{"$f":"IF('School Info'!$J$10=\"\",\"\",'School Info'!$J$10)","v":"SANSKRIT"},{"$f":"IF('School Info'!$K$10=\"\",\"\",'School Info'!$K$10)","v":"2001-01-01"},{"$f":"IF('School Info'!$L$10=\"\",\"\",'School Info'!$L$10)","v":"SATURDAY"},{"$f":"IF('School Info'!$M$10=\"\",\"\",'School Info'!$M$10)","v":"10:00AM TO 12:00PM"}]
[]
["Note :"]
["1. परीक्षार्थी अपना प्रवेश पत्र रोजाना साथ लेकर आये | (Candidates should bring their admit card with them daily.)"]
["2. परीक्षार्थी परीक्षा केंद्र पर आधा घंटे पहले पहुचें | (Candidates should reach the examination center half an hour before.)"]
["3. परीक्षार्थी परीक्षा हेतु आवश्यक सामग्री साथ लेकर आवें | (Candidates should bring with them the necessary materials for the examination.)"]
[]
[]
[]
[]
[]
["Sig. Exam Incharge",null,null,null,null,null,"Sig. Principal "]
[".------------------------------------------------------- Cut Here------------------------------------------------------"]
[{"$f":"IF('School Info'!$B$4=\"\",\"\",'School Info'!$B$4)","v":"Mahatma Gandhi Government School Bar"}]
[null,null,"School Aff. Code :",null,{"$f":"IF('School Info'!$F$5=\"\",\"\",'School Info'!$F$5)","v":123456}]
[null,null,{"$f":"IF('School Info'!$H$5=\"\",\"\",'School Info'!$H$5)","v":"HALF YEARLY EXAM"},null,{"$f":"IF('School Info'!$H$7=\"\",\"\",'School Info'!$H$7)","v":"2025-26"}]
[null,null,"ADMIT CARD",null,null,null,null,null,{"$f":"I1853+1","v":60}]
[]
["ROLL NO :  ",{"$f":"VLOOKUP(I1882,Student_data,3,0)","v":160},null,"CLASS : ",{"$f":"IF('School Info'!$B$7=\"\",\"\",'School Info'!$B$7)","v":6},"DOB :",{"$f":"VLOOKUP(I1882,Student_data,4,0)","v":"2060-01-01"}]
["NAME :  ",{"$f":"VLOOKUP(I1882,Student_data,6,0)","v":"RAJA  "},null,"MEDUIM : ",{"$f":"IF('School Info'!$E$7=\"\",\"\",'School Info'!$E$7)","v":"HINDI"},"GENDER :",{"$f":"VLOOKUP(I1882,Student_data,5,0)","v":"MALE"}]
["FATHER :  ",{"$f":"VLOOKUP(I1882,Student_data,7,0)","v":"DFD"},null,"SECTION : ",{"$f":"IF('School Info'!$F$8=\"\",\"\",'School Info'!$F$8)","v":"A"},"S.No. : ",{"$f":"VLOOKUP(I1882,Student_data,2,0)","v":0}]
["MOTHER :  ",{"$f":"VLOOKUP(I1882,Student_data,8,0)","v":"GAG"},null,"School DISE Code :",null,{"$f":"IF('School Info'!$B$5=\"\",\"\",'School Info'!$B$5)","v":123456890}]
[]
["SUBJECT","DATE","DAY","TIME "]
[{"$f":"IF('School Info'!$J$5=\"\",\"\",'School Info'!$J$5)","v":"HINDI"},{"$f":"IF('School Info'!$K$5=\"\",\"\",'School Info'!$K$5)","v":"2001-01-01"},{"$f":"IF('School Info'!$L$5=\"\",\"\",'School Info'!$L$5)","v":"MONDAY"},{"$f":"IF('School Info'!$M$5=\"\",\"\",'School Info'!$M$5)","v":"10:00AM TO 12:00PM"}]
[{"$f":"IF('School Info'!$J$6=\"\",\"\",'School Info'!$J$6)","v":"ENGLISH"},{"$f":"IF('School Info'!$K$6=\"\",\"\",'School Info'!$K$6)","v":"2001-01-01"},{"$f":"IF('School Info'!$L$6=\"\",\"\",'School Info'!$L$6)","v":"TUESDAY"},{"$f":"IF('School Info'!$M$6=\"\",\"\",'School Info'!$M$6)","v":"10:00AM TO 12:00PM"}]
[{"$f":"IF('School Info'!$J$7=\"\",\"\",'School Info'!$J$7)","v":"SCIENCE"},{"$f":"IF('School Info'!$K$7=\"\",\"\",'School Info'!$K$7)","v":"2001-01-01"},{"$f":"IF('School Info'!$L$7=\"\",\"\",'School Info'!$L$7)","v":"WEDNESDAY"},{"$f":"IF('School Info'!$M$7=\"\",\"\",'School Info'!$M$7)","v":"10:00AM TO 12:00PM"}]
[{"$f":"IF('School Info'!$J$8=\"\",\"\",'School Info'!$J$8)","v":"MATH"},{"$f":"IF('School Info'!$K$8=\"\",\"\",'School Info'!$K$8)","v":"2001-01-01"},{"$f":"IF('School Info'!$L$8=\"\",\"\",'School Info'!$L$8)","v":"THURSDAY"},{"$f":"IF('School Info'!$M$8=\"\",\"\",'School Info'!$M$8)","v":"10:00AM TO 12:00PM"}]
[{"$f":"IF('School Info'!$J$9=\"\",\"\",'School Info'!$J$9)","v":"SOCIAL SCIENCE"},{"$f":"IF('School Info'!$K$9=\"\",\"\",'School Info'!$K$9)","v":"2001-01-01"},{"$f":"IF('School Info'!$L$9=\"\",\"\",'School Info'!$L$9)","v":"FRIDAY"},{"$f":"IF('School Info'!$M$9=\"\",\"\",'School Info'!$M$9)","v":"10:00AM TO 12:00PM"}]
[{"$f":"IF('School Info'!$J$10=\"\",\"\",'School Info'!$J$10)","v":"SANSKRIT"},{"$f":"IF('School Info'!$K$10=\"\",\"\",'School Info'!$K$10)","v":"2001-01-01"},{"$f":"IF('School Info'!$L$10=\"\",\"\",'School Info'!$L$10)","v":"SATURDAY"},{"$f":"IF('School Info'!$M$10=\"\",\"\",'School Info'!$M$10)","v":"10:00AM TO 12:00PM"}]
[]
["Note :"]
["1. परीक्षार्थी अपना प्रवेश पत्र रोजाना साथ लेकर आये | (Candidates should bring their admit card with them daily.)"]
["2. परीक्षार्थी परीक्षा केंद्र पर आधा घंटे पहले पहुचें | (Candidates should reach the examination center half an hour before.)"]
["3. परीक्षार्थी परीक्षा हेतु आवश्यक सामग्री साथ लेकर आवें | (Candidates should bring with them the necessary materials for the examination.)"]
[]
[]
[]
[]
[]
["Sig. Exam Incharge",null,null,null,null,null,"Sig. Principal "]
[]
[{"$f":"IF('School Info'!$B$4=\"\",\"\",'School Info'!$B$4)","v":"Mahatma Gandhi Government School Bar"}]
[null,null,"School Aff. Code :",null,{"$f":"IF('School Info'!$F$5=\"\",\"\",'School Info'!$F$5)","v":123456}]
[null,null,{"$f":"IF('School Info'!$H$5=\"\",\"\",'School Info'!$H$5)","v":"HALF YEARLY EXAM"},null,{"$f":"IF('School Info'!$H$7=\"\",\"\",'School Info'!$H$7)","v":"2025-26"}]
[null,null,"ADMIT CARD",null,null,null,null,null,{"$f":"I1882+1","v":61}]
[]
["ROLL NO :  ",{"$f":"VLOOKUP(I1911,Student_data,3,0)","v":161},null,"CLASS : ",{"$f":"IF('School Info'!$B$7=\"\",\"\",'School Info'!$B$7)","v":6},"DOB :",{"$f":"VLOOKUP(I1911,Student_data,4,0)","v":"2061-01-01"}]
["NAME :  ",{"$f":"VLOOKUP(I1911,Student_data,6,0)","v":"RAJ GURUJI"},null,"MEDUIM : ",{"$f":"IF('School Info'!$E$7=\"\",\"\",'School Info'!$E$7)","v":"HINDI"},"GENDER :",{"$f":"VLOOKUP(I1911,Student_data,5,0)","v":"MALE"}]
["FATHER :  ",{"$f":"VLOOKUP(I1911,Student_data,7,0)","v":"RAJ"},null,"SECTION : ",{"$f":"IF('School Info'!$F$8=\"\",\"\",'School Info'!$F$8)","v":"A"},"S.No. : ",{"$f":"VLOOKUP(I1911,Student_data,2,0)","v":0}]
["MOTHER :  ",{"$f":"VLOOKUP(I1911,Student_data,8,0)","v":"DEVI"},null,"School DISE Code :",null,{"$f":"IF('School Info'!$B$5=\"\",\"\",'School Info'!$B$5)","v":123456890}]
[]
["SUBJECT","DATE","DAY","TIME "]
[{"$f":"IF('School Info'!$J$5=\"\",\"\",'School Info'!$J$5)","v":"HINDI"},{"$f":"IF('School Info'!$K$5=\"\",\"\",'School Info'!$K$5)","v":"2001-01-01"},{"$f":"IF('School Info'!$L$5=\"\",\"\",'School Info'!$L$5)","v":"MONDAY"},{"$f":"IF('School Info'!$M$5=\"\",\"\",'School Info'!$M$5)","v":"10:00AM TO 12:00PM"}]
[{"$f":"IF('School Info'!$J$6=\"\",\"\",'School Info'!$J$6)","v":"ENGLISH"},{"$f":"IF('School Info'!$K$6=\"\",\"\",'School Info'!$K$6)","v":"2001-01-01"},{"$f":"IF('School Info'!$L$6=\"\",\"\",'School Info'!$L$6)","v":"TUESDAY"},{"$f":"IF('School Info'!$M$6=\"\",\"\",'School Info'!$M$6)","v":"10:00AM TO 12:00PM"}]
[{"$f":"IF('School Info'!$J$7=\"\",\"\",'School Info'!$J$7)","v":"SCIENCE"},{"$f":"IF('School Info'!$K$7=\"\",\"\",'School Info'!$K$7)","v":"2001-01-01"},{"$f":"IF('School Info'!$L$7=\"\",\"\",'School Info'!$L$7)","v":"WEDNESDAY"},{"$f":"IF('School Info'!$M$7=\"\",\"\",'School Info'!$M$7)","v":"10:00AM TO 12:00PM"}]
[{"$f":"IF('School Info'!$J$8=\"\",\"\",'School Info'!$J$8)","v":"MATH"},{"$f":"IF('School Info'!$K$8=\"\",\"\",'School Info'!$K$8)","v":"2001-01-01"},{"$f":"IF('School Info'!$L$8=\"\",\"\",'School Info'!$L$8)","v":"THURSDAY"},{"$f":"IF('School Info'!$M$8=\"\",\"\",'School Info'!$M$8)","v":"10:00AM TO 12:00PM"}]
[{"$f":"IF('School Info'!$J$9=\"\",\"\",'School Info'!$J$9)","v":"SOCIAL SCIENCE"},{"$f":"IF('School Info'!$K$9=\"\",\"\",'School Info'!$K$9)","v":"2001-01-01"},{"$f":"IF('School Info'!$L$9=\"\",\"\",'School Info'!$L$9)","v":"FRIDAY"},{"$f":"IF('School Info'!$M$9=\"\",\"\",'School Info'!$M$9)","v":"10:00AM TO 12:00PM"}]
[{"$f":"IF('School Info'!$J$10=\"\",\"\",'School Info'!$J$10)","v":"SANSKRIT"},{"$f":"IF('School Info'!$K$10=\"\",\"\",'School Info'!$K$10)","v":"2001-01-01"},{"$f":"IF('School Info'!$L$10=\"\",\"\",'School Info'!$L$10)","v":"SATURDAY"},{"$f":"IF('School Info'!$M$10=\"\",\"\",'School Info'!$M$10)","v":"10:00AM TO 12:00PM"}]
[]
["Note :"]
["1. परीक्षार्थी अपना प्रवेश पत्र रोजाना साथ लेकर आये | (Candidates should bring their admit card with them daily.)"]
["2. परीक्षार्थी परीक्षा केंद्र पर आधा घंटे पहले पहुचें | (Candidates should reach the examination center half an hour before.)"]
["3. परीक्षार्थी परीक्षा हेतु आवश्यक सामग्री साथ लेकर आवें | (Candidates should bring with them the necessary materials for the examination.)"]
[]
[]
[]
[]
[]
["Sig. Exam Incharge",null,null,null,null,null,"Sig. Principal "]
[".------------------------------------------------------- Cut Here------------------------------------------------------"]
[{"$f":"IF('School Info'!$B$4=\"\",\"\",'School Info'!$B$4)","v":"Mahatma Gandhi Government School Bar"}]
[null,null,"School Aff. Code :",null,{"$f":"IF('School Info'!$F$5=\"\",\"\",'School Info'!$F$5)","v":123456}]
[null,null,{"$f":"IF('School Info'!$H$5=\"\",\"\",'School Info'!$H$5)","v":"HALF YEARLY EXAM"},null,{"$f":"IF('School Info'!$H$7=\"\",\"\",'School Info'!$H$7)","v":"2025-26"}]
[null,null,"ADMIT CARD",null,null,null,null,null,{"$f":"I1911+1","v":62}]
[]
["ROLL NO :  ",{"$f":"VLOOKUP(I1940,Student_data,3,0)","v":162},null,"CLASS : ",{"$f":"IF('School Info'!$B$7=\"\",\"\",'School Info'!$B$7)","v":6},"DOB :",{"$f":"VLOOKUP(I1940,Student_data,4,0)","v":"2062-01-01"}]
["NAME :  ",{"$f":"VLOOKUP(I1940,Student_data,6,0)","v":"MONU"},null,"MEDUIM : ",{"$f":"IF('School Info'!$E$7=\"\",\"\",'School Info'!$E$7)","v":"HINDI"},"GENDER :",{"$f":"VLOOKUP(I1940,Student_data,5,0)","v":"MALE"}]
["FATHER :  ",{"$f":"VLOOKUP(I1940,Student_data,7,0)","v":"RAAA"},null,"SECTION : ",{"$f":"IF('School Info'!$F$8=\"\",\"\",'School Info'!$F$8)","v":"A"},"S.No. : ",{"$f":"VLOOKUP(I1940,Student_data,2,0)","v":0}]
["MOTHER :  ",{"$f":"VLOOKUP(I1940,Student_data,8,0)","v":"DDD"},null,"School DISE Code :",null,{"$f":"IF('School Info'!$B$5=\"\",\"\",'School Info'!$B$5)","v":123456890}]
[]
["SUBJECT","DATE","DAY","TIME "]
[{"$f":"IF('School Info'!$J$5=\"\",\"\",'School Info'!$J$5)","v":"HINDI"},{"$f":"IF('School Info'!$K$5=\"\",\"\",'School Info'!$K$5)","v":"2001-01-01"},{"$f":"IF('School Info'!$L$5=\"\",\"\",'School Info'!$L$5)","v":"MONDAY"},{"$f":"IF('School Info'!$M$5=\"\",\"\",'School Info'!$M$5)","v":"10:00AM TO 12:00PM"}]
[{"$f":"IF('School Info'!$J$6=\"\",\"\",'School Info'!$J$6)","v":"ENGLISH"},{"$f":"IF('School Info'!$K$6=\"\",\"\",'School Info'!$K$6)","v":"2001-01-01"},{"$f":"IF('School Info'!$L$6=\"\",\"\",'School Info'!$L$6)","v":"TUESDAY"},{"$f":"IF('School Info'!$M$6=\"\",\"\",'School Info'!$M$6)","v":"10:00AM TO 12:00PM"}]
[{"$f":"IF('School Info'!$J$7=\"\",\"\",'School Info'!$J$7)","v":"SCIENCE"},{"$f":"IF('School Info'!$K$7=\"\",\"\",'School Info'!$K$7)","v":"2001-01-01"},{"$f":"IF('School Info'!$L$7=\"\",\"\",'School Info'!$L$7)","v":"WEDNESDAY"},{"$f":"IF('School Info'!$M$7=\"\",\"\",'School Info'!$M$7)","v":"10:00AM TO 12:00PM"}]
[{"$f":"IF('School Info'!$J$8=\"\",\"\",'School Info'!$J$8)","v":"MATH"},{"$f":"IF('School Info'!$K$8=\"\",\"\",'School Info'!$K$8)","v":"2001-01-01"},{"$f":"IF('School Info'!$L$8=\"\",\"\",'School Info'!$L$8)","v":"THURSDAY"},{"$f":"IF('School Info'!$M$8=\"\",\"\",'School Info'!$M$8)","v":"10:00AM TO 12:00PM"}]
[{"$f":"IF('School Info'!$J$9=\"\",\"\",'School Info'!$J$9)","v":"SOCIAL SCIENCE"},{"$f":"IF('School Info'!$K$9=\"\",\"\",'School Info'!$K$9)","v":"2001-01-01"},{"$f":"IF('School Info'!$L$9=\"\",\"\",'School Info'!$L$9)","v":"FRIDAY"},{"$f":"IF('School Info'!$M$9=\"\",\"\",'School Info'!$M$9)","v":"10:00AM TO 12:00PM"}]
[{"$f":"IF('School Info'!$J$10=\"\",\"\",'School Info'!$J$10)","v":"SANSKRIT"},{"$f":"IF('School Info'!$K$10=\"\",\"\",'School Info'!$K$10)","v":"2001-01-01"},{"$f":"IF('School Info'!$L$10=\"\",\"\",'School Info'!$L$10)","v":"SATURDAY"},{"$f":"IF('School Info'!$M$10=\"\",\"\",'School Info'!$M$10)","v":"10:00AM TO 12:00PM"}]
[]
["Note :"]
["1. परीक्षार्थी अपना प्रवेश पत्र रोजाना साथ लेकर आये | (Candidates should bring their admit card with them daily.)"]
["2. परीक्षार्थी परीक्षा केंद्र पर आधा घंटे पहले पहुचें | (Candidates should reach the examination center half an hour before.)"]
["3. परीक्षार्थी परीक्षा हेतु आवश्यक सामग्री साथ लेकर आवें | (Candidates should bring with them the necessary materials for the examination.)"]
[]
[]
[]
[]
[]
["Sig. Exam Incharge",null,null,null,null,null,"Sig. Principal "]
[]
[{"$f":"IF('School Info'!$B$4=\"\",\"\",'School Info'!$B$4)","v":"Mahatma Gandhi Government School Bar"}]
[null,null,"School Aff. Code :",null,{"$f":"IF('School Info'!$F$5=\"\",\"\",'School Info'!$F$5)","v":123456}]
[null,null,{"$f":"IF('School Info'!$H$5=\"\",\"\",'School Info'!$H$5)","v":"HALF YEARLY EXAM"},null,{"$f":"IF('School Info'!$H$7=\"\",\"\",'School Info'!$H$7)","v":"2025-26"}]
[null,null,"ADMIT CARD",null,null,null,null,null,{"$f":"I1940+1","v":63}]
[]
["ROLL NO :  ",{"$f":"VLOOKUP(I1969,Student_data,3,0)","v":163},null,"CLASS : ",{"$f":"IF('School Info'!$B$7=\"\",\"\",'School Info'!$B$7)","v":6},"DOB :",{"$f":"VLOOKUP(I1969,Student_data,4,0)","v":"2063-01-01"}]
["NAME :  ",{"$f":"VLOOKUP(I1969,Student_data,6,0)","v":"SONU"},null,"MEDUIM : ",{"$f":"IF('School Info'!$E$7=\"\",\"\",'School Info'!$E$7)","v":"HINDI"},"GENDER :",{"$f":"VLOOKUP(I1969,Student_data,5,0)","v":"MALE"}]
["FATHER :  ",{"$f":"VLOOKUP(I1969,Student_data,7,0)","v":"AAA"},null,"SECTION : ",{"$f":"IF('School Info'!$F$8=\"\",\"\",'School Info'!$F$8)","v":"A"},"S.No. : ",{"$f":"VLOOKUP(I1969,Student_data,2,0)","v":0}]
["MOTHER :  ",{"$f":"VLOOKUP(I1969,Student_data,8,0)","v":"DDS"},null,"School DISE Code :",null,{"$f":"IF('School Info'!$B$5=\"\",\"\",'School Info'!$B$5)","v":123456890}]
[]
["SUBJECT","DATE","DAY","TIME "]
[{"$f":"IF('School Info'!$J$5=\"\",\"\",'School Info'!$J$5)","v":"HINDI"},{"$f":"IF('School Info'!$K$5=\"\",\"\",'School Info'!$K$5)","v":"2001-01-01"},{"$f":"IF('School Info'!$L$5=\"\",\"\",'School Info'!$L$5)","v":"MONDAY"},{"$f":"IF('School Info'!$M$5=\"\",\"\",'School Info'!$M$5)","v":"10:00AM TO 12:00PM"}]
[{"$f":"IF('School Info'!$J$6=\"\",\"\",'School Info'!$J$6)","v":"ENGLISH"},{"$f":"IF('School Info'!$K$6=\"\",\"\",'School Info'!$K$6)","v":"2001-01-01"},{"$f":"IF('School Info'!$L$6=\"\",\"\",'School Info'!$L$6)","v":"TUESDAY"},{"$f":"IF('School Info'!$M$6=\"\",\"\",'School Info'!$M$6)","v":"10:00AM TO 12:00PM"}]
[{"$f":"IF('School Info'!$J$7=\"\",\"\",'School Info'!$J$7)","v":"SCIENCE"},{"$f":"IF('School Info'!$K$7=\"\",\"\",'School Info'!$K$7)","v":"2001-01-01"},{"$f":"IF('School Info'!$L$7=\"\",\"\",'School Info'!$L$7)","v":"WEDNESDAY"},{"$f":"IF('School Info'!$M$7=\"\",\"\",'School Info'!$M$7)","v":"10:00AM TO 12:00PM"}]
[{"$f":"IF('School Info'!$J$8=\"\",\"\",'School Info'!$J$8)","v":"MATH"},{"$f":"IF('School Info'!$K$8=\"\",\"\",'School Info'!$K$8)","v":"2001-01-01"},{"$f":"IF('School Info'!$L$8=\"\",\"\",'School Info'!$L$8)","v":"THURSDAY"},{"$f":"IF('School Info'!$M$8=\"\",\"\",'School Info'!$M$8)","v":"10:00AM TO 12:00PM"}]
[{"$f":"IF('School Info'!$J$9=\"\",\"\",'School Info'!$J$9)","v":"SOCIAL SCIENCE"},{"$f":"IF('School Info'!$K$9=\"\",\"\",'School Info'!$K$9)","v":"2001-01-01"},{"$f":"IF('School Info'!$L$9=\"\",\"\",'School Info'!$L$9)","v":"FRIDAY"},{"$f":"IF('School Info'!$M$9=\"\",\"\",'School Info'!$M$9)","v":"10:00AM TO 12:00PM"}]
[{"$f":"IF('School Info'!$J$10=\"\",\"\",'School Info'!$J$10)","v":"SANSKRIT"},{"$f":"IF('School Info'!$K$10=\"\",\"\",'School Info'!$K$10)","v":"2001-01-01"},{"$f":"IF('School Info'!$L$10=\"\",\"\",'School Info'!$L$10)","v":"SATURDAY"},{"$f":"IF('School Info'!$M$10=\"\",\"\",'School Info'!$M$10)","v":"10:00AM TO 12:00PM"}]
[]
["Note :"]
["1. परीक्षार्थी अपना प्रवेश पत्र रोजाना साथ लेकर आये | (Candidates should bring their admit card with them daily.)"]
["2. परीक्षार्थी परीक्षा केंद्र पर आधा घंटे पहले पहुचें | (Candidates should reach the examination center half an hour before.)"]
["3. परीक्षार्थी परीक्षा हेतु आवश्यक सामग्री साथ लेकर आवें | (Candidates should bring with them the necessary materials for the examination.)"]
[]
[]
[]
[]
[]
["Sig. Exam Incharge",null,null,null,null,null,"Sig. Principal "]
[".------------------------------------------------------- Cut Here------------------------------------------------------"]
[{"$f":"IF('School Info'!$B$4=\"\",\"\",'School Info'!$B$4)","v":"Mahatma Gandhi Government School Bar"}]
[null,null,"School Aff. Code :",null,{"$f":"IF('School Info'!$F$5=\"\",\"\",'School Info'!$F$5)","v":123456}]
[null,null,{"$f":"IF('School Info'!$H$5=\"\",\"\",'School Info'!$H$5)","v":"HALF YEARLY EXAM"},null,{"$f":"IF('School Info'!$H$7=\"\",\"\",'School Info'!$H$7)","v":"2025-26"}]
[null,null,"ADMIT CARD",null,null,null,null,null,{"$f":"I1969+1","v":64}]
[]
["ROLL NO :  ",{"$f":"VLOOKUP(I1998,Student_data,3,0)","v":164},null,"CLASS : ",{"$f":"IF('School Info'!$B$7=\"\",\"\",'School Info'!$B$7)","v":6},"DOB :",{"$f":"VLOOKUP(I1998,Student_data,4,0)","v":"2064-01-01"}]
["NAME :  ",{"$f":"VLOOKUP(I1998,Student_data,6,0)","v":"KARNA"},null,"MEDUIM : ",{"$f":"IF('School Info'!$E$7=\"\",\"\",'School Info'!$E$7)","v":"HINDI"},"GENDER :",{"$f":"VLOOKUP(I1998,Student_data,5,0)","v":"MALE"}]
["FATHER :  ",{"$f":"VLOOKUP(I1998,Student_data,7,0)","v":"BBB"},null,"SECTION : ",{"$f":"IF('School Info'!$F$8=\"\",\"\",'School Info'!$F$8)","v":"A"},"S.No. : ",{"$f":"VLOOKUP(I1998,Student_data,2,0)","v":0}]
["MOTHER :  ",{"$f":"VLOOKUP(I1998,Student_data,8,0)","v":"SSDDF"},null,"School DISE Code :",null,{"$f":"IF('School Info'!$B$5=\"\",\"\",'School Info'!$B$5)","v":123456890}]
[]
["SUBJECT","DATE","DAY","TIME "]
[{"$f":"IF('School Info'!$J$5=\"\",\"\",'School Info'!$J$5)","v":"HINDI"},{"$f":"IF('School Info'!$K$5=\"\",\"\",'School Info'!$K$5)","v":"2001-01-01"},{"$f":"IF('School Info'!$L$5=\"\",\"\",'School Info'!$L$5)","v":"MONDAY"},{"$f":"IF('School Info'!$M$5=\"\",\"\",'School Info'!$M$5)","v":"10:00AM TO 12:00PM"}]
[{"$f":"IF('School Info'!$J$6=\"\",\"\",'School Info'!$J$6)","v":"ENGLISH"},{"$f":"IF('School Info'!$K$6=\"\",\"\",'School Info'!$K$6)","v":"2001-01-01"},{"$f":"IF('School Info'!$L$6=\"\",\"\",'School Info'!$L$6)","v":"TUESDAY"},{"$f":"IF('School Info'!$M$6=\"\",\"\",'School Info'!$M$6)","v":"10:00AM TO 12:00PM"}]
[{"$f":"IF('School Info'!$J$7=\"\",\"\",'School Info'!$J$7)","v":"SCIENCE"},{"$f":"IF('School Info'!$K$7=\"\",\"\",'School Info'!$K$7)","v":"2001-01-01"},{"$f":"IF('School Info'!$L$7=\"\",\"\",'School Info'!$L$7)","v":"WEDNESDAY"},{"$f":"IF('School Info'!$M$7=\"\",\"\",'School Info'!$M$7)","v":"10:00AM TO 12:00PM"}]
[{"$f":"IF('School Info'!$J$8=\"\",\"\",'School Info'!$J$8)","v":"MATH"},{"$f":"IF('School Info'!$K$8=\"\",\"\",'School Info'!$K$8)","v":"2001-01-01"},{"$f":"IF('School Info'!$L$8=\"\",\"\",'School Info'!$L$8)","v":"THURSDAY"},{"$f":"IF('School Info'!$M$8=\"\",\"\",'School Info'!$M$8)","v":"10:00AM TO 12:00PM"}]
[{"$f":"IF('School Info'!$J$9=\"\",\"\",'School Info'!$J$9)","v":"SOCIAL SCIENCE"},{"$f":"IF('School Info'!$K$9=\"\",\"\",'School Info'!$K$9)","v":"2001-01-01"},{"$f":"IF('School Info'!$L$9=\"\",\"\",'School Info'!$L$9)","v":"FRIDAY"},{"$f":"IF('School Info'!$M$9=\"\",\"\",'School Info'!$M$9)","v":"10:00AM TO 12:00PM"}]
[{"$f":"IF('School Info'!$J$10=\"\",\"\",'School Info'!$J$10)","v":"SANSKRIT"},{"$f":"IF('School Info'!$K$10=\"\",\"\",'School Info'!$K$10)","v":"2001-01-01"},{"$f":"IF('School Info'!$L$10=\"\",\"\",'School Info'!$L$10)","v":"SATURDAY"},{"$f":"IF('School Info'!$M$10=\"\",\"\",'School Info'!$M$10)","v":"10:00AM TO 12:00PM"}]
[]
["Note :"]
["1. परीक्षार्थी अपना प्रवेश पत्र रोजाना साथ लेकर आये | (Candidates should bring their admit card with them daily.)"]
["2. परीक्षार्थी परीक्षा केंद्र पर आधा घंटे पहले पहुचें | (Candidates should reach the examination center half an hour before.)"]
["3. परीक्षार्थी परीक्षा हेतु आवश्यक सामग्री साथ लेकर आवें | (Candidates should bring with them the necessary materials for the examination.)"]
[]
[]
[]
[]
[]
["Sig. Exam Incharge",null,null,null,null,null,"Sig. Principal "]
[]
[{"$f":"IF('School Info'!$B$4=\"\",\"\",'School Info'!$B$4)","v":"Mahatma Gandhi Government School Bar"}]
[null,null,"School Aff. Code :",null,{"$f":"IF('School Info'!$F$5=\"\",\"\",'School Info'!$F$5)","v":123456}]
[null,null,{"$f":"IF('School Info'!$H$5=\"\",\"\",'School Info'!$H$5)","v":"HALF YEARLY EXAM"},null,{"$f":"IF('School Info'!$H$7=\"\",\"\",'School Info'!$H$7)","v":"2025-26"}]
[null,null,"ADMIT CARD",null,null,null,null,null,{"$f":"I1998+1","v":65}]
[]
["ROLL NO :  ",{"$f":"VLOOKUP(I2027,Student_data,3,0)","v":165},null,"CLASS : ",{"$f":"IF('School Info'!$B$7=\"\",\"\",'School Info'!$B$7)","v":6},"DOB :",{"$f":"VLOOKUP(I2027,Student_data,4,0)","v":"2065-01-01"}]
["NAME :  ",{"$f":"VLOOKUP(I2027,Student_data,6,0)","v":"RAJA  "},null,"MEDUIM : ",{"$f":"IF('School Info'!$E$7=\"\",\"\",'School Info'!$E$7)","v":"HINDI"},"GENDER :",{"$f":"VLOOKUP(I2027,Student_data,5,0)","v":"MALE"}]
["FATHER :  ",{"$f":"VLOOKUP(I2027,Student_data,7,0)","v":"DFD"},null,"SECTION : ",{"$f":"IF('School Info'!$F$8=\"\",\"\",'School Info'!$F$8)","v":"A"},"S.No. : ",{"$f":"VLOOKUP(I2027,Student_data,2,0)","v":0}]
["MOTHER :  ",{"$f":"VLOOKUP(I2027,Student_data,8,0)","v":"GAG"},null,"School DISE Code :",null,{"$f":"IF('School Info'!$B$5=\"\",\"\",'School Info'!$B$5)","v":123456890}]
[]
["SUBJECT","DATE","DAY","TIME "]
[{"$f":"IF('School Info'!$J$5=\"\",\"\",'School Info'!$J$5)","v":"HINDI"},{"$f":"IF('School Info'!$K$5=\"\",\"\",'School Info'!$K$5)","v":"2001-01-01"},{"$f":"IF('School Info'!$L$5=\"\",\"\",'School Info'!$L$5)","v":"MONDAY"},{"$f":"IF('School Info'!$M$5=\"\",\"\",'School Info'!$M$5)","v":"10:00AM TO 12:00PM"}]
[{"$f":"IF('School Info'!$J$6=\"\",\"\",'School Info'!$J$6)","v":"ENGLISH"},{"$f":"IF('School Info'!$K$6=\"\",\"\",'School Info'!$K$6)","v":"2001-01-01"},{"$f":"IF('School Info'!$L$6=\"\",\"\",'School Info'!$L$6)","v":"TUESDAY"},{"$f":"IF('School Info'!$M$6=\"\",\"\",'School Info'!$M$6)","v":"10:00AM TO 12:00PM"}]
[{"$f":"IF('School Info'!$J$7=\"\",\"\",'School Info'!$J$7)","v":"SCIENCE"},{"$f":"IF('School Info'!$K$7=\"\",\"\",'School Info'!$K$7)","v":"2001-01-01"},{"$f":"IF('School Info'!$L$7=\"\",\"\",'School Info'!$L$7)","v":"WEDNESDAY"},{"$f":"IF('School Info'!$M$7=\"\",\"\",'School Info'!$M$7)","v":"10:00AM TO 12:00PM"}]
[{"$f":"IF('School Info'!$J$8=\"\",\"\",'School Info'!$J$8)","v":"MATH"},{"$f":"IF('School Info'!$K$8=\"\",\"\",'School Info'!$K$8)","v":"2001-01-01"},{"$f":"IF('School Info'!$L$8=\"\",\"\",'School Info'!$L$8)","v":"THURSDAY"},{"$f":"IF('School Info'!$M$8=\"\",\"\",'School Info'!$M$8)","v":"10:00AM TO 12:00PM"}]
[{"$f":"IF('School Info'!$J$9=\"\",\"\",'School Info'!$J$9)","v":"SOCIAL SCIENCE"},{"$f":"IF('School Info'!$K$9=\"\",\"\",'School Info'!$K$9)","v":"2001-01-01"},{"$f":"IF('School Info'!$L$9=\"\",\"\",'School Info'!$L$9)","v":"FRIDAY"},{"$f":"IF('School Info'!$M$9=\"\",\"\",'School Info'!$M$9)","v":"10:00AM TO 12:00PM"}]
[{"$f":"IF('School Info'!$J$10=\"\",\"\",'School Info'!$J$10)","v":"SANSKRIT"},{"$f":"IF('School Info'!$K$10=\"\",\"\",'School Info'!$K$10)","v":"2001-01-01"},{"$f":"IF('School Info'!$L$10=\"\",\"\",'School Info'!$L$10)","v":"SATURDAY"},{"$f":"IF('School Info'!$M$10=\"\",\"\",'School Info'!$M$10)","v":"10:00AM TO 12:00PM"}]
[]
["Note :"]
["1. परीक्षार्थी अपना प्रवेश पत्र रोजाना साथ लेकर आये | (Candidates should bring their admit card with them daily.)"]
["2. परीक्षार्थी परीक्षा केंद्र पर आधा घंटे पहले पहुचें | (Candidates should reach the examination center half an hour before.)"]
["3. परीक्षार्थी परीक्षा हेतु आवश्यक सामग्री साथ लेकर आवें | (Candidates should bring with them the necessary materials for the examination.)"]
[]
[]
[]
[]
[]
["Sig. Exam Incharge",null,null,null,null,null,"Sig. Principal "]
[".------------------------------------------------------- Cut Here------------------------------------------------------"]
[{"$f":"IF('School Info'!$B$4=\"\",\"\",'School Info'!$B$4)","v":"Mahatma Gandhi Government School Bar"}]
[null,null,"School Aff. Code :",null,{"$f":"IF('School Info'!$F$5=\"\",\"\",'School Info'!$F$5)","v":123456}]
[null,null,{"$f":"IF('School Info'!$H$5=\"\",\"\",'School Info'!$H$5)","v":"HALF YEARLY EXAM"},null,{"$f":"IF('School Info'!$H$7=\"\",\"\",'School Info'!$H$7)","v":"2025-26"}]
[null,null,"ADMIT CARD",null,null,null,null,null,{"$f":"I2027+1","v":66}]
[]
["ROLL NO :  ",{"$f":"VLOOKUP(I2056,Student_data,3,0)","v":166},null,"CLASS : ",{"$f":"IF('School Info'!$B$7=\"\",\"\",'School Info'!$B$7)","v":6},"DOB :",{"$f":"VLOOKUP(I2056,Student_data,4,0)","v":"2066-01-01"}]
["NAME :  ",{"$f":"VLOOKUP(I2056,Student_data,6,0)","v":"RAJ GURUJI"},null,"MEDUIM : ",{"$f":"IF('School Info'!$E$7=\"\",\"\",'School Info'!$E$7)","v":"HINDI"},"GENDER :",{"$f":"VLOOKUP(I2056,Student_data,5,0)","v":"MALE"}]
["FATHER :  ",{"$f":"VLOOKUP(I2056,Student_data,7,0)","v":"RAJ"},null,"SECTION : ",{"$f":"IF('School Info'!$F$8=\"\",\"\",'School Info'!$F$8)","v":"A"},"S.No. : ",{"$f":"VLOOKUP(I2056,Student_data,2,0)","v":0}]
["MOTHER :  ",{"$f":"VLOOKUP(I2056,Student_data,8,0)","v":"DEVI"},null,"School DISE Code :",null,{"$f":"IF('School Info'!$B$5=\"\",\"\",'School Info'!$B$5)","v":123456890}]
[]
["SUBJECT","DATE","DAY","TIME "]
[{"$f":"IF('School Info'!$J$5=\"\",\"\",'School Info'!$J$5)","v":"HINDI"},{"$f":"IF('School Info'!$K$5=\"\",\"\",'School Info'!$K$5)","v":"2001-01-01"},{"$f":"IF('School Info'!$L$5=\"\",\"\",'School Info'!$L$5)","v":"MONDAY"},{"$f":"IF('School Info'!$M$5=\"\",\"\",'School Info'!$M$5)","v":"10:00AM TO 12:00PM"}]
[{"$f":"IF('School Info'!$J$6=\"\",\"\",'School Info'!$J$6)","v":"ENGLISH"},{"$f":"IF('School Info'!$K$6=\"\",\"\",'School Info'!$K$6)","v":"2001-01-01"},{"$f":"IF('School Info'!$L$6=\"\",\"\",'School Info'!$L$6)","v":"TUESDAY"},{"$f":"IF('School Info'!$M$6=\"\",\"\",'School Info'!$M$6)","v":"10:00AM TO 12:00PM"}]
[{"$f":"IF('School Info'!$J$7=\"\",\"\",'School Info'!$J$7)","v":"SCIENCE"},{"$f":"IF('School Info'!$K$7=\"\",\"\",'School Info'!$K$7)","v":"2001-01-01"},{"$f":"IF('School Info'!$L$7=\"\",\"\",'School Info'!$L$7)","v":"WEDNESDAY"},{"$f":"IF('School Info'!$M$7=\"\",\"\",'School Info'!$M$7)","v":"10:00AM TO 12:00PM"}]
[{"$f":"IF('School Info'!$J$8=\"\",\"\",'School Info'!$J$8)","v":"MATH"},{"$f":"IF('School Info'!$K$8=\"\",\"\",'School Info'!$K$8)","v":"2001-01-01"},{"$f":"IF('School Info'!$L$8=\"\",\"\",'School Info'!$L$8)","v":"THURSDAY"},{"$f":"IF('School Info'!$M$8=\"\",\"\",'School Info'!$M$8)","v":"10:00AM TO 12:00PM"}]
[{"$f":"IF('School Info'!$J$9=\"\",\"\",'School Info'!$J$9)","v":"SOCIAL SCIENCE"},{"$f":"IF('School Info'!$K$9=\"\",\"\",'School Info'!$K$9)","v":"2001-01-01"},{"$f":"IF('School Info'!$L$9=\"\",\"\",'School Info'!$L$9)","v":"FRIDAY"},{"$f":"IF('School Info'!$M$9=\"\",\"\",'School Info'!$M$9)","v":"10:00AM TO 12:00PM"}]
[{"$f":"IF('School Info'!$J$10=\"\",\"\",'School Info'!$J$10)","v":"SANSKRIT"},{"$f":"IF('School Info'!$K$10=\"\",\"\",'School Info'!$K$10)","v":"2001-01-01"},{"$f":"IF('School Info'!$L$10=\"\",\"\",'School Info'!$L$10)","v":"SATURDAY"},{"$f":"IF('School Info'!$M$10=\"\",\"\",'School Info'!$M$10)","v":"10:00AM TO 12:00PM"}]
[]
["Note :"]
["1. परीक्षार्थी अपना प्रवेश पत्र रोजाना साथ लेकर आये | (Candidates should bring their admit card with them daily.)"]
["2. परीक्षार्थी परीक्षा केंद्र पर आधा घंटे पहले पहुचें | (Candidates should reach the examination center half an hour before.)"]
["3. परीक्षार्थी परीक्षा हेतु आवश्यक सामग्री साथ लेकर आवें | (Candidates should bring with them the necessary materials for the examination.)"]
[]
[]
[]
[]
[]
["Sig. Exam Incharge",null,null,null,null,null,"Sig. Principal "]
[]
[{"$f":"IF('School Info'!$B$4=\"\",\"\",'School Info'!$B$4)","v":"Mahatma Gandhi Government School Bar"}]
[null,null,"School Aff. Code :",null,{"$f":"IF('School Info'!$F$5=\"\",\"\",'School Info'!$F$5)","v":123456}]
[null,null,{"$f":"IF('School Info'!$H$5=\"\",\"\",'School Info'!$H$5)","v":"HALF YEARLY EXAM"},null,{"$f":"IF('School Info'!$H$7=\"\",\"\",'School Info'!$H$7)","v":"2025-26"}]
[null,null,"ADMIT CARD",null,null,null,null,null,{"$f":"I2056+1","v":67}]
[]
["ROLL NO :  ",{"$f":"VLOOKUP(I2085,Student_data,3,0)","v":167},null,"CLASS : ",{"$f":"IF('School Info'!$B$7=\"\",\"\",'School Info'!$B$7)","v":6},"DOB :",{"$f":"VLOOKUP(I2085,Student_data,4,0)","v":"2067-01-01"}]
["NAME :  ",{"$f":"VLOOKUP(I2085,Student_data,6,0)","v":"MONU"},null,"MEDUIM : ",{"$f":"IF('School Info'!$E$7=\"\",\"\",'School Info'!$E$7)","v":"HINDI"},"GENDER :",{"$f":"VLOOKUP(I2085,Student_data,5,0)","v":"MALE"}]
["FATHER :  ",{"$f":"VLOOKUP(I2085,Student_data,7,0)","v":"RAAA"},null,"SECTION : ",{"$f":"IF('School Info'!$F$8=\"\",\"\",'School Info'!$F$8)","v":"A"},"S.No. : ",{"$f":"VLOOKUP(I2085,Student_data,2,0)","v":0}]
["MOTHER :  ",{"$f":"VLOOKUP(I2085,Student_data,8,0)","v":"DDD"},null,"School DISE Code :",null,{"$f":"IF('School Info'!$B$5=\"\",\"\",'School Info'!$B$5)","v":123456890}]
[]
["SUBJECT","DATE","DAY","TIME "]
[{"$f":"IF('School Info'!$J$5=\"\",\"\",'School Info'!$J$5)","v":"HINDI"},{"$f":"IF('School Info'!$K$5=\"\",\"\",'School Info'!$K$5)","v":"2001-01-01"},{"$f":"IF('School Info'!$L$5=\"\",\"\",'School Info'!$L$5)","v":"MONDAY"},{"$f":"IF('School Info'!$M$5=\"\",\"\",'School Info'!$M$5)","v":"10:00AM TO 12:00PM"}]
[{"$f":"IF('School Info'!$J$6=\"\",\"\",'School Info'!$J$6)","v":"ENGLISH"},{"$f":"IF('School Info'!$K$6=\"\",\"\",'School Info'!$K$6)","v":"2001-01-01"},{"$f":"IF('School Info'!$L$6=\"\",\"\",'School Info'!$L$6)","v":"TUESDAY"},{"$f":"IF('School Info'!$M$6=\"\",\"\",'School Info'!$M$6)","v":"10:00AM TO 12:00PM"}]
[{"$f":"IF('School Info'!$J$7=\"\",\"\",'School Info'!$J$7)","v":"SCIENCE"},{"$f":"IF('School Info'!$K$7=\"\",\"\",'School Info'!$K$7)","v":"2001-01-01"},{"$f":"IF('School Info'!$L$7=\"\",\"\",'School Info'!$L$7)","v":"WEDNESDAY"},{"$f":"IF('School Info'!$M$7=\"\",\"\",'School Info'!$M$7)","v":"10:00AM TO 12:00PM"}]
[{"$f":"IF('School Info'!$J$8=\"\",\"\",'School Info'!$J$8)","v":"MATH"},{"$f":"IF('School Info'!$K$8=\"\",\"\",'School Info'!$K$8)","v":"2001-01-01"},{"$f":"IF('School Info'!$L$8=\"\",\"\",'School Info'!$L$8)","v":"THURSDAY"},{"$f":"IF('School Info'!$M$8=\"\",\"\",'School Info'!$M$8)","v":"10:00AM TO 12:00PM"}]
[{"$f":"IF('School Info'!$J$9=\"\",\"\",'School Info'!$J$9)","v":"SOCIAL SCIENCE"},{"$f":"IF('School Info'!$K$9=\"\",\"\",'School Info'!$K$9)","v":"2001-01-01"},{"$f":"IF('School Info'!$L$9=\"\",\"\",'School Info'!$L$9)","v":"FRIDAY"},{"$f":"IF('School Info'!$M$9=\"\",\"\",'School Info'!$M$9)","v":"10:00AM TO 12:00PM"}]
[{"$f":"IF('School Info'!$J$10=\"\",\"\",'School Info'!$J$10)","v":"SANSKRIT"},{"$f":"IF('School Info'!$K$10=\"\",\"\",'School Info'!$K$10)","v":"2001-01-01"},{"$f":"IF('School Info'!$L$10=\"\",\"\",'School Info'!$L$10)","v":"SATURDAY"},{"$f":"IF('School Info'!$M$10=\"\",\"\",'School Info'!$M$10)","v":"10:00AM TO 12:00PM"}]
[]
["Note :"]
["1. परीक्षार्थी अपना प्रवेश पत्र रोजाना साथ लेकर आये | (Candidates should bring their admit card with them daily.)"]
["2. परीक्षार्थी परीक्षा केंद्र पर आधा घंटे पहले पहुचें | (Candidates should reach the examination center half an hour before.)"]
["3. परीक्षार्थी परीक्षा हेतु आवश्यक सामग्री साथ लेकर आवें | (Candidates should bring with them the necessary materials for the examination.)"]
[]
[]
[]
[]
[]
["Sig. Exam Incharge",null,null,null,null,null,"Sig. Principal "]
[".------------------------------------------------------- Cut Here------------------------------------------------------"]
[{"$f":"IF('School Info'!$B$4=\"\",\"\",'School Info'!$B$4)","v":"Mahatma Gandhi Government School Bar"}]
[null,null,"School Aff. Code :",null,{"$f":"IF('School Info'!$F$5=\"\",\"\",'School Info'!$F$5)","v":123456}]
[null,null,{"$f":"IF('School Info'!$H$5=\"\",\"\",'School Info'!$H$5)","v":"HALF YEARLY EXAM"},null,{"$f":"IF('School Info'!$H$7=\"\",\"\",'School Info'!$H$7)","v":"2025-26"}]
[null,null,"ADMIT CARD",null,null,null,null,null,{"$f":"I2085+1","v":68}]
[]
["ROLL NO :  ",{"$f":"VLOOKUP(I2114,Student_data,3,0)","v":168},null,"CLASS : ",{"$f":"IF('School Info'!$B$7=\"\",\"\",'School Info'!$B$7)","v":6},"DOB :",{"$f":"VLOOKUP(I2114,Student_data,4,0)","v":"2068-01-01"}]
["NAME :  ",{"$f":"VLOOKUP(I2114,Student_data,6,0)","v":"SONU"},null,"MEDUIM : ",{"$f":"IF('School Info'!$E$7=\"\",\"\",'School Info'!$E$7)","v":"HINDI"},"GENDER :",{"$f":"VLOOKUP(I2114,Student_data,5,0)","v":"MALE"}]
["FATHER :  ",{"$f":"VLOOKUP(I2114,Student_data,7,0)","v":"AAA"},null,"SECTION : ",{"$f":"IF('School Info'!$F$8=\"\",\"\",'School Info'!$F$8)","v":"A"},"S.No. : ",{"$f":"VLOOKUP(I2114,Student_data,2,0)","v":0}]
["MOTHER :  ",{"$f":"VLOOKUP(I2114,Student_data,8,0)","v":"DDS"},null,"School DISE Code :",null,{"$f":"IF('School Info'!$B$5=\"\",\"\",'School Info'!$B$5)","v":123456890}]
[]
["SUBJECT","DATE","DAY","TIME "]
[{"$f":"IF('School Info'!$J$5=\"\",\"\",'School Info'!$J$5)","v":"HINDI"},{"$f":"IF('School Info'!$K$5=\"\",\"\",'School Info'!$K$5)","v":"2001-01-01"},{"$f":"IF('School Info'!$L$5=\"\",\"\",'School Info'!$L$5)","v":"MONDAY"},{"$f":"IF('School Info'!$M$5=\"\",\"\",'School Info'!$M$5)","v":"10:00AM TO 12:00PM"}]
[{"$f":"IF('School Info'!$J$6=\"\",\"\",'School Info'!$J$6)","v":"ENGLISH"},{"$f":"IF('School Info'!$K$6=\"\",\"\",'School Info'!$K$6)","v":"2001-01-01"},{"$f":"IF('School Info'!$L$6=\"\",\"\",'School Info'!$L$6)","v":"TUESDAY"},{"$f":"IF('School Info'!$M$6=\"\",\"\",'School Info'!$M$6)","v":"10:00AM TO 12:00PM"}]
[{"$f":"IF('School Info'!$J$7=\"\",\"\",'School Info'!$J$7)","v":"SCIENCE"},{"$f":"IF('School Info'!$K$7=\"\",\"\",'School Info'!$K$7)","v":"2001-01-01"},{"$f":"IF('School Info'!$L$7=\"\",\"\",'School Info'!$L$7)","v":"WEDNESDAY"},{"$f":"IF('School Info'!$M$7=\"\",\"\",'School Info'!$M$7)","v":"10:00AM TO 12:00PM"}]
[{"$f":"IF('School Info'!$J$8=\"\",\"\",'School Info'!$J$8)","v":"MATH"},{"$f":"IF('School Info'!$K$8=\"\",\"\",'School Info'!$K$8)","v":"2001-01-01"},{"$f":"IF('School Info'!$L$8=\"\",\"\",'School Info'!$L$8)","v":"THURSDAY"},{"$f":"IF('School Info'!$M$8=\"\",\"\",'School Info'!$M$8)","v":"10:00AM TO 12:00PM"}]
[{"$f":"IF('School Info'!$J$9=\"\",\"\",'School Info'!$J$9)","v":"SOCIAL SCIENCE"},{"$f":"IF('School Info'!$K$9=\"\",\"\",'School Info'!$K$9)","v":"2001-01-01"},{"$f":"IF('School Info'!$L$9=\"\",\"\",'School Info'!$L$9)","v":"FRIDAY"},{"$f":"IF('School Info'!$M$9=\"\",\"\",'School Info'!$M$9)","v":"10:00AM TO 12:00PM"}]
[{"$f":"IF('School Info'!$J$10=\"\",\"\",'School Info'!$J$10)","v":"SANSKRIT"},{"$f":"IF('School Info'!$K$10=\"\",\"\",'School Info'!$K$10)","v":"2001-01-01"},{"$f":"IF('School Info'!$L$10=\"\",\"\",'School Info'!$L$10)","v":"SATURDAY"},{"$f":"IF('School Info'!$M$10=\"\",\"\",'School Info'!$M$10)","v":"10:00AM TO 12:00PM"}]
[]
["Note :"]
["1. परीक्षार्थी अपना प्रवेश पत्र रोजाना साथ लेकर आये | (Candidates should bring their admit card with them daily.)"]
["2. परीक्षार्थी परीक्षा केंद्र पर आधा घंटे पहले पहुचें | (Candidates should reach the examination center half an hour before.)"]
["3. परीक्षार्थी परीक्षा हेतु आवश्यक सामग्री साथ लेकर आवें | (Candidates should bring with them the necessary materials for the examination.)"]
[]
[]
[]
[]
[]
["Sig. Exam Incharge",null,null,null,null,null,"Sig. Principal "]
[]
[{"$f":"IF('School Info'!$B$4=\"\",\"\",'School Info'!$B$4)","v":"Mahatma Gandhi Government School Bar"}]
[null,null,"School Aff. Code :",null,{"$f":"IF('School Info'!$F$5=\"\",\"\",'School Info'!$F$5)","v":123456}]
[null,null,{"$f":"IF('School Info'!$H$5=\"\",\"\",'School Info'!$H$5)","v":"HALF YEARLY EXAM"},null,{"$f":"IF('School Info'!$H$7=\"\",\"\",'School Info'!$H$7)","v":"2025-26"}]
[null,null,"ADMIT CARD",null,null,null,null,null,{"$f":"I2114+1","v":69}]
[]
["ROLL NO :  ",{"$f":"VLOOKUP(I2143,Student_data,3,0)","v":169},null,"CLASS : ",{"$f":"IF('School Info'!$B$7=\"\",\"\",'School Info'!$B$7)","v":6},"DOB :",{"$f":"VLOOKUP(I2143,Student_data,4,0)","v":"2069-01-01"}]
["NAME :  ",{"$f":"VLOOKUP(I2143,Student_data,6,0)","v":"KARNA"},null,"MEDUIM : ",{"$f":"IF('School Info'!$E$7=\"\",\"\",'School Info'!$E$7)","v":"HINDI"},"GENDER :",{"$f":"VLOOKUP(I2143,Student_data,5,0)","v":"MALE"}]
["FATHER :  ",{"$f":"VLOOKUP(I2143,Student_data,7,0)","v":"BBB"},null,"SECTION : ",{"$f":"IF('School Info'!$F$8=\"\",\"\",'School Info'!$F$8)","v":"A"},"S.No. : ",{"$f":"VLOOKUP(I2143,Student_data,2,0)","v":0}]
["MOTHER :  ",{"$f":"VLOOKUP(I2143,Student_data,8,0)","v":"SSDDF"},null,"School DISE Code :",null,{"$f":"IF('School Info'!$B$5=\"\",\"\",'School Info'!$B$5)","v":123456890}]
[]
["SUBJECT","DATE","DAY","TIME "]
[{"$f":"IF('School Info'!$J$5=\"\",\"\",'School Info'!$J$5)","v":"HINDI"},{"$f":"IF('School Info'!$K$5=\"\",\"\",'School Info'!$K$5)","v":"2001-01-01"},{"$f":"IF('School Info'!$L$5=\"\",\"\",'School Info'!$L$5)","v":"MONDAY"},{"$f":"IF('School Info'!$M$5=\"\",\"\",'School Info'!$M$5)","v":"10:00AM TO 12:00PM"}]
[{"$f":"IF('School Info'!$J$6=\"\",\"\",'School Info'!$J$6)","v":"ENGLISH"},{"$f":"IF('School Info'!$K$6=\"\",\"\",'School Info'!$K$6)","v":"2001-01-01"},{"$f":"IF('School Info'!$L$6=\"\",\"\",'School Info'!$L$6)","v":"TUESDAY"},{"$f":"IF('School Info'!$M$6=\"\",\"\",'School Info'!$M$6)","v":"10:00AM TO 12:00PM"}]
[{"$f":"IF('School Info'!$J$7=\"\",\"\",'School Info'!$J$7)","v":"SCIENCE"},{"$f":"IF('School Info'!$K$7=\"\",\"\",'School Info'!$K$7)","v":"2001-01-01"},{"$f":"IF('School Info'!$L$7=\"\",\"\",'School Info'!$L$7)","v":"WEDNESDAY"},{"$f":"IF('School Info'!$M$7=\"\",\"\",'School Info'!$M$7)","v":"10:00AM TO 12:00PM"}]
[{"$f":"IF('School Info'!$J$8=\"\",\"\",'School Info'!$J$8)","v":"MATH"},{"$f":"IF('School Info'!$K$8=\"\",\"\",'School Info'!$K$8)","v":"2001-01-01"},{"$f":"IF('School Info'!$L$8=\"\",\"\",'School Info'!$L$8)","v":"THURSDAY"},{"$f":"IF('School Info'!$M$8=\"\",\"\",'School Info'!$M$8)","v":"10:00AM TO 12:00PM"}]
[{"$f":"IF('School Info'!$J$9=\"\",\"\",'School Info'!$J$9)","v":"SOCIAL SCIENCE"},{"$f":"IF('School Info'!$K$9=\"\",\"\",'School Info'!$K$9)","v":"2001-01-01"},{"$f":"IF('School Info'!$L$9=\"\",\"\",'School Info'!$L$9)","v":"FRIDAY"},{"$f":"IF('School Info'!$M$9=\"\",\"\",'School Info'!$M$9)","v":"10:00AM TO 12:00PM"}]
[{"$f":"IF('School Info'!$J$10=\"\",\"\",'School Info'!$J$10)","v":"SANSKRIT"},{"$f":"IF('School Info'!$K$10=\"\",\"\",'School Info'!$K$10)","v":"2001-01-01"},{"$f":"IF('School Info'!$L$10=\"\",\"\",'School Info'!$L$10)","v":"SATURDAY"},{"$f":"IF('School Info'!$M$10=\"\",\"\",'School Info'!$M$10)","v":"10:00AM TO 12:00PM"}]
[]
["Note :"]
["1. परीक्षार्थी अपना प्रवेश पत्र रोजाना साथ लेकर आये | (Candidates should bring their admit card with them daily.)"]
["2. परीक्षार्थी परीक्षा केंद्र पर आधा घंटे पहले पहुचें | (Candidates should reach the examination center half an hour before.)"]
["3. परीक्षार्थी परीक्षा हेतु आवश्यक सामग्री साथ लेकर आवें | (Candidates should bring with them the necessary materials for the examination.)"]
[]
[]
[]
[]
[]
["Sig. Exam Incharge",null,null,null,null,null,"Sig. Principal "]
[".------------------------------------------------------- Cut Here------------------------------------------------------"]
[{"$f":"IF('School Info'!$B$4=\"\",\"\",'School Info'!$B$4)","v":"Mahatma Gandhi Government School Bar"}]
[null,null,"School Aff. Code :",null,{"$f":"IF('School Info'!$F$5=\"\",\"\",'School Info'!$F$5)","v":123456}]
[null,null,{"$f":"IF('School Info'!$H$5=\"\",\"\",'School Info'!$H$5)","v":"HALF YEARLY EXAM"},null,{"$f":"IF('School Info'!$H$7=\"\",\"\",'School Info'!$H$7)","v":"2025-26"}]
[null,null,"ADMIT CARD",null,null,null,null,null,{"$f":"I2143+1","v":70}]
[]
["ROLL NO :  ",{"$f":"VLOOKUP(I2172,Student_data,3,0)","v":170},null,"CLASS : ",{"$f":"IF('School Info'!$B$7=\"\",\"\",'School Info'!$B$7)","v":6},"DOB :",{"$f":"VLOOKUP(I2172,Student_data,4,0)","v":"2070-01-01"}]
["NAME :  ",{"$f":"VLOOKUP(I2172,Student_data,6,0)","v":"RAJA  "},null,"MEDUIM : ",{"$f":"IF('School Info'!$E$7=\"\",\"\",'School Info'!$E$7)","v":"HINDI"},"GENDER :",{"$f":"VLOOKUP(I2172,Student_data,5,0)","v":"MALE"}]
["FATHER :  ",{"$f":"VLOOKUP(I2172,Student_data,7,0)","v":"DFD"},null,"SECTION : ",{"$f":"IF('School Info'!$F$8=\"\",\"\",'School Info'!$F$8)","v":"A"},"S.No. : ",{"$f":"VLOOKUP(I2172,Student_data,2,0)","v":0}]
["MOTHER :  ",{"$f":"VLOOKUP(I2172,Student_data,8,0)","v":"GAG"},null,"School DISE Code :",null,{"$f":"IF('School Info'!$B$5=\"\",\"\",'School Info'!$B$5)","v":123456890}]
[]
["SUBJECT","DATE","DAY","TIME "]
[{"$f":"IF('School Info'!$J$5=\"\",\"\",'School Info'!$J$5)","v":"HINDI"},{"$f":"IF('School Info'!$K$5=\"\",\"\",'School Info'!$K$5)","v":"2001-01-01"},{"$f":"IF('School Info'!$L$5=\"\",\"\",'School Info'!$L$5)","v":"MONDAY"},{"$f":"IF('School Info'!$M$5=\"\",\"\",'School Info'!$M$5)","v":"10:00AM TO 12:00PM"}]
[{"$f":"IF('School Info'!$J$6=\"\",\"\",'School Info'!$J$6)","v":"ENGLISH"},{"$f":"IF('School Info'!$K$6=\"\",\"\",'School Info'!$K$6)","v":"2001-01-01"},{"$f":"IF('School Info'!$L$6=\"\",\"\",'School Info'!$L$6)","v":"TUESDAY"},{"$f":"IF('School Info'!$M$6=\"\",\"\",'School Info'!$M$6)","v":"10:00AM TO 12:00PM"}]
[{"$f":"IF('School Info'!$J$7=\"\",\"\",'School Info'!$J$7)","v":"SCIENCE"},{"$f":"IF('School Info'!$K$7=\"\",\"\",'School Info'!$K$7)","v":"2001-01-01"},{"$f":"IF('School Info'!$L$7=\"\",\"\",'School Info'!$L$7)","v":"WEDNESDAY"},{"$f":"IF('School Info'!$M$7=\"\",\"\",'School Info'!$M$7)","v":"10:00AM TO 12:00PM"}]
[{"$f":"IF('School Info'!$J$8=\"\",\"\",'School Info'!$J$8)","v":"MATH"},{"$f":"IF('School Info'!$K$8=\"\",\"\",'School Info'!$K$8)","v":"2001-01-01"},{"$f":"IF('School Info'!$L$8=\"\",\"\",'School Info'!$L$8)","v":"THURSDAY"},{"$f":"IF('School Info'!$M$8=\"\",\"\",'School Info'!$M$8)","v":"10:00AM TO 12:00PM"}]
[{"$f":"IF('School Info'!$J$9=\"\",\"\",'School Info'!$J$9)","v":"SOCIAL SCIENCE"},{"$f":"IF('School Info'!$K$9=\"\",\"\",'School Info'!$K$9)","v":"2001-01-01"},{"$f":"IF('School Info'!$L$9=\"\",\"\",'School Info'!$L$9)","v":"FRIDAY"},{"$f":"IF('School Info'!$M$9=\"\",\"\",'School Info'!$M$9)","v":"10:00AM TO 12:00PM"}]
[{"$f":"IF('School Info'!$J$10=\"\",\"\",'School Info'!$J$10)","v":"SANSKRIT"},{"$f":"IF('School Info'!$K$10=\"\",\"\",'School Info'!$K$10)","v":"2001-01-01"},{"$f":"IF('School Info'!$L$10=\"\",\"\",'School Info'!$L$10)","v":"SATURDAY"},{"$f":"IF('School Info'!$M$10=\"\",\"\",'School Info'!$M$10)","v":"10:00AM TO 12:00PM"}]
[]
["Note :"]
["1. परीक्षार्थी अपना प्रवेश पत्र रोजाना साथ लेकर आये | (Candidates should bring their admit card with them daily.)"]
["2. परीक्षार्थी परीक्षा केंद्र पर आधा घंटे पहले पहुचें | (Candidates should reach the examination center half an hour before.)"]
["3. परीक्षार्थी परीक्षा हेतु आवश्यक सामग्री साथ लेकर आवें | (Candidates should bring with them the necessary materials for the examination.)"]
[]
[]
[]
[]
[]
["Sig. Exam Incharge",null,null,null,null,null,"Sig. Principal "]
[]
[{"$f":"IF('School Info'!$B$4=\"\",\"\",'School Info'!$B$4)","v":"Mahatma Gandhi Government School Bar"}]
[null,null,"School Aff. Code :",null,{"$f":"IF('School Info'!$F$5=\"\",\"\",'School Info'!$F$5)","v":123456}]
[null,null,{"$f":"IF('School Info'!$H$5=\"\",\"\",'School Info'!$H$5)","v":"HALF YEARLY EXAM"},null,{"$f":"IF('School Info'!$H$7=\"\",\"\",'School Info'!$H$7)","v":"2025-26"}]
[null,null,"ADMIT CARD",null,null,null,null,null,{"$f":"I2172+1","v":71}]
[]
["ROLL NO :  ",{"$f":"VLOOKUP(I2201,Student_data,3,0)","v":171},null,"CLASS : ",{"$f":"IF('School Info'!$B$7=\"\",\"\",'School Info'!$B$7)","v":6},"DOB :",{"$f":"VLOOKUP(I2201,Student_data,4,0)","v":"2071-01-01"}]
["NAME :  ",{"$f":"VLOOKUP(I2201,Student_data,6,0)","v":"RAJ GURUJI"},null,"MEDUIM : ",{"$f":"IF('School Info'!$E$7=\"\",\"\",'School Info'!$E$7)","v":"HINDI"},"GENDER :",{"$f":"VLOOKUP(I2201,Student_data,5,0)","v":"MALE"}]
["FATHER :  ",{"$f":"VLOOKUP(I2201,Student_data,7,0)","v":"RAJ"},null,"SECTION : ",{"$f":"IF('School Info'!$F$8=\"\",\"\",'School Info'!$F$8)","v":"A"},"S.No. : ",{"$f":"VLOOKUP(I2201,Student_data,2,0)","v":0}]
["MOTHER :  ",{"$f":"VLOOKUP(I2201,Student_data,8,0)","v":"DEVI"},null,"School DISE Code :",null,{"$f":"IF('School Info'!$B$5=\"\",\"\",'School Info'!$B$5)","v":123456890}]
[]
["SUBJECT","DATE","DAY","TIME "]
[{"$f":"IF('School Info'!$J$5=\"\",\"\",'School Info'!$J$5)","v":"HINDI"},{"$f":"IF('School Info'!$K$5=\"\",\"\",'School Info'!$K$5)","v":"2001-01-01"},{"$f":"IF('School Info'!$L$5=\"\",\"\",'School Info'!$L$5)","v":"MONDAY"},{"$f":"IF('School Info'!$M$5=\"\",\"\",'School Info'!$M$5)","v":"10:00AM TO 12:00PM"}]
[{"$f":"IF('School Info'!$J$6=\"\",\"\",'School Info'!$J$6)","v":"ENGLISH"},{"$f":"IF('School Info'!$K$6=\"\",\"\",'School Info'!$K$6)","v":"2001-01-01"},{"$f":"IF('School Info'!$L$6=\"\",\"\",'School Info'!$L$6)","v":"TUESDAY"},{"$f":"IF('School Info'!$M$6=\"\",\"\",'School Info'!$M$6)","v":"10:00AM TO 12:00PM"}]
[{"$f":"IF('School Info'!$J$7=\"\",\"\",'School Info'!$J$7)","v":"SCIENCE"},{"$f":"IF('School Info'!$K$7=\"\",\"\",'School Info'!$K$7)","v":"2001-01-01"},{"$f":"IF('School Info'!$L$7=\"\",\"\",'School Info'!$L$7)","v":"WEDNESDAY"},{"$f":"IF('School Info'!$M$7=\"\",\"\",'School Info'!$M$7)","v":"10:00AM TO 12:00PM"}]
[{"$f":"IF('School Info'!$J$8=\"\",\"\",'School Info'!$J$8)","v":"MATH"},{"$f":"IF('School Info'!$K$8=\"\",\"\",'School Info'!$K$8)","v":"2001-01-01"},{"$f":"IF('School Info'!$L$8=\"\",\"\",'School Info'!$L$8)","v":"THURSDAY"},{"$f":"IF('School Info'!$M$8=\"\",\"\",'School Info'!$M$8)","v":"10:00AM TO 12:00PM"}]
[{"$f":"IF('School Info'!$J$9=\"\",\"\",'School Info'!$J$9)","v":"SOCIAL SCIENCE"},{"$f":"IF('School Info'!$K$9=\"\",\"\",'School Info'!$K$9)","v":"2001-01-01"},{"$f":"IF('School Info'!$L$9=\"\",\"\",'School Info'!$L$9)","v":"FRIDAY"},{"$f":"IF('School Info'!$M$9=\"\",\"\",'School Info'!$M$9)","v":"10:00AM TO 12:00PM"}]
[{"$f":"IF('School Info'!$J$10=\"\",\"\",'School Info'!$J$10)","v":"SANSKRIT"},{"$f":"IF('School Info'!$K$10=\"\",\"\",'School Info'!$K$10)","v":"2001-01-01"},{"$f":"IF('School Info'!$L$10=\"\",\"\",'School Info'!$L$10)","v":"SATURDAY"},{"$f":"IF('School Info'!$M$10=\"\",\"\",'School Info'!$M$10)","v":"10:00AM TO 12:00PM"}]
[]
["Note :"]
["1. परीक्षार्थी अपना प्रवेश पत्र रोजाना साथ लेकर आये | (Candidates should bring their admit card with them daily.)"]
["2. परीक्षार्थी परीक्षा केंद्र पर आधा घंटे पहले पहुचें | (Candidates should reach the examination center half an hour before.)"]
["3. परीक्षार्थी परीक्षा हेतु आवश्यक सामग्री साथ लेकर आवें | (Candidates should bring with them the necessary materials for the examination.)"]
[]
[]
[]
[]
[]
["Sig. Exam Incharge",null,null,null,null,null,"Sig. Principal "]
[".------------------------------------------------------- Cut Here------------------------------------------------------"]
[{"$f":"IF('School Info'!$B$4=\"\",\"\",'School Info'!$B$4)","v":"Mahatma Gandhi Government School Bar"}]
[null,null,"School Aff. Code :",null,{"$f":"IF('School Info'!$F$5=\"\",\"\",'School Info'!$F$5)","v":123456}]
[null,null,{"$f":"IF('School Info'!$H$5=\"\",\"\",'School Info'!$H$5)","v":"HALF YEARLY EXAM"},null,{"$f":"IF('School Info'!$H$7=\"\",\"\",'School Info'!$H$7)","v":"2025-26"}]
[null,null,"ADMIT CARD",null,null,null,null,null,{"$f":"I2201+1","v":72}]
[]
["ROLL NO :  ",{"$f":"VLOOKUP(I2230,Student_data,3,0)","v":172},null,"CLASS : ",{"$f":"IF('School Info'!$B$7=\"\",\"\",'School Info'!$B$7)","v":6},"DOB :",{"$f":"VLOOKUP(I2230,Student_data,4,0)","v":"2072-01-01"}]
["NAME :  ",{"$f":"VLOOKUP(I2230,Student_data,6,0)","v":"MONU"},null,"MEDUIM : ",{"$f":"IF('School Info'!$E$7=\"\",\"\",'School Info'!$E$7)","v":"HINDI"},"GENDER :",{"$f":"VLOOKUP(I2230,Student_data,5,0)","v":"MALE"}]
["FATHER :  ",{"$f":"VLOOKUP(I2230,Student_data,7,0)","v":"RAAA"},null,"SECTION : ",{"$f":"IF('School Info'!$F$8=\"\",\"\",'School Info'!$F$8)","v":"A"},"S.No. : ",{"$f":"VLOOKUP(I2230,Student_data,2,0)","v":0}]
["MOTHER :  ",{"$f":"VLOOKUP(I2230,Student_data,8,0)","v":"DDD"},null,"School DISE Code :",null,{"$f":"IF('School Info'!$B$5=\"\",\"\",'School Info'!$B$5)","v":123456890}]
[]
["SUBJECT","DATE","DAY","TIME "]
[{"$f":"IF('School Info'!$J$5=\"\",\"\",'School Info'!$J$5)","v":"HINDI"},{"$f":"IF('School Info'!$K$5=\"\",\"\",'School Info'!$K$5)","v":"2001-01-01"},{"$f":"IF('School Info'!$L$5=\"\",\"\",'School Info'!$L$5)","v":"MONDAY"},{"$f":"IF('School Info'!$M$5=\"\",\"\",'School Info'!$M$5)","v":"10:00AM TO 12:00PM"}]
[{"$f":"IF('School Info'!$J$6=\"\",\"\",'School Info'!$J$6)","v":"ENGLISH"},{"$f":"IF('School Info'!$K$6=\"\",\"\",'School Info'!$K$6)","v":"2001-01-01"},{"$f":"IF('School Info'!$L$6=\"\",\"\",'School Info'!$L$6)","v":"TUESDAY"},{"$f":"IF('School Info'!$M$6=\"\",\"\",'School Info'!$M$6)","v":"10:00AM TO 12:00PM"}]
[{"$f":"IF('School Info'!$J$7=\"\",\"\",'School Info'!$J$7)","v":"SCIENCE"},{"$f":"IF('School Info'!$K$7=\"\",\"\",'School Info'!$K$7)","v":"2001-01-01"},{"$f":"IF('School Info'!$L$7=\"\",\"\",'School Info'!$L$7)","v":"WEDNESDAY"},{"$f":"IF('School Info'!$M$7=\"\",\"\",'School Info'!$M$7)","v":"10:00AM TO 12:00PM"}]
[{"$f":"IF('School Info'!$J$8=\"\",\"\",'School Info'!$J$8)","v":"MATH"},{"$f":"IF('School Info'!$K$8=\"\",\"\",'School Info'!$K$8)","v":"2001-01-01"},{"$f":"IF('School Info'!$L$8=\"\",\"\",'School Info'!$L$8)","v":"THURSDAY"},{"$f":"IF('School Info'!$M$8=\"\",\"\",'School Info'!$M$8)","v":"10:00AM TO 12:00PM"}]
[{"$f":"IF('School Info'!$J$9=\"\",\"\",'School Info'!$J$9)","v":"SOCIAL SCIENCE"},{"$f":"IF('School Info'!$K$9=\"\",\"\",'School Info'!$K$9)","v":"2001-01-01"},{"$f":"IF('School Info'!$L$9=\"\",\"\",'School Info'!$L$9)","v":"FRIDAY"},{"$f":"IF('School Info'!$M$9=\"\",\"\",'School Info'!$M$9)","v":"10:00AM TO 12:00PM"}]
[{"$f":"IF('School Info'!$J$10=\"\",\"\",'School Info'!$J$10)","v":"SANSKRIT"},{"$f":"IF('School Info'!$K$10=\"\",\"\",'School Info'!$K$10)","v":"2001-01-01"},{"$f":"IF('School Info'!$L$10=\"\",\"\",'School Info'!$L$10)","v":"SATURDAY"},{"$f":"IF('School Info'!$M$10=\"\",\"\",'School Info'!$M$10)","v":"10:00AM TO 12:00PM"}]
[]
["Note :"]
["1. परीक्षार्थी अपना प्रवेश पत्र रोजाना साथ लेकर आये | (Candidates should bring their admit card with them daily.)"]
["2. परीक्षार्थी परीक्षा केंद्र पर आधा घंटे पहले पहुचें | (Candidates should reach the examination center half an hour before.)"]
["3. परीक्षार्थी परीक्षा हेतु आवश्यक सामग्री साथ लेकर आवें | (Candidates should bring with them the necessary materials for the examination.)"]
[]
[]
[]
[]
[]
["Sig. Exam Incharge",null,null,null,null,null,"Sig. Principal "]
[]
[{"$f":"IF('School Info'!$B$4=\"\",\"\",'School Info'!$B$4)","v":"Mahatma Gandhi Government School Bar"}]
[null,null,"School Aff. Code :",null,{"$f":"IF('School Info'!$F$5=\"\",\"\",'School Info'!$F$5)","v":123456}]
[null,null,{"$f":"IF('School Info'!$H$5=\"\",\"\",'School Info'!$H$5)","v":"HALF YEARLY EXAM"},null,{"$f":"IF('School Info'!$H$7=\"\",\"\",'School Info'!$H$7)","v":"2025-26"}]
[null,null,"ADMIT CARD",null,null,null,null,null,{"$f":"I2230+1","v":73}]
[]
["ROLL NO :  ",{"$f":"VLOOKUP(I2259,Student_data,3,0)","v":173},null,"CLASS : ",{"$f":"IF('School Info'!$B$7=\"\",\"\",'School Info'!$B$7)","v":6},"DOB :",{"$f":"VLOOKUP(I2259,Student_data,4,0)","v":"2073-01-01"}]
["NAME :  ",{"$f":"VLOOKUP(I2259,Student_data,6,0)","v":"SONU"},null,"MEDUIM : ",{"$f":"IF('School Info'!$E$7=\"\",\"\",'School Info'!$E$7)","v":"HINDI"},"GENDER :",{"$f":"VLOOKUP(I2259,Student_data,5,0)","v":"MALE"}]
["FATHER :  ",{"$f":"VLOOKUP(I2259,Student_data,7,0)","v":"AAA"},null,"SECTION : ",{"$f":"IF('School Info'!$F$8=\"\",\"\",'School Info'!$F$8)","v":"A"},"S.No. : ",{"$f":"VLOOKUP(I2259,Student_data,2,0)","v":0}]
["MOTHER :  ",{"$f":"VLOOKUP(I2259,Student_data,8,0)","v":"DDS"},null,"School DISE Code :",null,{"$f":"IF('School Info'!$B$5=\"\",\"\",'School Info'!$B$5)","v":123456890}]
[]
["SUBJECT","DATE","DAY","TIME "]
[{"$f":"IF('School Info'!$J$5=\"\",\"\",'School Info'!$J$5)","v":"HINDI"},{"$f":"IF('School Info'!$K$5=\"\",\"\",'School Info'!$K$5)","v":"2001-01-01"},{"$f":"IF('School Info'!$L$5=\"\",\"\",'School Info'!$L$5)","v":"MONDAY"},{"$f":"IF('School Info'!$M$5=\"\",\"\",'School Info'!$M$5)","v":"10:00AM TO 12:00PM"}]
[{"$f":"IF('School Info'!$J$6=\"\",\"\",'School Info'!$J$6)","v":"ENGLISH"},{"$f":"IF('School Info'!$K$6=\"\",\"\",'School Info'!$K$6)","v":"2001-01-01"},{"$f":"IF('School Info'!$L$6=\"\",\"\",'School Info'!$L$6)","v":"TUESDAY"},{"$f":"IF('School Info'!$M$6=\"\",\"\",'School Info'!$M$6)","v":"10:00AM TO 12:00PM"}]
[{"$f":"IF('School Info'!$J$7=\"\",\"\",'School Info'!$J$7)","v":"SCIENCE"},{"$f":"IF('School Info'!$K$7=\"\",\"\",'School Info'!$K$7)","v":"2001-01-01"},{"$f":"IF('School Info'!$L$7=\"\",\"\",'School Info'!$L$7)","v":"WEDNESDAY"},{"$f":"IF('School Info'!$M$7=\"\",\"\",'School Info'!$M$7)","v":"10:00AM TO 12:00PM"}]
[{"$f":"IF('School Info'!$J$8=\"\",\"\",'School Info'!$J$8)","v":"MATH"},{"$f":"IF('School Info'!$K$8=\"\",\"\",'School Info'!$K$8)","v":"2001-01-01"},{"$f":"IF('School Info'!$L$8=\"\",\"\",'School Info'!$L$8)","v":"THURSDAY"},{"$f":"IF('School Info'!$M$8=\"\",\"\",'School Info'!$M$8)","v":"10:00AM TO 12:00PM"}]
[{"$f":"IF('School Info'!$J$9=\"\",\"\",'School Info'!$J$9)","v":"SOCIAL SCIENCE"},{"$f":"IF('School Info'!$K$9=\"\",\"\",'School Info'!$K$9)","v":"2001-01-01"},{"$f":"IF('School Info'!$L$9=\"\",\"\",'School Info'!$L$9)","v":"FRIDAY"},{"$f":"IF('School Info'!$M$9=\"\",\"\",'School Info'!$M$9)","v":"10:00AM TO 12:00PM"}]
[{"$f":"IF('School Info'!$J$10=\"\",\"\",'School Info'!$J$10)","v":"SANSKRIT"},{"$f":"IF('School Info'!$K$10=\"\",\"\",'School Info'!$K$10)","v":"2001-01-01"},{"$f":"IF('School Info'!$L$10=\"\",\"\",'School Info'!$L$10)","v":"SATURDAY"},{"$f":"IF('School Info'!$M$10=\"\",\"\",'School Info'!$M$10)","v":"10:00AM TO 12:00PM"}]
[]
["Note :"]
["1. परीक्षार्थी अपना प्रवेश पत्र रोजाना साथ लेकर आये | (Candidates should bring their admit card with them daily.)"]
["2. परीक्षार्थी परीक्षा केंद्र पर आधा घंटे पहले पहुचें | (Candidates should reach the examination center half an hour before.)"]
["3. परीक्षार्थी परीक्षा हेतु आवश्यक सामग्री साथ लेकर आवें | (Candidates should bring with them the necessary materials for the examination.)"]
[]
[]
[]
[]
[]
["Sig. Exam Incharge",null,null,null,null,null,"Sig. Principal "]
[".------------------------------------------------------- Cut Here------------------------------------------------------"]
[{"$f":"IF('School Info'!$B$4=\"\",\"\",'School Info'!$B$4)","v":"Mahatma Gandhi Government School Bar"}]
[null,null,"School Aff. Code :",null,{"$f":"IF('School Info'!$F$5=\"\",\"\",'School Info'!$F$5)","v":123456}]
[null,null,{"$f":"IF('School Info'!$H$5=\"\",\"\",'School Info'!$H$5)","v":"HALF YEARLY EXAM"},null,{"$f":"IF('School Info'!$H$7=\"\",\"\",'School Info'!$H$7)","v":"2025-26"}]
[null,null,"ADMIT CARD",null,null,null,null,null,{"$f":"I2259+1","v":74}]
[]
["ROLL NO :  ",{"$f":"VLOOKUP(I2288,Student_data,3,0)","v":174},null,"CLASS : ",{"$f":"IF('School Info'!$B$7=\"\",\"\",'School Info'!$B$7)","v":6},"DOB :",{"$f":"VLOOKUP(I2288,Student_data,4,0)","v":"2074-01-01"}]
["NAME :  ",{"$f":"VLOOKUP(I2288,Student_data,6,0)","v":"KARNA"},null,"MEDUIM : ",{"$f":"IF('School Info'!$E$7=\"\",\"\",'School Info'!$E$7)","v":"HINDI"},"GENDER :",{"$f":"VLOOKUP(I2288,Student_data,5,0)","v":"MALE"}]
["FATHER :  ",{"$f":"VLOOKUP(I2288,Student_data,7,0)","v":"BBB"},null,"SECTION : ",{"$f":"IF('School Info'!$F$8=\"\",\"\",'School Info'!$F$8)","v":"A"},"S.No. : ",{"$f":"VLOOKUP(I2288,Student_data,2,0)","v":0}]
["MOTHER :  ",{"$f":"VLOOKUP(I2288,Student_data,8,0)","v":"SSDDF"},null,"School DISE Code :",null,{"$f":"IF('School Info'!$B$5=\"\",\"\",'School Info'!$B$5)","v":123456890}]
[]
["SUBJECT","DATE","DAY","TIME "]
[{"$f":"IF('School Info'!$J$5=\"\",\"\",'School Info'!$J$5)","v":"HINDI"},{"$f":"IF('School Info'!$K$5=\"\",\"\",'School Info'!$K$5)","v":"2001-01-01"},{"$f":"IF('School Info'!$L$5=\"\",\"\",'School Info'!$L$5)","v":"MONDAY"},{"$f":"IF('School Info'!$M$5=\"\",\"\",'School Info'!$M$5)","v":"10:00AM TO 12:00PM"}]
[{"$f":"IF('School Info'!$J$6=\"\",\"\",'School Info'!$J$6)","v":"ENGLISH"},{"$f":"IF('School Info'!$K$6=\"\",\"\",'School Info'!$K$6)","v":"2001-01-01"},{"$f":"IF('School Info'!$L$6=\"\",\"\",'School Info'!$L$6)","v":"TUESDAY"},{"$f":"IF('School Info'!$M$6=\"\",\"\",'School Info'!$M$6)","v":"10:00AM TO 12:00PM"}]
[{"$f":"IF('School Info'!$J$7=\"\",\"\",'School Info'!$J$7)","v":"SCIENCE"},{"$f":"IF('School Info'!$K$7=\"\",\"\",'School Info'!$K$7)","v":"2001-01-01"},{"$f":"IF('School Info'!$L$7=\"\",\"\",'School Info'!$L$7)","v":"WEDNESDAY"},{"$f":"IF('School Info'!$M$7=\"\",\"\",'School Info'!$M$7)","v":"10:00AM TO 12:00PM"}]
[{"$f":"IF('School Info'!$J$8=\"\",\"\",'School Info'!$J$8)","v":"MATH"},{"$f":"IF('School Info'!$K$8=\"\",\"\",'School Info'!$K$8)","v":"2001-01-01"},{"$f":"IF('School Info'!$L$8=\"\",\"\",'School Info'!$L$8)","v":"THURSDAY"},{"$f":"IF('School Info'!$M$8=\"\",\"\",'School Info'!$M$8)","v":"10:00AM TO 12:00PM"}]
[{"$f":"IF('School Info'!$J$9=\"\",\"\",'School Info'!$J$9)","v":"SOCIAL SCIENCE"},{"$f":"IF('School Info'!$K$9=\"\",\"\",'School Info'!$K$9)","v":"2001-01-01"},{"$f":"IF('School Info'!$L$9=\"\",\"\",'School Info'!$L$9)","v":"FRIDAY"},{"$f":"IF('School Info'!$M$9=\"\",\"\",'School Info'!$M$9)","v":"10:00AM TO 12:00PM"}]
[{"$f":"IF('School Info'!$J$10=\"\",\"\",'School Info'!$J$10)","v":"SANSKRIT"},{"$f":"IF('School Info'!$K$10=\"\",\"\",'School Info'!$K$10)","v":"2001-01-01"},{"$f":"IF('School Info'!$L$10=\"\",\"\",'School Info'!$L$10)","v":"SATURDAY"},{"$f":"IF('School Info'!$M$10=\"\",\"\",'School Info'!$M$10)","v":"10:00AM TO 12:00PM"}]
[]
["Note :"]
["1. परीक्षार्थी अपना प्रवेश पत्र रोजाना साथ लेकर आये | (Candidates should bring their admit card with them daily.)"]
["2. परीक्षार्थी परीक्षा केंद्र पर आधा घंटे पहले पहुचें | (Candidates should reach the examination center half an hour before.)"]
["3. परीक्षार्थी परीक्षा हेतु आवश्यक सामग्री साथ लेकर आवें | (Candidates should bring with them the necessary materials for the examination.)"]
[]
[]
[]
[]
[]
["Sig. Exam Incharge",null,null,null,null,null,"Sig. Principal "]
[]
[{"$f":"IF('School Info'!$B$4=\"\",\"\",'School Info'!$B$4)","v":"Mahatma Gandhi Government School Bar"}]
[null,null,"School Aff. Code :",null,{"$f":"IF('School Info'!$F$5=\"\",\"\",'School Info'!$F$5)","v":123456}]
[null,null,{"$f":"IF('School Info'!$H$5=\"\",\"\",'School Info'!$H$5)","v":"HALF YEARLY EXAM"},null,{"$f":"IF('School Info'!$H$7=\"\",\"\",'School Info'!$H$7)","v":"2025-26"}]
[null,null,"ADMIT CARD",null,null,null,null,null,{"$f":"I2288+1","v":75}]
[]
["ROLL NO :  ",{"$f":"VLOOKUP(I2317,Student_data,3,0)","v":175},null,"CLASS : ",{"$f":"IF('School Info'!$B$7=\"\",\"\",'School Info'!$B$7)","v":6},"DOB :",{"$f":"VLOOKUP(I2317,Student_data,4,0)","v":"2075-01-01"}]
["NAME :  ",{"$f":"VLOOKUP(I2317,Student_data,6,0)","v":"RAJA  "},null,"MEDUIM : ",{"$f":"IF('School Info'!$E$7=\"\",\"\",'School Info'!$E$7)","v":"HINDI"},"GENDER :",{"$f":"VLOOKUP(I2317,Student_data,5,0)","v":"MALE"}]
["FATHER :  ",{"$f":"VLOOKUP(I2317,Student_data,7,0)","v":"DFD"},null,"SECTION : ",{"$f":"IF('School Info'!$F$8=\"\",\"\",'School Info'!$F$8)","v":"A"},"S.No. : ",{"$f":"VLOOKUP(I2317,Student_data,2,0)","v":0}]
["MOTHER :  ",{"$f":"VLOOKUP(I2317,Student_data,8,0)","v":"GAG"},null,"School DISE Code :",null,{"$f":"IF('School Info'!$B$5=\"\",\"\",'School Info'!$B$5)","v":123456890}]
[]
["SUBJECT","DATE","DAY","TIME "]
[{"$f":"IF('School Info'!$J$5=\"\",\"\",'School Info'!$J$5)","v":"HINDI"},{"$f":"IF('School Info'!$K$5=\"\",\"\",'School Info'!$K$5)","v":"2001-01-01"},{"$f":"IF('School Info'!$L$5=\"\",\"\",'School Info'!$L$5)","v":"MONDAY"},{"$f":"IF('School Info'!$M$5=\"\",\"\",'School Info'!$M$5)","v":"10:00AM TO 12:00PM"}]
[{"$f":"IF('School Info'!$J$6=\"\",\"\",'School Info'!$J$6)","v":"ENGLISH"},{"$f":"IF('School Info'!$K$6=\"\",\"\",'School Info'!$K$6)","v":"2001-01-01"},{"$f":"IF('School Info'!$L$6=\"\",\"\",'School Info'!$L$6)","v":"TUESDAY"},{"$f":"IF('School Info'!$M$6=\"\",\"\",'School Info'!$M$6)","v":"10:00AM TO 12:00PM"}]
[{"$f":"IF('School Info'!$J$7=\"\",\"\",'School Info'!$J$7)","v":"SCIENCE"},{"$f":"IF('School Info'!$K$7=\"\",\"\",'School Info'!$K$7)","v":"2001-01-01"},{"$f":"IF('School Info'!$L$7=\"\",\"\",'School Info'!$L$7)","v":"WEDNESDAY"},{"$f":"IF('School Info'!$M$7=\"\",\"\",'School Info'!$M$7)","v":"10:00AM TO 12:00PM"}]
[{"$f":"IF('School Info'!$J$8=\"\",\"\",'School Info'!$J$8)","v":"MATH"},{"$f":"IF('School Info'!$K$8=\"\",\"\",'School Info'!$K$8)","v":"2001-01-01"},{"$f":"IF('School Info'!$L$8=\"\",\"\",'School Info'!$L$8)","v":"THURSDAY"},{"$f":"IF('School Info'!$M$8=\"\",\"\",'School Info'!$M$8)","v":"10:00AM TO 12:00PM"}]
[{"$f":"IF('School Info'!$J$9=\"\",\"\",'School Info'!$J$9)","v":"SOCIAL SCIENCE"},{"$f":"IF('School Info'!$K$9=\"\",\"\",'School Info'!$K$9)","v":"2001-01-01"},{"$f":"IF('School Info'!$L$9=\"\",\"\",'School Info'!$L$9)","v":"FRIDAY"},{"$f":"IF('School Info'!$M$9=\"\",\"\",'School Info'!$M$9)","v":"10:00AM TO 12:00PM"}]
[{"$f":"IF('School Info'!$J$10=\"\",\"\",'School Info'!$J$10)","v":"SANSKRIT"},{"$f":"IF('School Info'!$K$10=\"\",\"\",'School Info'!$K$10)","v":"2001-01-01"},{"$f":"IF('School Info'!$L$10=\"\",\"\",'School Info'!$L$10)","v":"SATURDAY"},{"$f":"IF('School Info'!$M$10=\"\",\"\",'School Info'!$M$10)","v":"10:00AM TO 12:00PM"}]
[]
["Note :"]
["1. परीक्षार्थी अपना प्रवेश पत्र रोजाना साथ लेकर आये | (Candidates should bring their admit card with them daily.)"]
["2. परीक्षार्थी परीक्षा केंद्र पर आधा घंटे पहले पहुचें | (Candidates should reach the examination center half an hour before.)"]
["3. परीक्षार्थी परीक्षा हेतु आवश्यक सामग्री साथ लेकर आवें | (Candidates should bring with them the necessary materials for the examination.)"]
[]
[]
[]
[]
[]
["Sig. Exam Incharge",null,null,null,null,null,"Sig. Principal "]
[".------------------------------------------------------- Cut Here------------------------------------------------------"]
[{"$f":"IF('School Info'!$B$4=\"\",\"\",'School Info'!$B$4)","v":"Mahatma Gandhi Government School Bar"}]
[null,null,"School Aff. Code :",null,{"$f":"IF('School Info'!$F$5=\"\",\"\",'School Info'!$F$5)","v":123456}]
[null,null,{"$f":"IF('School Info'!$H$5=\"\",\"\",'School Info'!$H$5)","v":"HALF YEARLY EXAM"},null,{"$f":"IF('School Info'!$H$7=\"\",\"\",'School Info'!$H$7)","v":"2025-26"}]
[null,null,"ADMIT CARD",null,null,null,null,null,{"$f":"I2317+1","v":76}]
[]
["ROLL NO :  ",{"$f":"VLOOKUP(I2346,Student_data,3,0)","v":176},null,"CLASS : ",{"$f":"IF('School Info'!$B$7=\"\",\"\",'School Info'!$B$7)","v":6},"DOB :",{"$f":"VLOOKUP(I2346,Student_data,4,0)","v":"2076-01-01"}]
["NAME :  ",{"$f":"VLOOKUP(I2346,Student_data,6,0)","v":"RAJ GURUJI"},null,"MEDUIM : ",{"$f":"IF('School Info'!$E$7=\"\",\"\",'School Info'!$E$7)","v":"HINDI"},"GENDER :",{"$f":"VLOOKUP(I2346,Student_data,5,0)","v":"MALE"}]
["FATHER :  ",{"$f":"VLOOKUP(I2346,Student_data,7,0)","v":"RAJ"},null,"SECTION : ",{"$f":"IF('School Info'!$F$8=\"\",\"\",'School Info'!$F$8)","v":"A"},"S.No. : ",{"$f":"VLOOKUP(I2346,Student_data,2,0)","v":0}]
["MOTHER :  ",{"$f":"VLOOKUP(I2346,Student_data,8,0)","v":"DEVI"},null,"School DISE Code :",null,{"$f":"IF('School Info'!$B$5=\"\",\"\",'School Info'!$B$5)","v":123456890}]
[]
["SUBJECT","DATE","DAY","TIME "]
[{"$f":"IF('School Info'!$J$5=\"\",\"\",'School Info'!$J$5)","v":"HINDI"},{"$f":"IF('School Info'!$K$5=\"\",\"\",'School Info'!$K$5)","v":"2001-01-01"},{"$f":"IF('School Info'!$L$5=\"\",\"\",'School Info'!$L$5)","v":"MONDAY"},{"$f":"IF('School Info'!$M$5=\"\",\"\",'School Info'!$M$5)","v":"10:00AM TO 12:00PM"}]
[{"$f":"IF('School Info'!$J$6=\"\",\"\",'School Info'!$J$6)","v":"ENGLISH"},{"$f":"IF('School Info'!$K$6=\"\",\"\",'School Info'!$K$6)","v":"2001-01-01"},{"$f":"IF('School Info'!$L$6=\"\",\"\",'School Info'!$L$6)","v":"TUESDAY"},{"$f":"IF('School Info'!$M$6=\"\",\"\",'School Info'!$M$6)","v":"10:00AM TO 12:00PM"}]
[{"$f":"IF('School Info'!$J$7=\"\",\"\",'School Info'!$J$7)","v":"SCIENCE"},{"$f":"IF('School Info'!$K$7=\"\",\"\",'School Info'!$K$7)","v":"2001-01-01"},{"$f":"IF('School Info'!$L$7=\"\",\"\",'School Info'!$L$7)","v":"WEDNESDAY"},{"$f":"IF('School Info'!$M$7=\"\",\"\",'School Info'!$M$7)","v":"10:00AM TO 12:00PM"}]
[{"$f":"IF('School Info'!$J$8=\"\",\"\",'School Info'!$J$8)","v":"MATH"},{"$f":"IF('School Info'!$K$8=\"\",\"\",'School Info'!$K$8)","v":"2001-01-01"},{"$f":"IF('School Info'!$L$8=\"\",\"\",'School Info'!$L$8)","v":"THURSDAY"},{"$f":"IF('School Info'!$M$8=\"\",\"\",'School Info'!$M$8)","v":"10:00AM TO 12:00PM"}]
[{"$f":"IF('School Info'!$J$9=\"\",\"\",'School Info'!$J$9)","v":"SOCIAL SCIENCE"},{"$f":"IF('School Info'!$K$9=\"\",\"\",'School Info'!$K$9)","v":"2001-01-01"},{"$f":"IF('School Info'!$L$9=\"\",\"\",'School Info'!$L$9)","v":"FRIDAY"},{"$f":"IF('School Info'!$M$9=\"\",\"\",'School Info'!$M$9)","v":"10:00AM TO 12:00PM"}]
[{"$f":"IF('School Info'!$J$10=\"\",\"\",'School Info'!$J$10)","v":"SANSKRIT"},{"$f":"IF('School Info'!$K$10=\"\",\"\",'School Info'!$K$10)","v":"2001-01-01"},{"$f":"IF('School Info'!$L$10=\"\",\"\",'School Info'!$L$10)","v":"SATURDAY"},{"$f":"IF('School Info'!$M$10=\"\",\"\",'School Info'!$M$10)","v":"10:00AM TO 12:00PM"}]
[]
["Note :"]
["1. परीक्षार्थी अपना प्रवेश पत्र रोजाना साथ लेकर आये | (Candidates should bring their admit card with them daily.)"]
["2. परीक्षार्थी परीक्षा केंद्र पर आधा घंटे पहले पहुचें | (Candidates should reach the examination center half an hour before.)"]
["3. परीक्षार्थी परीक्षा हेतु आवश्यक सामग्री साथ लेकर आवें | (Candidates should bring with them the necessary materials for the examination.)"]
[]
[]
[]
[]
[]
["Sig. Exam Incharge",null,null,null,null,null,"Sig. Principal "]
[]
[{"$f":"IF('School Info'!$B$4=\"\",\"\",'School Info'!$B$4)","v":"Mahatma Gandhi Government School Bar"}]
[null,null,"School Aff. Code :",null,{"$f":"IF('School Info'!$F$5=\"\",\"\",'School Info'!$F$5)","v":123456}]
[null,null,{"$f":"IF('School Info'!$H$5=\"\",\"\",'School Info'!$H$5)","v":"HALF YEARLY EXAM"},null,{"$f":"IF('School Info'!$H$7=\"\",\"\",'School Info'!$H$7)","v":"2025-26"}]
[null,null,"ADMIT CARD",null,null,null,null,null,{"$f":"I2346+1","v":77}]
[]
["ROLL NO :  ",{"$f":"VLOOKUP(I2375,Student_data,3,0)","v":177},null,"CLASS : ",{"$f":"IF('School Info'!$B$7=\"\",\"\",'School Info'!$B$7)","v":6},"DOB :",{"$f":"VLOOKUP(I2375,Student_data,4,0)","v":"2077-01-01"}]
["NAME :  ",{"$f":"VLOOKUP(I2375,Student_data,6,0)","v":"MONU"},null,"MEDUIM : ",{"$f":"IF('School Info'!$E$7=\"\",\"\",'School Info'!$E$7)","v":"HINDI"},"GENDER :",{"$f":"VLOOKUP(I2375,Student_data,5,0)","v":"MALE"}]
["FATHER :  ",{"$f":"VLOOKUP(I2375,Student_data,7,0)","v":"RAAA"},null,"SECTION : ",{"$f":"IF('School Info'!$F$8=\"\",\"\",'School Info'!$F$8)","v":"A"},"S.No. : ",{"$f":"VLOOKUP(I2375,Student_data,2,0)","v":0}]
["MOTHER :  ",{"$f":"VLOOKUP(I2375,Student_data,8,0)","v":"DDD"},null,"School DISE Code :",null,{"$f":"IF('School Info'!$B$5=\"\",\"\",'School Info'!$B$5)","v":123456890}]
[]
["SUBJECT","DATE","DAY","TIME "]
[{"$f":"IF('School Info'!$J$5=\"\",\"\",'School Info'!$J$5)","v":"HINDI"},{"$f":"IF('School Info'!$K$5=\"\",\"\",'School Info'!$K$5)","v":"2001-01-01"},{"$f":"IF('School Info'!$L$5=\"\",\"\",'School Info'!$L$5)","v":"MONDAY"},{"$f":"IF('School Info'!$M$5=\"\",\"\",'School Info'!$M$5)","v":"10:00AM TO 12:00PM"}]
[{"$f":"IF('School Info'!$J$6=\"\",\"\",'School Info'!$J$6)","v":"ENGLISH"},{"$f":"IF('School Info'!$K$6=\"\",\"\",'School Info'!$K$6)","v":"2001-01-01"},{"$f":"IF('School Info'!$L$6=\"\",\"\",'School Info'!$L$6)","v":"TUESDAY"},{"$f":"IF('School Info'!$M$6=\"\",\"\",'School Info'!$M$6)","v":"10:00AM TO 12:00PM"}]
[{"$f":"IF('School Info'!$J$7=\"\",\"\",'School Info'!$J$7)","v":"SCIENCE"},{"$f":"IF('School Info'!$K$7=\"\",\"\",'School Info'!$K$7)","v":"2001-01-01"},{"$f":"IF('School Info'!$L$7=\"\",\"\",'School Info'!$L$7)","v":"WEDNESDAY"},{"$f":"IF('School Info'!$M$7=\"\",\"\",'School Info'!$M$7)","v":"10:00AM TO 12:00PM"}]
[{"$f":"IF('School Info'!$J$8=\"\",\"\",'School Info'!$J$8)","v":"MATH"},{"$f":"IF('School Info'!$K$8=\"\",\"\",'School Info'!$K$8)","v":"2001-01-01"},{"$f":"IF('School Info'!$L$8=\"\",\"\",'School Info'!$L$8)","v":"THURSDAY"},{"$f":"IF('School Info'!$M$8=\"\",\"\",'School Info'!$M$8)","v":"10:00AM TO 12:00PM"}]
[{"$f":"IF('School Info'!$J$9=\"\",\"\",'School Info'!$J$9)","v":"SOCIAL SCIENCE"},{"$f":"IF('School Info'!$K$9=\"\",\"\",'School Info'!$K$9)","v":"2001-01-01"},{"$f":"IF('School Info'!$L$9=\"\",\"\",'School Info'!$L$9)","v":"FRIDAY"},{"$f":"IF('School Info'!$M$9=\"\",\"\",'School Info'!$M$9)","v":"10:00AM TO 12:00PM"}]
[{"$f":"IF('School Info'!$J$10=\"\",\"\",'School Info'!$J$10)","v":"SANSKRIT"},{"$f":"IF('School Info'!$K$10=\"\",\"\",'School Info'!$K$10)","v":"2001-01-01"},{"$f":"IF('School Info'!$L$10=\"\",\"\",'School Info'!$L$10)","v":"SATURDAY"},{"$f":"IF('School Info'!$M$10=\"\",\"\",'School Info'!$M$10)","v":"10:00AM TO 12:00PM"}]
[]
["Note :"]
["1. परीक्षार्थी अपना प्रवेश पत्र रोजाना साथ लेकर आये | (Candidates should bring their admit card with them daily.)"]
["2. परीक्षार्थी परीक्षा केंद्र पर आधा घंटे पहले पहुचें | (Candidates should reach the examination center half an hour before.)"]
["3. परीक्षार्थी परीक्षा हेतु आवश्यक सामग्री साथ लेकर आवें | (Candidates should bring with them the necessary materials for the examination.)"]
[]
[]
[]
[]
[]
["Sig. Exam Incharge",null,null,null,null,null,"Sig. Principal "]
[".------------------------------------------------------- Cut Here------------------------------------------------------"]
[{"$f":"IF('School Info'!$B$4=\"\",\"\",'School Info'!$B$4)","v":"Mahatma Gandhi Government School Bar"}]
[null,null,"School Aff. Code :",null,{"$f":"IF('School Info'!$F$5=\"\",\"\",'School Info'!$F$5)","v":123456}]
[null,null,{"$f":"IF('School Info'!$H$5=\"\",\"\",'School Info'!$H$5)","v":"HALF YEARLY EXAM"},null,{"$f":"IF('School Info'!$H$7=\"\",\"\",'School Info'!$H$7)","v":"2025-26"}]
[null,null,"ADMIT CARD",null,null,null,null,null,{"$f":"I2375+1","v":78}]
[]
["ROLL NO :  ",{"$f":"VLOOKUP(I2404,Student_data,3,0)","v":178},null,"CLASS : ",{"$f":"IF('School Info'!$B$7=\"\",\"\",'School Info'!$B$7)","v":6},"DOB :",{"$f":"VLOOKUP(I2404,Student_data,4,0)","v":"2078-01-01"}]
["NAME :  ",{"$f":"VLOOKUP(I2404,Student_data,6,0)","v":"SONU"},null,"MEDUIM : ",{"$f":"IF('School Info'!$E$7=\"\",\"\",'School Info'!$E$7)","v":"HINDI"},"GENDER :",{"$f":"VLOOKUP(I2404,Student_data,5,0)","v":"MALE"}]
["FATHER :  ",{"$f":"VLOOKUP(I2404,Student_data,7,0)","v":"AAA"},null,"SECTION : ",{"$f":"IF('School Info'!$F$8=\"\",\"\",'School Info'!$F$8)","v":"A"},"S.No. : ",{"$f":"VLOOKUP(I2404,Student_data,2,0)","v":0}]
["MOTHER :  ",{"$f":"VLOOKUP(I2404,Student_data,8,0)","v":"DDS"},null,"School DISE Code :",null,{"$f":"IF('School Info'!$B$5=\"\",\"\",'School Info'!$B$5)","v":123456890}]
[]
["SUBJECT","DATE","DAY","TIME "]
[{"$f":"IF('School Info'!$J$5=\"\",\"\",'School Info'!$J$5)","v":"HINDI"},{"$f":"IF('School Info'!$K$5=\"\",\"\",'School Info'!$K$5)","v":"2001-01-01"},{"$f":"IF('School Info'!$L$5=\"\",\"\",'School Info'!$L$5)","v":"MONDAY"},{"$f":"IF('School Info'!$M$5=\"\",\"\",'School Info'!$M$5)","v":"10:00AM TO 12:00PM"}]
[{"$f":"IF('School Info'!$J$6=\"\",\"\",'School Info'!$J$6)","v":"ENGLISH"},{"$f":"IF('School Info'!$K$6=\"\",\"\",'School Info'!$K$6)","v":"2001-01-01"},{"$f":"IF('School Info'!$L$6=\"\",\"\",'School Info'!$L$6)","v":"TUESDAY"},{"$f":"IF('School Info'!$M$6=\"\",\"\",'School Info'!$M$6)","v":"10:00AM TO 12:00PM"}]
[{"$f":"IF('School Info'!$J$7=\"\",\"\",'School Info'!$J$7)","v":"SCIENCE"},{"$f":"IF('School Info'!$K$7=\"\",\"\",'School Info'!$K$7)","v":"2001-01-01"},{"$f":"IF('School Info'!$L$7=\"\",\"\",'School Info'!$L$7)","v":"WEDNESDAY"},{"$f":"IF('School Info'!$M$7=\"\",\"\",'School Info'!$M$7)","v":"10:00AM TO 12:00PM"}]
[{"$f":"IF('School Info'!$J$8=\"\",\"\",'School Info'!$J$8)","v":"MATH"},{"$f":"IF('School Info'!$K$8=\"\",\"\",'School Info'!$K$8)","v":"2001-01-01"},{"$f":"IF('School Info'!$L$8=\"\",\"\",'School Info'!$L$8)","v":"THURSDAY"},{"$f":"IF('School Info'!$M$8=\"\",\"\",'School Info'!$M$8)","v":"10:00AM TO 12:00PM"}]
[{"$f":"IF('School Info'!$J$9=\"\",\"\",'School Info'!$J$9)","v":"SOCIAL SCIENCE"},{"$f":"IF('School Info'!$K$9=\"\",\"\",'School Info'!$K$9)","v":"2001-01-01"},{"$f":"IF('School Info'!$L$9=\"\",\"\",'School Info'!$L$9)","v":"FRIDAY"},{"$f":"IF('School Info'!$M$9=\"\",\"\",'School Info'!$M$9)","v":"10:00AM TO 12:00PM"}]
[{"$f":"IF('School Info'!$J$10=\"\",\"\",'School Info'!$J$10)","v":"SANSKRIT"},{"$f":"IF('School Info'!$K$10=\"\",\"\",'School Info'!$K$10)","v":"2001-01-01"},{"$f":"IF('School Info'!$L$10=\"\",\"\",'School Info'!$L$10)","v":"SATURDAY"},{"$f":"IF('School Info'!$M$10=\"\",\"\",'School Info'!$M$10)","v":"10:00AM TO 12:00PM"}]
[]
["Note :"]
["1. परीक्षार्थी अपना प्रवेश पत्र रोजाना साथ लेकर आये | (Candidates should bring their admit card with them daily.)"]
["2. परीक्षार्थी परीक्षा केंद्र पर आधा घंटे पहले पहुचें | (Candidates should reach the examination center half an hour before.)"]
["3. परीक्षार्थी परीक्षा हेतु आवश्यक सामग्री साथ लेकर आवें | (Candidates should bring with them the necessary materials for the examination.)"]
[]
[]
[]
[]
[]
["Sig. Exam Incharge",null,null,null,null,null,"Sig. Principal "]
[]
[{"$f":"IF('School Info'!$B$4=\"\",\"\",'School Info'!$B$4)","v":"Mahatma Gandhi Government School Bar"}]
[null,null,"School Aff. Code :",null,{"$f":"IF('School Info'!$F$5=\"\",\"\",'School Info'!$F$5)","v":123456}]
[null,null,{"$f":"IF('School Info'!$H$5=\"\",\"\",'School Info'!$H$5)","v":"HALF YEARLY EXAM"},null,{"$f":"IF('School Info'!$H$7=\"\",\"\",'School Info'!$H$7)","v":"2025-26"}]
[null,null,"ADMIT CARD",null,null,null,null,null,{"$f":"I2404+1","v":79}]
[]
["ROLL NO :  ",{"$f":"VLOOKUP(I2433,Student_data,3,0)","v":179},null,"CLASS : ",{"$f":"IF('School Info'!$B$7=\"\",\"\",'School Info'!$B$7)","v":6},"DOB :",{"$f":"VLOOKUP(I2433,Student_data,4,0)","v":"2079-01-01"}]
["NAME :  ",{"$f":"VLOOKUP(I2433,Student_data,6,0)","v":"KARNA"},null,"MEDUIM : ",{"$f":"IF('School Info'!$E$7=\"\",\"\",'School Info'!$E$7)","v":"HINDI"},"GENDER :",{"$f":"VLOOKUP(I2433,Student_data,5,0)","v":"MALE"}]
["FATHER :  ",{"$f":"VLOOKUP(I2433,Student_data,7,0)","v":"BBB"},null,"SECTION : ",{"$f":"IF('School Info'!$F$8=\"\",\"\",'School Info'!$F$8)","v":"A"},"S.No. : ",{"$f":"VLOOKUP(I2433,Student_data,2,0)","v":0}]
["MOTHER :  ",{"$f":"VLOOKUP(I2433,Student_data,8,0)","v":"SSDDF"},null,"School DISE Code :",null,{"$f":"IF('School Info'!$B$5=\"\",\"\",'School Info'!$B$5)","v":123456890}]
[]
["SUBJECT","DATE","DAY","TIME "]
[{"$f":"IF('School Info'!$J$5=\"\",\"\",'School Info'!$J$5)","v":"HINDI"},{"$f":"IF('School Info'!$K$5=\"\",\"\",'School Info'!$K$5)","v":"2001-01-01"},{"$f":"IF('School Info'!$L$5=\"\",\"\",'School Info'!$L$5)","v":"MONDAY"},{"$f":"IF('School Info'!$M$5=\"\",\"\",'School Info'!$M$5)","v":"10:00AM TO 12:00PM"}]
[{"$f":"IF('School Info'!$J$6=\"\",\"\",'School Info'!$J$6)","v":"ENGLISH"},{"$f":"IF('School Info'!$K$6=\"\",\"\",'School Info'!$K$6)","v":"2001-01-01"},{"$f":"IF('School Info'!$L$6=\"\",\"\",'School Info'!$L$6)","v":"TUESDAY"},{"$f":"IF('School Info'!$M$6=\"\",\"\",'School Info'!$M$6)","v":"10:00AM TO 12:00PM"}]
[{"$f":"IF('School Info'!$J$7=\"\",\"\",'School Info'!$J$7)","v":"SCIENCE"},{"$f":"IF('School Info'!$K$7=\"\",\"\",'School Info'!$K$7)","v":"2001-01-01"},{"$f":"IF('School Info'!$L$7=\"\",\"\",'School Info'!$L$7)","v":"WEDNESDAY"},{"$f":"IF('School Info'!$M$7=\"\",\"\",'School Info'!$M$7)","v":"10:00AM TO 12:00PM"}]
[{"$f":"IF('School Info'!$J$8=\"\",\"\",'School Info'!$J$8)","v":"MATH"},{"$f":"IF('School Info'!$K$8=\"\",\"\",'School Info'!$K$8)","v":"2001-01-01"},{"$f":"IF('School Info'!$L$8=\"\",\"\",'School Info'!$L$8)","v":"THURSDAY"},{"$f":"IF('School Info'!$M$8=\"\",\"\",'School Info'!$M$8)","v":"10:00AM TO 12:00PM"}]
[{"$f":"IF('School Info'!$J$9=\"\",\"\",'School Info'!$J$9)","v":"SOCIAL SCIENCE"},{"$f":"IF('School Info'!$K$9=\"\",\"\",'School Info'!$K$9)","v":"2001-01-01"},{"$f":"IF('School Info'!$L$9=\"\",\"\",'School Info'!$L$9)","v":"FRIDAY"},{"$f":"IF('School Info'!$M$9=\"\",\"\",'School Info'!$M$9)","v":"10:00AM TO 12:00PM"}]
[{"$f":"IF('School Info'!$J$10=\"\",\"\",'School Info'!$J$10)","v":"SANSKRIT"},{"$f":"IF('School Info'!$K$10=\"\",\"\",'School Info'!$K$10)","v":"2001-01-01"},{"$f":"IF('School Info'!$L$10=\"\",\"\",'School Info'!$L$10)","v":"SATURDAY"},{"$f":"IF('School Info'!$M$10=\"\",\"\",'School Info'!$M$10)","v":"10:00AM TO 12:00PM"}]
[]
["Note :"]
["1. परीक्षार्थी अपना प्रवेश पत्र रोजाना साथ लेकर आये | (Candidates should bring their admit card with them daily.)"]
["2. परीक्षार्थी परीक्षा केंद्र पर आधा घंटे पहले पहुचें | (Candidates should reach the examination center half an hour before.)"]
["3. परीक्षार्थी परीक्षा हेतु आवश्यक सामग्री साथ लेकर आवें | (Candidates should bring with them the necessary materials for the examination.)"]
[]
[]
[]
[]
[]
["Sig. Exam Incharge",null,null,null,null,null,"Sig. Principal "]
[".------------------------------------------------------- Cut Here------------------------------------------------------"]
[{"$f":"IF('School Info'!$B$4=\"\",\"\",'School Info'!$B$4)","v":"Mahatma Gandhi Government School Bar"}]
[null,null,"School Aff. Code :",null,{"$f":"IF('School Info'!$F$5=\"\",\"\",'School Info'!$F$5)","v":123456}]
[null,null,{"$f":"IF('School Info'!$H$5=\"\",\"\",'School Info'!$H$5)","v":"HALF YEARLY EXAM"},null,{"$f":"IF('School Info'!$H$7=\"\",\"\",'School Info'!$H$7)","v":"2025-26"}]
[null,null,"ADMIT CARD",null,null,null,null,null,{"$f":"I2433+1","v":80}]
[]
["ROLL NO :  ",{"$f":"VLOOKUP(I2462,Student_data,3,0)","v":180},null,"CLASS : ",{"$f":"IF('School Info'!$B$7=\"\",\"\",'School Info'!$B$7)","v":6},"DOB :",{"$f":"VLOOKUP(I2462,Student_data,4,0)","v":"2080-01-01"}]
["NAME :  ",{"$f":"VLOOKUP(I2462,Student_data,6,0)","v":"RAJA  "},null,"MEDUIM : ",{"$f":"IF('School Info'!$E$7=\"\",\"\",'School Info'!$E$7)","v":"HINDI"},"GENDER :",{"$f":"VLOOKUP(I2462,Student_data,5,0)","v":"MALE"}]
["FATHER :  ",{"$f":"VLOOKUP(I2462,Student_data,7,0)","v":"DFD"},null,"SECTION : ",{"$f":"IF('School Info'!$F$8=\"\",\"\",'School Info'!$F$8)","v":"A"},"S.No. : ",{"$f":"VLOOKUP(I2462,Student_data,2,0)","v":0}]
["MOTHER :  ",{"$f":"VLOOKUP(I2462,Student_data,8,0)","v":"GAG"},null,"School DISE Code :",null,{"$f":"IF('School Info'!$B$5=\"\",\"\",'School Info'!$B$5)","v":123456890}]
[]
["SUBJECT","DATE","DAY","TIME "]
[{"$f":"IF('School Info'!$J$5=\"\",\"\",'School Info'!$J$5)","v":"HINDI"},{"$f":"IF('School Info'!$K$5=\"\",\"\",'School Info'!$K$5)","v":"2001-01-01"},{"$f":"IF('School Info'!$L$5=\"\",\"\",'School Info'!$L$5)","v":"MONDAY"},{"$f":"IF('School Info'!$M$5=\"\",\"\",'School Info'!$M$5)","v":"10:00AM TO 12:00PM"}]
[{"$f":"IF('School Info'!$J$6=\"\",\"\",'School Info'!$J$6)","v":"ENGLISH"},{"$f":"IF('School Info'!$K$6=\"\",\"\",'School Info'!$K$6)","v":"2001-01-01"},{"$f":"IF('School Info'!$L$6=\"\",\"\",'School Info'!$L$6)","v":"TUESDAY"},{"$f":"IF('School Info'!$M$6=\"\",\"\",'School Info'!$M$6)","v":"10:00AM TO 12:00PM"}]
[{"$f":"IF('School Info'!$J$7=\"\",\"\",'School Info'!$J$7)","v":"SCIENCE"},{"$f":"IF('School Info'!$K$7=\"\",\"\",'School Info'!$K$7)","v":"2001-01-01"},{"$f":"IF('School Info'!$L$7=\"\",\"\",'School Info'!$L$7)","v":"WEDNESDAY"},{"$f":"IF('School Info'!$M$7=\"\",\"\",'School Info'!$M$7)","v":"10:00AM TO 12:00PM"}]
[{"$f":"IF('School Info'!$J$8=\"\",\"\",'School Info'!$J$8)","v":"MATH"},{"$f":"IF('School Info'!$K$8=\"\",\"\",'School Info'!$K$8)","v":"2001-01-01"},{"$f":"IF('School Info'!$L$8=\"\",\"\",'School Info'!$L$8)","v":"THURSDAY"},{"$f":"IF('School Info'!$M$8=\"\",\"\",'School Info'!$M$8)","v":"10:00AM TO 12:00PM"}]
[{"$f":"IF('School Info'!$J$9=\"\",\"\",'School Info'!$J$9)","v":"SOCIAL SCIENCE"},{"$f":"IF('School Info'!$K$9=\"\",\"\",'School Info'!$K$9)","v":"2001-01-01"},{"$f":"IF('School Info'!$L$9=\"\",\"\",'School Info'!$L$9)","v":"FRIDAY"},{"$f":"IF('School Info'!$M$9=\"\",\"\",'School Info'!$M$9)","v":"10:00AM TO 12:00PM"}]
[{"$f":"IF('School Info'!$J$10=\"\",\"\",'School Info'!$J$10)","v":"SANSKRIT"},{"$f":"IF('School Info'!$K$10=\"\",\"\",'School Info'!$K$10)","v":"2001-01-01"},{"$f":"IF('School Info'!$L$10=\"\",\"\",'School Info'!$L$10)","v":"SATURDAY"},{"$f":"IF('School Info'!$M$10=\"\",\"\",'School Info'!$M$10)","v":"10:00AM TO 12:00PM"}]
[]
["Note :"]
["1. परीक्षार्थी अपना प्रवेश पत्र रोजाना साथ लेकर आये | (Candidates should bring their admit card with them daily.)"]
["2. परीक्षार्थी परीक्षा केंद्र पर आधा घंटे पहले पहुचें | (Candidates should reach the examination center half an hour before.)"]
["3. परीक्षार्थी परीक्षा हेतु आवश्यक सामग्री साथ लेकर आवें | (Candidates should bring with them the necessary materials for the examination.)"]
[]
[]
[]
[]
[]
["Sig. Exam Incharge",null,null,null,null,null,"Sig. Principal "]
[]
[{"$f":"IF('School Info'!$B$4=\"\",\"\",'School Info'!$B$4)","v":"Mahatma Gandhi Government School Bar"}]
[null,null,"School Aff. Code :",null,{"$f":"IF('School Info'!$F$5=\"\",\"\",'School Info'!$F$5)","v":123456}]
[null,null,{"$f":"IF('School Info'!$H$5=\"\",\"\",'School Info'!$H$5)","v":"HALF YEARLY EXAM"},null,{"$f":"IF('School Info'!$H$7=\"\",\"\",'School Info'!$H$7)","v":"2025-26"}]
[null,null,"ADMIT CARD",null,null,null,null,null,{"$f":"I2462+1","v":81}]
[]
["ROLL NO :  ",{"$f":"VLOOKUP(I2491,Student_data,3,0)","v":181},null,"CLASS : ",{"$f":"IF('School Info'!$B$7=\"\",\"\",'School Info'!$B$7)","v":6},"DOB :",{"$f":"VLOOKUP(I2491,Student_data,4,0)","v":"2081-01-01"}]
["NAME :  ",{"$f":"VLOOKUP(I2491,Student_data,6,0)","v":"RAJ GURUJI"},null,"MEDUIM : ",{"$f":"IF('School Info'!$E$7=\"\",\"\",'School Info'!$E$7)","v":"HINDI"},"GENDER :",{"$f":"VLOOKUP(I2491,Student_data,5,0)","v":"MALE"}]
["FATHER :  ",{"$f":"VLOOKUP(I2491,Student_data,7,0)","v":"RAJ"},null,"SECTION : ",{"$f":"IF('School Info'!$F$8=\"\",\"\",'School Info'!$F$8)","v":"A"},"S.No. : ",{"$f":"VLOOKUP(I2491,Student_data,2,0)","v":0}]
["MOTHER :  ",{"$f":"VLOOKUP(I2491,Student_data,8,0)","v":"DEVI"},null,"School DISE Code :",null,{"$f":"IF('School Info'!$B$5=\"\",\"\",'School Info'!$B$5)","v":123456890}]
[]
["SUBJECT","DATE","DAY","TIME "]
[{"$f":"IF('School Info'!$J$5=\"\",\"\",'School Info'!$J$5)","v":"HINDI"},{"$f":"IF('School Info'!$K$5=\"\",\"\",'School Info'!$K$5)","v":"2001-01-01"},{"$f":"IF('School Info'!$L$5=\"\",\"\",'School Info'!$L$5)","v":"MONDAY"},{"$f":"IF('School Info'!$M$5=\"\",\"\",'School Info'!$M$5)","v":"10:00AM TO 12:00PM"}]
[{"$f":"IF('School Info'!$J$6=\"\",\"\",'School Info'!$J$6)","v":"ENGLISH"},{"$f":"IF('School Info'!$K$6=\"\",\"\",'School Info'!$K$6)","v":"2001-01-01"},{"$f":"IF('School Info'!$L$6=\"\",\"\",'School Info'!$L$6)","v":"TUESDAY"},{"$f":"IF('School Info'!$M$6=\"\",\"\",'School Info'!$M$6)","v":"10:00AM TO 12:00PM"}]
[{"$f":"IF('School Info'!$J$7=\"\",\"\",'School Info'!$J$7)","v":"SCIENCE"},{"$f":"IF('School Info'!$K$7=\"\",\"\",'School Info'!$K$7)","v":"2001-01-01"},{"$f":"IF('School Info'!$L$7=\"\",\"\",'School Info'!$L$7)","v":"WEDNESDAY"},{"$f":"IF('School Info'!$M$7=\"\",\"\",'School Info'!$M$7)","v":"10:00AM TO 12:00PM"}]
[{"$f":"IF('School Info'!$J$8=\"\",\"\",'School Info'!$J$8)","v":"MATH"},{"$f":"IF('School Info'!$K$8=\"\",\"\",'School Info'!$K$8)","v":"2001-01-01"},{"$f":"IF('School Info'!$L$8=\"\",\"\",'School Info'!$L$8)","v":"THURSDAY"},{"$f":"IF('School Info'!$M$8=\"\",\"\",'School Info'!$M$8)","v":"10:00AM TO 12:00PM"}]
[{"$f":"IF('School Info'!$J$9=\"\",\"\",'School Info'!$J$9)","v":"SOCIAL SCIENCE"},{"$f":"IF('School Info'!$K$9=\"\",\"\",'School Info'!$K$9)","v":"2001-01-01"},{"$f":"IF('School Info'!$L$9=\"\",\"\",'School Info'!$L$9)","v":"FRIDAY"},{"$f":"IF('School Info'!$M$9=\"\",\"\",'School Info'!$M$9)","v":"10:00AM TO 12:00PM"}]
[{"$f":"IF('School Info'!$J$10=\"\",\"\",'School Info'!$J$10)","v":"SANSKRIT"},{"$f":"IF('School Info'!$K$10=\"\",\"\",'School Info'!$K$10)","v":"2001-01-01"},{"$f":"IF('School Info'!$L$10=\"\",\"\",'School Info'!$L$10)","v":"SATURDAY"},{"$f":"IF('School Info'!$M$10=\"\",\"\",'School Info'!$M$10)","v":"10:00AM TO 12:00PM"}]
[]
["Note :"]
["1. परीक्षार्थी अपना प्रवेश पत्र रोजाना साथ लेकर आये | (Candidates should bring their admit card with them daily.)"]
["2. परीक्षार्थी परीक्षा केंद्र पर आधा घंटे पहले पहुचें | (Candidates should reach the examination center half an hour before.)"]
["3. परीक्षार्थी परीक्षा हेतु आवश्यक सामग्री साथ लेकर आवें | (Candidates should bring with them the necessary materials for the examination.)"]
[]
[]
[]
[]
[]
["Sig. Exam Incharge",null,null,null,null,null,"Sig. Principal "]
[".------------------------------------------------------- Cut Here------------------------------------------------------"]
[{"$f":"IF('School Info'!$B$4=\"\",\"\",'School Info'!$B$4)","v":"Mahatma Gandhi Government School Bar"}]
[null,null,"School Aff. Code :",null,{"$f":"IF('School Info'!$F$5=\"\",\"\",'School Info'!$F$5)","v":123456}]
[null,null,{"$f":"IF('School Info'!$H$5=\"\",\"\",'School Info'!$H$5)","v":"HALF YEARLY EXAM"},null,{"$f":"IF('School Info'!$H$7=\"\",\"\",'School Info'!$H$7)","v":"2025-26"}]
[null,null,"ADMIT CARD",null,null,null,null,null,{"$f":"I2491+1","v":82}]
[]
["ROLL NO :  ",{"$f":"VLOOKUP(I2520,Student_data,3,0)","v":182},null,"CLASS : ",{"$f":"IF('School Info'!$B$7=\"\",\"\",'School Info'!$B$7)","v":6},"DOB :",{"$f":"VLOOKUP(I2520,Student_data,4,0)","v":"2082-01-01"}]
["NAME :  ",{"$f":"VLOOKUP(I2520,Student_data,6,0)","v":"MONU"},null,"MEDUIM : ",{"$f":"IF('School Info'!$E$7=\"\",\"\",'School Info'!$E$7)","v":"HINDI"},"GENDER :",{"$f":"VLOOKUP(I2520,Student_data,5,0)","v":"MALE"}]
["FATHER :  ",{"$f":"VLOOKUP(I2520,Student_data,7,0)","v":"RAAA"},null,"SECTION : ",{"$f":"IF('School Info'!$F$8=\"\",\"\",'School Info'!$F$8)","v":"A"},"S.No. : ",{"$f":"VLOOKUP(I2520,Student_data,2,0)","v":0}]
["MOTHER :  ",{"$f":"VLOOKUP(I2520,Student_data,8,0)","v":"DDD"},null,"School DISE Code :",null,{"$f":"IF('School Info'!$B$5=\"\",\"\",'School Info'!$B$5)","v":123456890}]
[]
["SUBJECT","DATE","DAY","TIME "]
[{"$f":"IF('School Info'!$J$5=\"\",\"\",'School Info'!$J$5)","v":"HINDI"},{"$f":"IF('School Info'!$K$5=\"\",\"\",'School Info'!$K$5)","v":"2001-01-01"},{"$f":"IF('School Info'!$L$5=\"\",\"\",'School Info'!$L$5)","v":"MONDAY"},{"$f":"IF('School Info'!$M$5=\"\",\"\",'School Info'!$M$5)","v":"10:00AM TO 12:00PM"}]
[{"$f":"IF('School Info'!$J$6=\"\",\"\",'School Info'!$J$6)","v":"ENGLISH"},{"$f":"IF('School Info'!$K$6=\"\",\"\",'School Info'!$K$6)","v":"2001-01-01"},{"$f":"IF('School Info'!$L$6=\"\",\"\",'School Info'!$L$6)","v":"TUESDAY"},{"$f":"IF('School Info'!$M$6=\"\",\"\",'School Info'!$M$6)","v":"10:00AM TO 12:00PM"}]
[{"$f":"IF('School Info'!$J$7=\"\",\"\",'School Info'!$J$7)","v":"SCIENCE"},{"$f":"IF('School Info'!$K$7=\"\",\"\",'School Info'!$K$7)","v":"2001-01-01"},{"$f":"IF('School Info'!$L$7=\"\",\"\",'School Info'!$L$7)","v":"WEDNESDAY"},{"$f":"IF('School Info'!$M$7=\"\",\"\",'School Info'!$M$7)","v":"10:00AM TO 12:00PM"}]
[{"$f":"IF('School Info'!$J$8=\"\",\"\",'School Info'!$J$8)","v":"MATH"},{"$f":"IF('School Info'!$K$8=\"\",\"\",'School Info'!$K$8)","v":"2001-01-01"},{"$f":"IF('School Info'!$L$8=\"\",\"\",'School Info'!$L$8)","v":"THURSDAY"},{"$f":"IF('School Info'!$M$8=\"\",\"\",'School Info'!$M$8)","v":"10:00AM TO 12:00PM"}]
[{"$f":"IF('School Info'!$J$9=\"\",\"\",'School Info'!$J$9)","v":"SOCIAL SCIENCE"},{"$f":"IF('School Info'!$K$9=\"\",\"\",'School Info'!$K$9)","v":"2001-01-01"},{"$f":"IF('School Info'!$L$9=\"\",\"\",'School Info'!$L$9)","v":"FRIDAY"},{"$f":"IF('School Info'!$M$9=\"\",\"\",'School Info'!$M$9)","v":"10:00AM TO 12:00PM"}]
[{"$f":"IF('School Info'!$J$10=\"\",\"\",'School Info'!$J$10)","v":"SANSKRIT"},{"$f":"IF('School Info'!$K$10=\"\",\"\",'School Info'!$K$10)","v":"2001-01-01"},{"$f":"IF('School Info'!$L$10=\"\",\"\",'School Info'!$L$10)","v":"SATURDAY"},{"$f":"IF('School Info'!$M$10=\"\",\"\",'School Info'!$M$10)","v":"10:00AM TO 12:00PM"}]
[]
["Note :"]
["1. परीक्षार्थी अपना प्रवेश पत्र रोजाना साथ लेकर आये | (Candidates should bring their admit card with them daily.)"]
["2. परीक्षार्थी परीक्षा केंद्र पर आधा घंटे पहले पहुचें | (Candidates should reach the examination center half an hour before.)"]
["3. परीक्षार्थी परीक्षा हेतु आवश्यक सामग्री साथ लेकर आवें | (Candidates should bring with them the necessary materials for the examination.)"]
[]
[]
[]
[]
[]
["Sig. Exam Incharge",null,null,null,null,null,"Sig. Principal "]
[]
[{"$f":"IF('School Info'!$B$4=\"\",\"\",'School Info'!$B$4)","v":"Mahatma Gandhi Government School Bar"}]
[null,null,"School Aff. Code :",null,{"$f":"IF('School Info'!$F$5=\"\",\"\",'School Info'!$F$5)","v":123456}]
[null,null,{"$f":"IF('School Info'!$H$5=\"\",\"\",'School Info'!$H$5)","v":"HALF YEARLY EXAM"},null,{"$f":"IF('School Info'!$H$7=\"\",\"\",'School Info'!$H$7)","v":"2025-26"}]
[null,null,"ADMIT CARD",null,null,null,null,null,{"$f":"I2520+1","v":83}]
[]
["ROLL NO :  ",{"$f":"VLOOKUP(I2549,Student_data,3,0)","v":183},null,"CLASS : ",{"$f":"IF('School Info'!$B$7=\"\",\"\",'School Info'!$B$7)","v":6},"DOB :",{"$f":"VLOOKUP(I2549,Student_data,4,0)","v":"2083-01-01"}]
["NAME :  ",{"$f":"VLOOKUP(I2549,Student_data,6,0)","v":"SONU"},null,"MEDUIM : ",{"$f":"IF('School Info'!$E$7=\"\",\"\",'School Info'!$E$7)","v":"HINDI"},"GENDER :",{"$f":"VLOOKUP(I2549,Student_data,5,0)","v":"MALE"}]
["FATHER :  ",{"$f":"VLOOKUP(I2549,Student_data,7,0)","v":"AAA"},null,"SECTION : ",{"$f":"IF('School Info'!$F$8=\"\",\"\",'School Info'!$F$8)","v":"A"},"S.No. : ",{"$f":"VLOOKUP(I2549,Student_data,2,0)","v":0}]
["MOTHER :  ",{"$f":"VLOOKUP(I2549,Student_data,8,0)","v":"DDS"},null,"School DISE Code :",null,{"$f":"IF('School Info'!$B$5=\"\",\"\",'School Info'!$B$5)","v":123456890}]
[]
["SUBJECT","DATE","DAY","TIME "]
[{"$f":"IF('School Info'!$J$5=\"\",\"\",'School Info'!$J$5)","v":"HINDI"},{"$f":"IF('School Info'!$K$5=\"\",\"\",'School Info'!$K$5)","v":"2001-01-01"},{"$f":"IF('School Info'!$L$5=\"\",\"\",'School Info'!$L$5)","v":"MONDAY"},{"$f":"IF('School Info'!$M$5=\"\",\"\",'School Info'!$M$5)","v":"10:00AM TO 12:00PM"}]
[{"$f":"IF('School Info'!$J$6=\"\",\"\",'School Info'!$J$6)","v":"ENGLISH"},{"$f":"IF('School Info'!$K$6=\"\",\"\",'School Info'!$K$6)","v":"2001-01-01"},{"$f":"IF('School Info'!$L$6=\"\",\"\",'School Info'!$L$6)","v":"TUESDAY"},{"$f":"IF('School Info'!$M$6=\"\",\"\",'School Info'!$M$6)","v":"10:00AM TO 12:00PM"}]
[{"$f":"IF('School Info'!$J$7=\"\",\"\",'School Info'!$J$7)","v":"SCIENCE"},{"$f":"IF('School Info'!$K$7=\"\",\"\",'School Info'!$K$7)","v":"2001-01-01"},{"$f":"IF('School Info'!$L$7=\"\",\"\",'School Info'!$L$7)","v":"WEDNESDAY"},{"$f":"IF('School Info'!$M$7=\"\",\"\",'School Info'!$M$7)","v":"10:00AM TO 12:00PM"}]
[{"$f":"IF('School Info'!$J$8=\"\",\"\",'School Info'!$J$8)","v":"MATH"},{"$f":"IF('School Info'!$K$8=\"\",\"\",'School Info'!$K$8)","v":"2001-01-01"},{"$f":"IF('School Info'!$L$8=\"\",\"\",'School Info'!$L$8)","v":"THURSDAY"},{"$f":"IF('School Info'!$M$8=\"\",\"\",'School Info'!$M$8)","v":"10:00AM TO 12:00PM"}]
[{"$f":"IF('School Info'!$J$9=\"\",\"\",'School Info'!$J$9)","v":"SOCIAL SCIENCE"},{"$f":"IF('School Info'!$K$9=\"\",\"\",'School Info'!$K$9)","v":"2001-01-01"},{"$f":"IF('School Info'!$L$9=\"\",\"\",'School Info'!$L$9)","v":"FRIDAY"},{"$f":"IF('School Info'!$M$9=\"\",\"\",'School Info'!$M$9)","v":"10:00AM TO 12:00PM"}]
[{"$f":"IF('School Info'!$J$10=\"\",\"\",'School Info'!$J$10)","v":"SANSKRIT"},{"$f":"IF('School Info'!$K$10=\"\",\"\",'School Info'!$K$10)","v":"2001-01-01"},{"$f":"IF('School Info'!$L$10=\"\",\"\",'School Info'!$L$10)","v":"SATURDAY"},{"$f":"IF('School Info'!$M$10=\"\",\"\",'School Info'!$M$10)","v":"10:00AM TO 12:00PM"}]
[]
["Note :"]
["1. परीक्षार्थी अपना प्रवेश पत्र रोजाना साथ लेकर आये | (Candidates should bring their admit card with them daily.)"]
["2. परीक्षार्थी परीक्षा केंद्र पर आधा घंटे पहले पहुचें | (Candidates should reach the examination center half an hour before.)"]
["3. परीक्षार्थी परीक्षा हेतु आवश्यक सामग्री साथ लेकर आवें | (Candidates should bring with them the necessary materials for the examination.)"]
[]
[]
[]
[]
[]
["Sig. Exam Incharge",null,null,null,null,null,"Sig. Principal "]
[".------------------------------------------------------- Cut Here------------------------------------------------------"]
[{"$f":"IF('School Info'!$B$4=\"\",\"\",'School Info'!$B$4)","v":"Mahatma Gandhi Government School Bar"}]
[null,null,"School Aff. Code :",null,{"$f":"IF('School Info'!$F$5=\"\",\"\",'School Info'!$F$5)","v":123456}]
[null,null,{"$f":"IF('School Info'!$H$5=\"\",\"\",'School Info'!$H$5)","v":"HALF YEARLY EXAM"},null,{"$f":"IF('School Info'!$H$7=\"\",\"\",'School Info'!$H$7)","v":"2025-26"}]
[null,null,"ADMIT CARD",null,null,null,null,null,{"$f":"I2549+1","v":84}]
[]
["ROLL NO :  ",{"$f":"VLOOKUP(I2578,Student_data,3,0)","v":184},null,"CLASS : ",{"$f":"IF('School Info'!$B$7=\"\",\"\",'School Info'!$B$7)","v":6},"DOB :",{"$f":"VLOOKUP(I2578,Student_data,4,0)","v":"2084-01-01"}]
["NAME :  ",{"$f":"VLOOKUP(I2578,Student_data,6,0)","v":"KARNA"},null,"MEDUIM : ",{"$f":"IF('School Info'!$E$7=\"\",\"\",'School Info'!$E$7)","v":"HINDI"},"GENDER :",{"$f":"VLOOKUP(I2578,Student_data,5,0)","v":"MALE"}]
["FATHER :  ",{"$f":"VLOOKUP(I2578,Student_data,7,0)","v":"BBB"},null,"SECTION : ",{"$f":"IF('School Info'!$F$8=\"\",\"\",'School Info'!$F$8)","v":"A"},"S.No. : ",{"$f":"VLOOKUP(I2578,Student_data,2,0)","v":0}]
["MOTHER :  ",{"$f":"VLOOKUP(I2578,Student_data,8,0)","v":"SSDDF"},null,"School DISE Code :",null,{"$f":"IF('School Info'!$B$5=\"\",\"\",'School Info'!$B$5)","v":123456890}]
[]
["SUBJECT","DATE","DAY","TIME "]
[{"$f":"IF('School Info'!$J$5=\"\",\"\",'School Info'!$J$5)","v":"HINDI"},{"$f":"IF('School Info'!$K$5=\"\",\"\",'School Info'!$K$5)","v":"2001-01-01"},{"$f":"IF('School Info'!$L$5=\"\",\"\",'School Info'!$L$5)","v":"MONDAY"},{"$f":"IF('School Info'!$M$5=\"\",\"\",'School Info'!$M$5)","v":"10:00AM TO 12:00PM"}]
[{"$f":"IF('School Info'!$J$6=\"\",\"\",'School Info'!$J$6)","v":"ENGLISH"},{"$f":"IF('School Info'!$K$6=\"\",\"\",'School Info'!$K$6)","v":"2001-01-01"},{"$f":"IF('School Info'!$L$6=\"\",\"\",'School Info'!$L$6)","v":"TUESDAY"},{"$f":"IF('School Info'!$M$6=\"\",\"\",'School Info'!$M$6)","v":"10:00AM TO 12:00PM"}]
[{"$f":"IF('School Info'!$J$7=\"\",\"\",'School Info'!$J$7)","v":"SCIENCE"},{"$f":"IF('School Info'!$K$7=\"\",\"\",'School Info'!$K$7)","v":"2001-01-01"},{"$f":"IF('School Info'!$L$7=\"\",\"\",'School Info'!$L$7)","v":"WEDNESDAY"},{"$f":"IF('School Info'!$M$7=\"\",\"\",'School Info'!$M$7)","v":"10:00AM TO 12:00PM"}]
[{"$f":"IF('School Info'!$J$8=\"\",\"\",'School Info'!$J$8)","v":"MATH"},{"$f":"IF('School Info'!$K$8=\"\",\"\",'School Info'!$K$8)","v":"2001-01-01"},{"$f":"IF('School Info'!$L$8=\"\",\"\",'School Info'!$L$8)","v":"THURSDAY"},{"$f":"IF('School Info'!$M$8=\"\",\"\",'School Info'!$M$8)","v":"10:00AM TO 12:00PM"}]
[{"$f":"IF('School Info'!$J$9=\"\",\"\",'School Info'!$J$9)","v":"SOCIAL SCIENCE"},{"$f":"IF('School Info'!$K$9=\"\",\"\",'School Info'!$K$9)","v":"2001-01-01"},{"$f":"IF('School Info'!$L$9=\"\",\"\",'School Info'!$L$9)","v":"FRIDAY"},{"$f":"IF('School Info'!$M$9=\"\",\"\",'School Info'!$M$9)","v":"10:00AM TO 12:00PM"}]
[{"$f":"IF('School Info'!$J$10=\"\",\"\",'School Info'!$J$10)","v":"SANSKRIT"},{"$f":"IF('School Info'!$K$10=\"\",\"\",'School Info'!$K$10)","v":"2001-01-01"},{"$f":"IF('School Info'!$L$10=\"\",\"\",'School Info'!$L$10)","v":"SATURDAY"},{"$f":"IF('School Info'!$M$10=\"\",\"\",'School Info'!$M$10)","v":"10:00AM TO 12:00PM"}]
[]
["Note :"]
["1. परीक्षार्थी अपना प्रवेश पत्र रोजाना साथ लेकर आये | (Candidates should bring their admit card with them daily.)"]
["2. परीक्षार्थी परीक्षा केंद्र पर आधा घंटे पहले पहुचें | (Candidates should reach the examination center half an hour before.)"]
["3. परीक्षार्थी परीक्षा हेतु आवश्यक सामग्री साथ लेकर आवें | (Candidates should bring with them the necessary materials for the examination.)"]
[]
[]
[]
[]
[]
["Sig. Exam Incharge",null,null,null,null,null,"Sig. Principal "]
[]
[{"$f":"IF('School Info'!$B$4=\"\",\"\",'School Info'!$B$4)","v":"Mahatma Gandhi Government School Bar"}]
[null,null,"School Aff. Code :",null,{"$f":"IF('School Info'!$F$5=\"\",\"\",'School Info'!$F$5)","v":123456}]
[null,null,{"$f":"IF('School Info'!$H$5=\"\",\"\",'School Info'!$H$5)","v":"HALF YEARLY EXAM"},null,{"$f":"IF('School Info'!$H$7=\"\",\"\",'School Info'!$H$7)","v":"2025-26"}]
[null,null,"ADMIT CARD",null,null,null,null,null,{"$f":"I2578+1","v":85}]
[]
["ROLL NO :  ",{"$f":"VLOOKUP(I2607,Student_data,3,0)","v":185},null,"CLASS : ",{"$f":"IF('School Info'!$B$7=\"\",\"\",'School Info'!$B$7)","v":6},"DOB :",{"$f":"VLOOKUP(I2607,Student_data,4,0)","v":"2085-01-01"}]
["NAME :  ",{"$f":"VLOOKUP(I2607,Student_data,6,0)","v":"RAJA  "},null,"MEDUIM : ",{"$f":"IF('School Info'!$E$7=\"\",\"\",'School Info'!$E$7)","v":"HINDI"},"GENDER :",{"$f":"VLOOKUP(I2607,Student_data,5,0)","v":"MALE"}]
["FATHER :  ",{"$f":"VLOOKUP(I2607,Student_data,7,0)","v":"DFD"},null,"SECTION : ",{"$f":"IF('School Info'!$F$8=\"\",\"\",'School Info'!$F$8)","v":"A"},"S.No. : ",{"$f":"VLOOKUP(I2607,Student_data,2,0)","v":0}]
["MOTHER :  ",{"$f":"VLOOKUP(I2607,Student_data,8,0)","v":"GAG"},null,"School DISE Code :",null,{"$f":"IF('School Info'!$B$5=\"\",\"\",'School Info'!$B$5)","v":123456890}]
[]
["SUBJECT","DATE","DAY","TIME "]
[{"$f":"IF('School Info'!$J$5=\"\",\"\",'School Info'!$J$5)","v":"HINDI"},{"$f":"IF('School Info'!$K$5=\"\",\"\",'School Info'!$K$5)","v":"2001-01-01"},{"$f":"IF('School Info'!$L$5=\"\",\"\",'School Info'!$L$5)","v":"MONDAY"},{"$f":"IF('School Info'!$M$5=\"\",\"\",'School Info'!$M$5)","v":"10:00AM TO 12:00PM"}]
[{"$f":"IF('School Info'!$J$6=\"\",\"\",'School Info'!$J$6)","v":"ENGLISH"},{"$f":"IF('School Info'!$K$6=\"\",\"\",'School Info'!$K$6)","v":"2001-01-01"},{"$f":"IF('School Info'!$L$6=\"\",\"\",'School Info'!$L$6)","v":"TUESDAY"},{"$f":"IF('School Info'!$M$6=\"\",\"\",'School Info'!$M$6)","v":"10:00AM TO 12:00PM"}]
[{"$f":"IF('School Info'!$J$7=\"\",\"\",'School Info'!$J$7)","v":"SCIENCE"},{"$f":"IF('School Info'!$K$7=\"\",\"\",'School Info'!$K$7)","v":"2001-01-01"},{"$f":"IF('School Info'!$L$7=\"\",\"\",'School Info'!$L$7)","v":"WEDNESDAY"},{"$f":"IF('School Info'!$M$7=\"\",\"\",'School Info'!$M$7)","v":"10:00AM TO 12:00PM"}]
[{"$f":"IF('School Info'!$J$8=\"\",\"\",'School Info'!$J$8)","v":"MATH"},{"$f":"IF('School Info'!$K$8=\"\",\"\",'School Info'!$K$8)","v":"2001-01-01"},{"$f":"IF('School Info'!$L$8=\"\",\"\",'School Info'!$L$8)","v":"THURSDAY"},{"$f":"IF('School Info'!$M$8=\"\",\"\",'School Info'!$M$8)","v":"10:00AM TO 12:00PM"}]
[{"$f":"IF('School Info'!$J$9=\"\",\"\",'School Info'!$J$9)","v":"SOCIAL SCIENCE"},{"$f":"IF('School Info'!$K$9=\"\",\"\",'School Info'!$K$9)","v":"2001-01-01"},{"$f":"IF('School Info'!$L$9=\"\",\"\",'School Info'!$L$9)","v":"FRIDAY"},{"$f":"IF('School Info'!$M$9=\"\",\"\",'School Info'!$M$9)","v":"10:00AM TO 12:00PM"}]
[{"$f":"IF('School Info'!$J$10=\"\",\"\",'School Info'!$J$10)","v":"SANSKRIT"},{"$f":"IF('School Info'!$K$10=\"\",\"\",'School Info'!$K$10)","v":"2001-01-01"},{"$f":"IF('School Info'!$L$10=\"\",\"\",'School Info'!$L$10)","v":"SATURDAY"},{"$f":"IF('School Info'!$M$10=\"\",\"\",'School Info'!$M$10)","v":"10:00AM TO 12:00PM"}]
[]
["Note :"]
["1. परीक्षार्थी अपना प्रवेश पत्र रोजाना साथ लेकर आये | (Candidates should bring their admit card with them daily.)"]
["2. परीक्षार्थी परीक्षा केंद्र पर आधा घंटे पहले पहुचें | (Candidates should reach the examination center half an hour before.)"]
["3. परीक्षार्थी परीक्षा हेतु आवश्यक सामग्री साथ लेकर आवें | (Candidates should bring with them the necessary materials for the examination.)"]
[]
[]
[]
[]
[]
["Sig. Exam Incharge",null,null,null,null,null,"Sig. Principal "]
[".------------------------------------------------------- Cut Here------------------------------------------------------"]
[{"$f":"IF('School Info'!$B$4=\"\",\"\",'School Info'!$B$4)","v":"Mahatma Gandhi Government School Bar"}]
[null,null,"School Aff. Code :",null,{"$f":"IF('School Info'!$F$5=\"\",\"\",'School Info'!$F$5)","v":123456}]
[null,null,{"$f":"IF('School Info'!$H$5=\"\",\"\",'School Info'!$H$5)","v":"HALF YEARLY EXAM"},null,{"$f":"IF('School Info'!$H$7=\"\",\"\",'School Info'!$H$7)","v":"2025-26"}]
[null,null,"ADMIT CARD",null,null,null,null,null,{"$f":"I2607+1","v":86}]
[]
["ROLL NO :  ",{"$f":"VLOOKUP(I2636,Student_data,3,0)","v":186},null,"CLASS : ",{"$f":"IF('School Info'!$B$7=\"\",\"\",'School Info'!$B$7)","v":6},"DOB :",{"$f":"VLOOKUP(I2636,Student_data,4,0)","v":"2086-01-01"}]
["NAME :  ",{"$f":"VLOOKUP(I2636,Student_data,6,0)","v":"RAJ GURUJI"},null,"MEDUIM : ",{"$f":"IF('School Info'!$E$7=\"\",\"\",'School Info'!$E$7)","v":"HINDI"},"GENDER :",{"$f":"VLOOKUP(I2636,Student_data,5,0)","v":"MALE"}]
["FATHER :  ",{"$f":"VLOOKUP(I2636,Student_data,7,0)","v":"RAJ"},null,"SECTION : ",{"$f":"IF('School Info'!$F$8=\"\",\"\",'School Info'!$F$8)","v":"A"},"S.No. : ",{"$f":"VLOOKUP(I2636,Student_data,2,0)","v":0}]
["MOTHER :  ",{"$f":"VLOOKUP(I2636,Student_data,8,0)","v":"DEVI"},null,"School DISE Code :",null,{"$f":"IF('School Info'!$B$5=\"\",\"\",'School Info'!$B$5)","v":123456890}]
[]
["SUBJECT","DATE","DAY","TIME "]
[{"$f":"IF('School Info'!$J$5=\"\",\"\",'School Info'!$J$5)","v":"HINDI"},{"$f":"IF('School Info'!$K$5=\"\",\"\",'School Info'!$K$5)","v":"2001-01-01"},{"$f":"IF('School Info'!$L$5=\"\",\"\",'School Info'!$L$5)","v":"MONDAY"},{"$f":"IF('School Info'!$M$5=\"\",\"\",'School Info'!$M$5)","v":"10:00AM TO 12:00PM"}]
[{"$f":"IF('School Info'!$J$6=\"\",\"\",'School Info'!$J$6)","v":"ENGLISH"},{"$f":"IF('School Info'!$K$6=\"\",\"\",'School Info'!$K$6)","v":"2001-01-01"},{"$f":"IF('School Info'!$L$6=\"\",\"\",'School Info'!$L$6)","v":"TUESDAY"},{"$f":"IF('School Info'!$M$6=\"\",\"\",'School Info'!$M$6)","v":"10:00AM TO 12:00PM"}]
[{"$f":"IF('School Info'!$J$7=\"\",\"\",'School Info'!$J$7)","v":"SCIENCE"},{"$f":"IF('School Info'!$K$7=\"\",\"\",'School Info'!$K$7)","v":"2001-01-01"},{"$f":"IF('School Info'!$L$7=\"\",\"\",'School Info'!$L$7)","v":"WEDNESDAY"},{"$f":"IF('School Info'!$M$7=\"\",\"\",'School Info'!$M$7)","v":"10:00AM TO 12:00PM"}]
[{"$f":"IF('School Info'!$J$8=\"\",\"\",'School Info'!$J$8)","v":"MATH"},{"$f":"IF('School Info'!$K$8=\"\",\"\",'School Info'!$K$8)","v":"2001-01-01"},{"$f":"IF('School Info'!$L$8=\"\",\"\",'School Info'!$L$8)","v":"THURSDAY"},{"$f":"IF('School Info'!$M$8=\"\",\"\",'School Info'!$M$8)","v":"10:00AM TO 12:00PM"}]
[{"$f":"IF('School Info'!$J$9=\"\",\"\",'School Info'!$J$9)","v":"SOCIAL SCIENCE"},{"$f":"IF('School Info'!$K$9=\"\",\"\",'School Info'!$K$9)","v":"2001-01-01"},{"$f":"IF('School Info'!$L$9=\"\",\"\",'School Info'!$L$9)","v":"FRIDAY"},{"$f":"IF('School Info'!$M$9=\"\",\"\",'School Info'!$M$9)","v":"10:00AM TO 12:00PM"}]
[{"$f":"IF('School Info'!$J$10=\"\",\"\",'School Info'!$J$10)","v":"SANSKRIT"},{"$f":"IF('School Info'!$K$10=\"\",\"\",'School Info'!$K$10)","v":"2001-01-01"},{"$f":"IF('School Info'!$L$10=\"\",\"\",'School Info'!$L$10)","v":"SATURDAY"},{"$f":"IF('School Info'!$M$10=\"\",\"\",'School Info'!$M$10)","v":"10:00AM TO 12:00PM"}]
[]
["Note :"]
["1. परीक्षार्थी अपना प्रवेश पत्र रोजाना साथ लेकर आये | (Candidates should bring their admit card with them daily.)"]
["2. परीक्षार्थी परीक्षा केंद्र पर आधा घंटे पहले पहुचें | (Candidates should reach the examination center half an hour before.)"]
["3. परीक्षार्थी परीक्षा हेतु आवश्यक सामग्री साथ लेकर आवें | (Candidates should bring with them the necessary materials for the examination.)"]
[]
[]
[]
[]
[]
["Sig. Exam Incharge",null,null,null,null,null,"Sig. Principal "]
[]
[{"$f":"IF('School Info'!$B$4=\"\",\"\",'School Info'!$B$4)","v":"Mahatma Gandhi Government School Bar"}]
[null,null,"School Aff. Code :",null,{"$f":"IF('School Info'!$F$5=\"\",\"\",'School Info'!$F$5)","v":123456}]
[null,null,{"$f":"IF('School Info'!$H$5=\"\",\"\",'School Info'!$H$5)","v":"HALF YEARLY EXAM"},null,{"$f":"IF('School Info'!$H$7=\"\",\"\",'School Info'!$H$7)","v":"2025-26"}]
[null,null,"ADMIT CARD",null,null,null,null,null,{"$f":"I2636+1","v":87}]
[]
["ROLL NO :  ",{"$f":"VLOOKUP(I2665,Student_data,3,0)","v":187},null,"CLASS : ",{"$f":"IF('School Info'!$B$7=\"\",\"\",'School Info'!$B$7)","v":6},"DOB :",{"$f":"VLOOKUP(I2665,Student_data,4,0)","v":"2087-01-01"}]
["NAME :  ",{"$f":"VLOOKUP(I2665,Student_data,6,0)","v":"MONU"},null,"MEDUIM : ",{"$f":"IF('School Info'!$E$7=\"\",\"\",'School Info'!$E$7)","v":"HINDI"},"GENDER :",{"$f":"VLOOKUP(I2665,Student_data,5,0)","v":"MALE"}]
["FATHER :  ",{"$f":"VLOOKUP(I2665,Student_data,7,0)","v":"RAAA"},null,"SECTION : ",{"$f":"IF('School Info'!$F$8=\"\",\"\",'School Info'!$F$8)","v":"A"},"S.No. : ",{"$f":"VLOOKUP(I2665,Student_data,2,0)","v":0}]
["MOTHER :  ",{"$f":"VLOOKUP(I2665,Student_data,8,0)","v":"DDD"},null,"School DISE Code :",null,{"$f":"IF('School Info'!$B$5=\"\",\"\",'School Info'!$B$5)","v":123456890}]
[]
["SUBJECT","DATE","DAY","TIME "]
[{"$f":"IF('School Info'!$J$5=\"\",\"\",'School Info'!$J$5)","v":"HINDI"},{"$f":"IF('School Info'!$K$5=\"\",\"\",'School Info'!$K$5)","v":"2001-01-01"},{"$f":"IF('School Info'!$L$5=\"\",\"\",'School Info'!$L$5)","v":"MONDAY"},{"$f":"IF('School Info'!$M$5=\"\",\"\",'School Info'!$M$5)","v":"10:00AM TO 12:00PM"}]
[{"$f":"IF('School Info'!$J$6=\"\",\"\",'School Info'!$J$6)","v":"ENGLISH"},{"$f":"IF('School Info'!$K$6=\"\",\"\",'School Info'!$K$6)","v":"2001-01-01"},{"$f":"IF('School Info'!$L$6=\"\",\"\",'School Info'!$L$6)","v":"TUESDAY"},{"$f":"IF('School Info'!$M$6=\"\",\"\",'School Info'!$M$6)","v":"10:00AM TO 12:00PM"}]
[{"$f":"IF('School Info'!$J$7=\"\",\"\",'School Info'!$J$7)","v":"SCIENCE"},{"$f":"IF('School Info'!$K$7=\"\",\"\",'School Info'!$K$7)","v":"2001-01-01"},{"$f":"IF('School Info'!$L$7=\"\",\"\",'School Info'!$L$7)","v":"WEDNESDAY"},{"$f":"IF('School Info'!$M$7=\"\",\"\",'School Info'!$M$7)","v":"10:00AM TO 12:00PM"}]
[{"$f":"IF('School Info'!$J$8=\"\",\"\",'School Info'!$J$8)","v":"MATH"},{"$f":"IF('School Info'!$K$8=\"\",\"\",'School Info'!$K$8)","v":"2001-01-01"},{"$f":"IF('School Info'!$L$8=\"\",\"\",'School Info'!$L$8)","v":"THURSDAY"},{"$f":"IF('School Info'!$M$8=\"\",\"\",'School Info'!$M$8)","v":"10:00AM TO 12:00PM"}]
[{"$f":"IF('School Info'!$J$9=\"\",\"\",'School Info'!$J$9)","v":"SOCIAL SCIENCE"},{"$f":"IF('School Info'!$K$9=\"\",\"\",'School Info'!$K$9)","v":"2001-01-01"},{"$f":"IF('School Info'!$L$9=\"\",\"\",'School Info'!$L$9)","v":"FRIDAY"},{"$f":"IF('School Info'!$M$9=\"\",\"\",'School Info'!$M$9)","v":"10:00AM TO 12:00PM"}]
[{"$f":"IF('School Info'!$J$10=\"\",\"\",'School Info'!$J$10)","v":"SANSKRIT"},{"$f":"IF('School Info'!$K$10=\"\",\"\",'School Info'!$K$10)","v":"2001-01-01"},{"$f":"IF('School Info'!$L$10=\"\",\"\",'School Info'!$L$10)","v":"SATURDAY"},{"$f":"IF('School Info'!$M$10=\"\",\"\",'School Info'!$M$10)","v":"10:00AM TO 12:00PM"}]
[]
["Note :"]
["1. परीक्षार्थी अपना प्रवेश पत्र रोजाना साथ लेकर आये | (Candidates should bring their admit card with them daily.)"]
["2. परीक्षार्थी परीक्षा केंद्र पर आधा घंटे पहले पहुचें | (Candidates should reach the examination center half an hour before.)"]
["3. परीक्षार्थी परीक्षा हेतु आवश्यक सामग्री साथ लेकर आवें | (Candidates should bring with them the necessary materials for the examination.)"]
[]
[]
[]
[]
[]
["Sig. Exam Incharge",null,null,null,null,null,"Sig. Principal "]
[".------------------------------------------------------- Cut Here------------------------------------------------------"]
[{"$f":"IF('School Info'!$B$4=\"\",\"\",'School Info'!$B$4)","v":"Mahatma Gandhi Government School Bar"}]
[null,null,"School Aff. Code :",null,{"$f":"IF('School Info'!$F$5=\"\",\"\",'School Info'!$F$5)","v":123456}]
[null,null,{"$f":"IF('School Info'!$H$5=\"\",\"\",'School Info'!$H$5)","v":"HALF YEARLY EXAM"},null,{"$f":"IF('School Info'!$H$7=\"\",\"\",'School Info'!$H$7)","v":"2025-26"}]
[null,null,"ADMIT CARD",null,null,null,null,null,{"$f":"I2665+1","v":88}]
[]
["ROLL NO :  ",{"$f":"VLOOKUP(I2694,Student_data,3,0)","v":188},null,"CLASS : ",{"$f":"IF('School Info'!$B$7=\"\",\"\",'School Info'!$B$7)","v":6},"DOB :",{"$f":"VLOOKUP(I2694,Student_data,4,0)","v":"2088-01-01"}]
["NAME :  ",{"$f":"VLOOKUP(I2694,Student_data,6,0)","v":"SONU"},null,"MEDUIM : ",{"$f":"IF('School Info'!$E$7=\"\",\"\",'School Info'!$E$7)","v":"HINDI"},"GENDER :",{"$f":"VLOOKUP(I2694,Student_data,5,0)","v":"MALE"}]
["FATHER :  ",{"$f":"VLOOKUP(I2694,Student_data,7,0)","v":"AAA"},null,"SECTION : ",{"$f":"IF('School Info'!$F$8=\"\",\"\",'School Info'!$F$8)","v":"A"},"S.No. : ",{"$f":"VLOOKUP(I2694,Student_data,2,0)","v":0}]
["MOTHER :  ",{"$f":"VLOOKUP(I2694,Student_data,8,0)","v":"DDS"},null,"School DISE Code :",null,{"$f":"IF('School Info'!$B$5=\"\",\"\",'School Info'!$B$5)","v":123456890}]
[]
["SUBJECT","DATE","DAY","TIME "]
[{"$f":"IF('School Info'!$J$5=\"\",\"\",'School Info'!$J$5)","v":"HINDI"},{"$f":"IF('School Info'!$K$5=\"\",\"\",'School Info'!$K$5)","v":"2001-01-01"},{"$f":"IF('School Info'!$L$5=\"\",\"\",'School Info'!$L$5)","v":"MONDAY"},{"$f":"IF('School Info'!$M$5=\"\",\"\",'School Info'!$M$5)","v":"10:00AM TO 12:00PM"}]
[{"$f":"IF('School Info'!$J$6=\"\",\"\",'School Info'!$J$6)","v":"ENGLISH"},{"$f":"IF('School Info'!$K$6=\"\",\"\",'School Info'!$K$6)","v":"2001-01-01"},{"$f":"IF('School Info'!$L$6=\"\",\"\",'School Info'!$L$6)","v":"TUESDAY"},{"$f":"IF('School Info'!$M$6=\"\",\"\",'School Info'!$M$6)","v":"10:00AM TO 12:00PM"}]
[{"$f":"IF('School Info'!$J$7=\"\",\"\",'School Info'!$J$7)","v":"SCIENCE"},{"$f":"IF('School Info'!$K$7=\"\",\"\",'School Info'!$K$7)","v":"2001-01-01"},{"$f":"IF('School Info'!$L$7=\"\",\"\",'School Info'!$L$7)","v":"WEDNESDAY"},{"$f":"IF('School Info'!$M$7=\"\",\"\",'School Info'!$M$7)","v":"10:00AM TO 12:00PM"}]
[{"$f":"IF('School Info'!$J$8=\"\",\"\",'School Info'!$J$8)","v":"MATH"},{"$f":"IF('School Info'!$K$8=\"\",\"\",'School Info'!$K$8)","v":"2001-01-01"},{"$f":"IF('School Info'!$L$8=\"\",\"\",'School Info'!$L$8)","v":"THURSDAY"},{"$f":"IF('School Info'!$M$8=\"\",\"\",'School Info'!$M$8)","v":"10:00AM TO 12:00PM"}]
[{"$f":"IF('School Info'!$J$9=\"\",\"\",'School Info'!$J$9)","v":"SOCIAL SCIENCE"},{"$f":"IF('School Info'!$K$9=\"\",\"\",'School Info'!$K$9)","v":"2001-01-01"},{"$f":"IF('School Info'!$L$9=\"\",\"\",'School Info'!$L$9)","v":"FRIDAY"},{"$f":"IF('School Info'!$M$9=\"\",\"\",'School Info'!$M$9)","v":"10:00AM TO 12:00PM"}]
[{"$f":"IF('School Info'!$J$10=\"\",\"\",'School Info'!$J$10)","v":"SANSKRIT"},{"$f":"IF('School Info'!$K$10=\"\",\"\",'School Info'!$K$10)","v":"2001-01-01"},{"$f":"IF('School Info'!$L$10=\"\",\"\",'School Info'!$L$10)","v":"SATURDAY"},{"$f":"IF('School Info'!$M$10=\"\",\"\",'School Info'!$M$10)","v":"10:00AM TO 12:00PM"}]
[]
["Note :"]
["1. परीक्षार्थी अपना प्रवेश पत्र रोजाना साथ लेकर आये | (Candidates should bring their admit card with them daily.)"]
["2. परीक्षार्थी परीक्षा केंद्र पर आधा घंटे पहले पहुचें | (Candidates should reach the examination center half an hour before.)"]
["3. परीक्षार्थी परीक्षा हेतु आवश्यक सामग्री साथ लेकर आवें | (Candidates should bring with them the necessary materials for the examination.)"]
[]
[]
[]
[]
[]
["Sig. Exam Incharge",null,null,null,null,null,"Sig. Principal "]
[]
[{"$f":"IF('School Info'!$B$4=\"\",\"\",'School Info'!$B$4)","v":"Mahatma Gandhi Government School Bar"}]
[null,null,"School Aff. Code :",null,{"$f":"IF('School Info'!$F$5=\"\",\"\",'School Info'!$F$5)","v":123456}]
[null,null,{"$f":"IF('School Info'!$H$5=\"\",\"\",'School Info'!$H$5)","v":"HALF YEARLY EXAM"},null,{"$f":"IF('School Info'!$H$7=\"\",\"\",'School Info'!$H$7)","v":"2025-26"}]
[null,null,"ADMIT CARD",null,null,null,null,null,{"$f":"I2694+1","v":89}]
[]
["ROLL NO :  ",{"$f":"VLOOKUP(I2723,Student_data,3,0)","v":189},null,"CLASS : ",{"$f":"IF('School Info'!$B$7=\"\",\"\",'School Info'!$B$7)","v":6},"DOB :",{"$f":"VLOOKUP(I2723,Student_data,4,0)","v":"2089-01-01"}]
["NAME :  ",{"$f":"VLOOKUP(I2723,Student_data,6,0)","v":"KARNA"},null,"MEDUIM : ",{"$f":"IF('School Info'!$E$7=\"\",\"\",'School Info'!$E$7)","v":"HINDI"},"GENDER :",{"$f":"VLOOKUP(I2723,Student_data,5,0)","v":"MALE"}]
["FATHER :  ",{"$f":"VLOOKUP(I2723,Student_data,7,0)","v":"BBB"},null,"SECTION : ",{"$f":"IF('School Info'!$F$8=\"\",\"\",'School Info'!$F$8)","v":"A"},"S.No. : ",{"$f":"VLOOKUP(I2723,Student_data,2,0)","v":0}]
["MOTHER :  ",{"$f":"VLOOKUP(I2723,Student_data,8,0)","v":"SSDDF"},null,"School DISE Code :",null,{"$f":"IF('School Info'!$B$5=\"\",\"\",'School Info'!$B$5)","v":123456890}]
[]
["SUBJECT","DATE","DAY","TIME "]
[{"$f":"IF('School Info'!$J$5=\"\",\"\",'School Info'!$J$5)","v":"HINDI"},{"$f":"IF('School Info'!$K$5=\"\",\"\",'School Info'!$K$5)","v":"2001-01-01"},{"$f":"IF('School Info'!$L$5=\"\",\"\",'School Info'!$L$5)","v":"MONDAY"},{"$f":"IF('School Info'!$M$5=\"\",\"\",'School Info'!$M$5)","v":"10:00AM TO 12:00PM"}]
[{"$f":"IF('School Info'!$J$6=\"\",\"\",'School Info'!$J$6)","v":"ENGLISH"},{"$f":"IF('School Info'!$K$6=\"\",\"\",'School Info'!$K$6)","v":"2001-01-01"},{"$f":"IF('School Info'!$L$6=\"\",\"\",'School Info'!$L$6)","v":"TUESDAY"},{"$f":"IF('School Info'!$M$6=\"\",\"\",'School Info'!$M$6)","v":"10:00AM TO 12:00PM"}]
[{"$f":"IF('School Info'!$J$7=\"\",\"\",'School Info'!$J$7)","v":"SCIENCE"},{"$f":"IF('School Info'!$K$7=\"\",\"\",'School Info'!$K$7)","v":"2001-01-01"},{"$f":"IF('School Info'!$L$7=\"\",\"\",'School Info'!$L$7)","v":"WEDNESDAY"},{"$f":"IF('School Info'!$M$7=\"\",\"\",'School Info'!$M$7)","v":"10:00AM TO 12:00PM"}]
[{"$f":"IF('School Info'!$J$8=\"\",\"\",'School Info'!$J$8)","v":"MATH"},{"$f":"IF('School Info'!$K$8=\"\",\"\",'School Info'!$K$8)","v":"2001-01-01"},{"$f":"IF('School Info'!$L$8=\"\",\"\",'School Info'!$L$8)","v":"THURSDAY"},{"$f":"IF('School Info'!$M$8=\"\",\"\",'School Info'!$M$8)","v":"10:00AM TO 12:00PM"}]
[{"$f":"IF('School Info'!$J$9=\"\",\"\",'School Info'!$J$9)","v":"SOCIAL SCIENCE"},{"$f":"IF('School Info'!$K$9=\"\",\"\",'School Info'!$K$9)","v":"2001-01-01"},{"$f":"IF('School Info'!$L$9=\"\",\"\",'School Info'!$L$9)","v":"FRIDAY"},{"$f":"IF('School Info'!$M$9=\"\",\"\",'School Info'!$M$9)","v":"10:00AM TO 12:00PM"}]
[{"$f":"IF('School Info'!$J$10=\"\",\"\",'School Info'!$J$10)","v":"SANSKRIT"},{"$f":"IF('School Info'!$K$10=\"\",\"\",'School Info'!$K$10)","v":"2001-01-01"},{"$f":"IF('School Info'!$L$10=\"\",\"\",'School Info'!$L$10)","v":"SATURDAY"},{"$f":"IF('School Info'!$M$10=\"\",\"\",'School Info'!$M$10)","v":"10:00AM TO 12:00PM"}]
[]
["Note :"]
["1. परीक्षार्थी अपना प्रवेश पत्र रोजाना साथ लेकर आये | (Candidates should bring their admit card with them daily.)"]
["2. परीक्षार्थी परीक्षा केंद्र पर आधा घंटे पहले पहुचें | (Candidates should reach the examination center half an hour before.)"]
["3. परीक्षार्थी परीक्षा हेतु आवश्यक सामग्री साथ लेकर आवें | (Candidates should bring with them the necessary materials for the examination.)"]
[]
[]
[]
[]
[]
["Sig. Exam Incharge",null,null,null,null,null,"Sig. Principal "]
[".------------------------------------------------------- Cut Here------------------------------------------------------"]
[{"$f":"IF('School Info'!$B$4=\"\",\"\",'School Info'!$B$4)","v":"Mahatma Gandhi Government School Bar"}]
[null,null,"School Aff. Code :",null,{"$f":"IF('School Info'!$F$5=\"\",\"\",'School Info'!$F$5)","v":123456}]
[null,null,{"$f":"IF('School Info'!$H$5=\"\",\"\",'School Info'!$H$5)","v":"HALF YEARLY EXAM"},null,{"$f":"IF('School Info'!$H$7=\"\",\"\",'School Info'!$H$7)","v":"2025-26"}]
[null,null,"ADMIT CARD",null,null,null,null,null,{"$f":"I2723+1","v":90}]
[]
["ROLL NO :  ",{"$f":"VLOOKUP(I2752,Student_data,3,0)","v":190},null,"CLASS : ",{"$f":"IF('School Info'!$B$7=\"\",\"\",'School Info'!$B$7)","v":6},"DOB :",{"$f":"VLOOKUP(I2752,Student_data,4,0)","v":"2090-01-01"}]
["NAME :  ",{"$f":"VLOOKUP(I2752,Student_data,6,0)","v":"RAJA  "},null,"MEDUIM : ",{"$f":"IF('School Info'!$E$7=\"\",\"\",'School Info'!$E$7)","v":"HINDI"},"GENDER :",{"$f":"VLOOKUP(I2752,Student_data,5,0)","v":"MALE"}]
["FATHER :  ",{"$f":"VLOOKUP(I2752,Student_data,7,0)","v":"DFD"},null,"SECTION : ",{"$f":"IF('School Info'!$F$8=\"\",\"\",'School Info'!$F$8)","v":"A"},"S.No. : ",{"$f":"VLOOKUP(I2752,Student_data,2,0)","v":0}]
["MOTHER :  ",{"$f":"VLOOKUP(I2752,Student_data,8,0)","v":"GAG"},null,"School DISE Code :",null,{"$f":"IF('School Info'!$B$5=\"\",\"\",'School Info'!$B$5)","v":123456890}]
[]
["SUBJECT","DATE","DAY","TIME "]
[{"$f":"IF('School Info'!$J$5=\"\",\"\",'School Info'!$J$5)","v":"HINDI"},{"$f":"IF('School Info'!$K$5=\"\",\"\",'School Info'!$K$5)","v":"2001-01-01"},{"$f":"IF('School Info'!$L$5=\"\",\"\",'School Info'!$L$5)","v":"MONDAY"},{"$f":"IF('School Info'!$M$5=\"\",\"\",'School Info'!$M$5)","v":"10:00AM TO 12:00PM"}]
[{"$f":"IF('School Info'!$J$6=\"\",\"\",'School Info'!$J$6)","v":"ENGLISH"},{"$f":"IF('School Info'!$K$6=\"\",\"\",'School Info'!$K$6)","v":"2001-01-01"},{"$f":"IF('School Info'!$L$6=\"\",\"\",'School Info'!$L$6)","v":"TUESDAY"},{"$f":"IF('School Info'!$M$6=\"\",\"\",'School Info'!$M$6)","v":"10:00AM TO 12:00PM"}]
[{"$f":"IF('School Info'!$J$7=\"\",\"\",'School Info'!$J$7)","v":"SCIENCE"},{"$f":"IF('School Info'!$K$7=\"\",\"\",'School Info'!$K$7)","v":"2001-01-01"},{"$f":"IF('School Info'!$L$7=\"\",\"\",'School Info'!$L$7)","v":"WEDNESDAY"},{"$f":"IF('School Info'!$M$7=\"\",\"\",'School Info'!$M$7)","v":"10:00AM TO 12:00PM"}]
[{"$f":"IF('School Info'!$J$8=\"\",\"\",'School Info'!$J$8)","v":"MATH"},{"$f":"IF('School Info'!$K$8=\"\",\"\",'School Info'!$K$8)","v":"2001-01-01"},{"$f":"IF('School Info'!$L$8=\"\",\"\",'School Info'!$L$8)","v":"THURSDAY"},{"$f":"IF('School Info'!$M$8=\"\",\"\",'School Info'!$M$8)","v":"10:00AM TO 12:00PM"}]
[{"$f":"IF('School Info'!$J$9=\"\",\"\",'School Info'!$J$9)","v":"SOCIAL SCIENCE"},{"$f":"IF('School Info'!$K$9=\"\",\"\",'School Info'!$K$9)","v":"2001-01-01"},{"$f":"IF('School Info'!$L$9=\"\",\"\",'School Info'!$L$9)","v":"FRIDAY"},{"$f":"IF('School Info'!$M$9=\"\",\"\",'School Info'!$M$9)","v":"10:00AM TO 12:00PM"}]
[{"$f":"IF('School Info'!$J$10=\"\",\"\",'School Info'!$J$10)","v":"SANSKRIT"},{"$f":"IF('School Info'!$K$10=\"\",\"\",'School Info'!$K$10)","v":"2001-01-01"},{"$f":"IF('School Info'!$L$10=\"\",\"\",'School Info'!$L$10)","v":"SATURDAY"},{"$f":"IF('School Info'!$M$10=\"\",\"\",'School Info'!$M$10)","v":"10:00AM TO 12:00PM"}]
[]
["Note :"]
["1. परीक्षार्थी अपना प्रवेश पत्र रोजाना साथ लेकर आये | (Candidates should bring their admit card with them daily.)"]
["2. परीक्षार्थी परीक्षा केंद्र पर आधा घंटे पहले पहुचें | (Candidates should reach the examination center half an hour before.)"]
["3. परीक्षार्थी परीक्षा हेतु आवश्यक सामग्री साथ लेकर आवें | (Candidates should bring with them the necessary materials for the examination.)"]
[]
[]
[]
[]
[]
["Sig. Exam Incharge",null,null,null,null,null,"Sig. Principal "]
[]
[{"$f":"IF('School Info'!$B$4=\"\",\"\",'School Info'!$B$4)","v":"Mahatma Gandhi Government School Bar"}]
[null,null,"School Aff. Code :",null,{"$f":"IF('School Info'!$F$5=\"\",\"\",'School Info'!$F$5)","v":123456}]
[null,null,{"$f":"IF('School Info'!$H$5=\"\",\"\",'School Info'!$H$5)","v":"HALF YEARLY EXAM"},null,{"$f":"IF('School Info'!$H$7=\"\",\"\",'School Info'!$H$7)","v":"2025-26"}]
[null,null,"ADMIT CARD",null,null,null,null,null,{"$f":"I2752+1","v":91}]
[]
["ROLL NO :  ",{"$f":"VLOOKUP(I2781,Student_data,3,0)","v":191},null,"CLASS : ",{"$f":"IF('School Info'!$B$7=\"\",\"\",'School Info'!$B$7)","v":6},"DOB :",{"$f":"VLOOKUP(I2781,Student_data,4,0)","v":"2091-01-01"}]
["NAME :  ",{"$f":"VLOOKUP(I2781,Student_data,6,0)","v":"RAJ GURUJI"},null,"MEDUIM : ",{"$f":"IF('School Info'!$E$7=\"\",\"\",'School Info'!$E$7)","v":"HINDI"},"GENDER :",{"$f":"VLOOKUP(I2781,Student_data,5,0)","v":"MALE"}]
["FATHER :  ",{"$f":"VLOOKUP(I2781,Student_data,7,0)","v":"RAJ"},null,"SECTION : ",{"$f":"IF('School Info'!$F$8=\"\",\"\",'School Info'!$F$8)","v":"A"},"S.No. : ",{"$f":"VLOOKUP(I2781,Student_data,2,0)","v":0}]
["MOTHER :  ",{"$f":"VLOOKUP(I2781,Student_data,8,0)","v":"DEVI"},null,"School DISE Code :",null,{"$f":"IF('School Info'!$B$5=\"\",\"\",'School Info'!$B$5)","v":123456890}]
[]
["SUBJECT","DATE","DAY","TIME "]
[{"$f":"IF('School Info'!$J$5=\"\",\"\",'School Info'!$J$5)","v":"HINDI"},{"$f":"IF('School Info'!$K$5=\"\",\"\",'School Info'!$K$5)","v":"2001-01-01"},{"$f":"IF('School Info'!$L$5=\"\",\"\",'School Info'!$L$5)","v":"MONDAY"},{"$f":"IF('School Info'!$M$5=\"\",\"\",'School Info'!$M$5)","v":"10:00AM TO 12:00PM"}]
[{"$f":"IF('School Info'!$J$6=\"\",\"\",'School Info'!$J$6)","v":"ENGLISH"},{"$f":"IF('School Info'!$K$6=\"\",\"\",'School Info'!$K$6)","v":"2001-01-01"},{"$f":"IF('School Info'!$L$6=\"\",\"\",'School Info'!$L$6)","v":"TUESDAY"},{"$f":"IF('School Info'!$M$6=\"\",\"\",'School Info'!$M$6)","v":"10:00AM TO 12:00PM"}]
[{"$f":"IF('School Info'!$J$7=\"\",\"\",'School Info'!$J$7)","v":"SCIENCE"},{"$f":"IF('School Info'!$K$7=\"\",\"\",'School Info'!$K$7)","v":"2001-01-01"},{"$f":"IF('School Info'!$L$7=\"\",\"\",'School Info'!$L$7)","v":"WEDNESDAY"},{"$f":"IF('School Info'!$M$7=\"\",\"\",'School Info'!$M$7)","v":"10:00AM TO 12:00PM"}]
[{"$f":"IF('School Info'!$J$8=\"\",\"\",'School Info'!$J$8)","v":"MATH"},{"$f":"IF('School Info'!$K$8=\"\",\"\",'School Info'!$K$8)","v":"2001-01-01"},{"$f":"IF('School Info'!$L$8=\"\",\"\",'School Info'!$L$8)","v":"THURSDAY"},{"$f":"IF('School Info'!$M$8=\"\",\"\",'School Info'!$M$8)","v":"10:00AM TO 12:00PM"}]
[{"$f":"IF('School Info'!$J$9=\"\",\"\",'School Info'!$J$9)","v":"SOCIAL SCIENCE"},{"$f":"IF('School Info'!$K$9=\"\",\"\",'School Info'!$K$9)","v":"2001-01-01"},{"$f":"IF('School Info'!$L$9=\"\",\"\",'School Info'!$L$9)","v":"FRIDAY"},{"$f":"IF('School Info'!$M$9=\"\",\"\",'School Info'!$M$9)","v":"10:00AM TO 12:00PM"}]
[{"$f":"IF('School Info'!$J$10=\"\",\"\",'School Info'!$J$10)","v":"SANSKRIT"},{"$f":"IF('School Info'!$K$10=\"\",\"\",'School Info'!$K$10)","v":"2001-01-01"},{"$f":"IF('School Info'!$L$10=\"\",\"\",'School Info'!$L$10)","v":"SATURDAY"},{"$f":"IF('School Info'!$M$10=\"\",\"\",'School Info'!$M$10)","v":"10:00AM TO 12:00PM"}]
[]
["Note :"]
["1. परीक्षार्थी अपना प्रवेश पत्र रोजाना साथ लेकर आये | (Candidates should bring their admit card with them daily.)"]
["2. परीक्षार्थी परीक्षा केंद्र पर आधा घंटे पहले पहुचें | (Candidates should reach the examination center half an hour before.)"]
["3. परीक्षार्थी परीक्षा हेतु आवश्यक सामग्री साथ लेकर आवें | (Candidates should bring with them the necessary materials for the examination.)"]
[]
[]
[]
[]
[]
["Sig. Exam Incharge",null,null,null,null,null,"Sig. Principal "]
[".------------------------------------------------------- Cut Here------------------------------------------------------"]
[{"$f":"IF('School Info'!$B$4=\"\",\"\",'School Info'!$B$4)","v":"Mahatma Gandhi Government School Bar"}]
[null,null,"School Aff. Code :",null,{"$f":"IF('School Info'!$F$5=\"\",\"\",'School Info'!$F$5)","v":123456}]
[null,null,{"$f":"IF('School Info'!$H$5=\"\",\"\",'School Info'!$H$5)","v":"HALF YEARLY EXAM"},null,{"$f":"IF('School Info'!$H$7=\"\",\"\",'School Info'!$H$7)","v":"2025-26"}]
[null,null,"ADMIT CARD",null,null,null,null,null,{"$f":"I2781+1","v":92}]
[]
["ROLL NO :  ",{"$f":"VLOOKUP(I2810,Student_data,3,0)","v":192},null,"CLASS : ",{"$f":"IF('School Info'!$B$7=\"\",\"\",'School Info'!$B$7)","v":6},"DOB :",{"$f":"VLOOKUP(I2810,Student_data,4,0)","v":"2092-01-01"}]
["NAME :  ",{"$f":"VLOOKUP(I2810,Student_data,6,0)","v":"MONU"},null,"MEDUIM : ",{"$f":"IF('School Info'!$E$7=\"\",\"\",'School Info'!$E$7)","v":"HINDI"},"GENDER :",{"$f":"VLOOKUP(I2810,Student_data,5,0)","v":"MALE"}]
["FATHER :  ",{"$f":"VLOOKUP(I2810,Student_data,7,0)","v":"RAAA"},null,"SECTION : ",{"$f":"IF('School Info'!$F$8=\"\",\"\",'School Info'!$F$8)","v":"A"},"S.No. : ",{"$f":"VLOOKUP(I2810,Student_data,2,0)","v":0}]
["MOTHER :  ",{"$f":"VLOOKUP(I2810,Student_data,8,0)","v":"DDD"},null,"School DISE Code :",null,{"$f":"IF('School Info'!$B$5=\"\",\"\",'School Info'!$B$5)","v":123456890}]
[]
["SUBJECT","DATE","DAY","TIME "]
[{"$f":"IF('School Info'!$J$5=\"\",\"\",'School Info'!$J$5)","v":"HINDI"},{"$f":"IF('School Info'!$K$5=\"\",\"\",'School Info'!$K$5)","v":"2001-01-01"},{"$f":"IF('School Info'!$L$5=\"\",\"\",'School Info'!$L$5)","v":"MONDAY"},{"$f":"IF('School Info'!$M$5=\"\",\"\",'School Info'!$M$5)","v":"10:00AM TO 12:00PM"}]
[{"$f":"IF('School Info'!$J$6=\"\",\"\",'School Info'!$J$6)","v":"ENGLISH"},{"$f":"IF('School Info'!$K$6=\"\",\"\",'School Info'!$K$6)","v":"2001-01-01"},{"$f":"IF('School Info'!$L$6=\"\",\"\",'School Info'!$L$6)","v":"TUESDAY"},{"$f":"IF('School Info'!$M$6=\"\",\"\",'School Info'!$M$6)","v":"10:00AM TO 12:00PM"}]
[{"$f":"IF('School Info'!$J$7=\"\",\"\",'School Info'!$J$7)","v":"SCIENCE"},{"$f":"IF('School Info'!$K$7=\"\",\"\",'School Info'!$K$7)","v":"2001-01-01"},{"$f":"IF('School Info'!$L$7=\"\",\"\",'School Info'!$L$7)","v":"WEDNESDAY"},{"$f":"IF('School Info'!$M$7=\"\",\"\",'School Info'!$M$7)","v":"10:00AM TO 12:00PM"}]
[{"$f":"IF('School Info'!$J$8=\"\",\"\",'School Info'!$J$8)","v":"MATH"},{"$f":"IF('School Info'!$K$8=\"\",\"\",'School Info'!$K$8)","v":"2001-01-01"},{"$f":"IF('School Info'!$L$8=\"\",\"\",'School Info'!$L$8)","v":"THURSDAY"},{"$f":"IF('School Info'!$M$8=\"\",\"\",'School Info'!$M$8)","v":"10:00AM TO 12:00PM"}]
[{"$f":"IF('School Info'!$J$9=\"\",\"\",'School Info'!$J$9)","v":"SOCIAL SCIENCE"},{"$f":"IF('School Info'!$K$9=\"\",\"\",'School Info'!$K$9)","v":"2001-01-01"},{"$f":"IF('School Info'!$L$9=\"\",\"\",'School Info'!$L$9)","v":"FRIDAY"},{"$f":"IF('School Info'!$M$9=\"\",\"\",'School Info'!$M$9)","v":"10:00AM TO 12:00PM"}]
[{"$f":"IF('School Info'!$J$10=\"\",\"\",'School Info'!$J$10)","v":"SANSKRIT"},{"$f":"IF('School Info'!$K$10=\"\",\"\",'School Info'!$K$10)","v":"2001-01-01"},{"$f":"IF('School Info'!$L$10=\"\",\"\",'School Info'!$L$10)","v":"SATURDAY"},{"$f":"IF('School Info'!$M$10=\"\",\"\",'School Info'!$M$10)","v":"10:00AM TO 12:00PM"}]
[]
["Note :"]
["1. परीक्षार्थी अपना प्रवेश पत्र रोजाना साथ लेकर आये | (Candidates should bring their admit card with them daily.)"]
["2. परीक्षार्थी परीक्षा केंद्र पर आधा घंटे पहले पहुचें | (Candidates should reach the examination center half an hour before.)"]
["3. परीक्षार्थी परीक्षा हेतु आवश्यक सामग्री साथ लेकर आवें | (Candidates should bring with them the necessary materials for the examination.)"]
[]
[]
[]
[]
[]
["Sig. Exam Incharge",null,null,null,null,null,"Sig. Principal "]
[]
[{"$f":"IF('School Info'!$B$4=\"\",\"\",'School Info'!$B$4)","v":"Mahatma Gandhi Government School Bar"}]
[null,null,"School Aff. Code :",null,{"$f":"IF('School Info'!$F$5=\"\",\"\",'School Info'!$F$5)","v":123456}]
[null,null,{"$f":"IF('School Info'!$H$5=\"\",\"\",'School Info'!$H$5)","v":"HALF YEARLY EXAM"},null,{"$f":"IF('School Info'!$H$7=\"\",\"\",'School Info'!$H$7)","v":"2025-26"}]
[null,null,"ADMIT CARD",null,null,null,null,null,{"$f":"I2810+1","v":93}]
[]
["ROLL NO :  ",{"$f":"VLOOKUP(I2839,Student_data,3,0)","v":193},null,"CLASS : ",{"$f":"IF('School Info'!$B$7=\"\",\"\",'School Info'!$B$7)","v":6},"DOB :",{"$f":"VLOOKUP(I2839,Student_data,4,0)","v":"2093-01-01"}]
["NAME :  ",{"$f":"VLOOKUP(I2839,Student_data,6,0)","v":"SONU"},null,"MEDUIM : ",{"$f":"IF('School Info'!$E$7=\"\",\"\",'School Info'!$E$7)","v":"HINDI"},"GENDER :",{"$f":"VLOOKUP(I2839,Student_data,5,0)","v":"MALE"}]
["FATHER :  ",{"$f":"VLOOKUP(I2839,Student_data,7,0)","v":"AAA"},null,"SECTION : ",{"$f":"IF('School Info'!$F$8=\"\",\"\",'School Info'!$F$8)","v":"A"},"S.No. : ",{"$f":"VLOOKUP(I2839,Student_data,2,0)","v":0}]
["MOTHER :  ",{"$f":"VLOOKUP(I2839,Student_data,8,0)","v":"DDS"},null,"School DISE Code :",null,{"$f":"IF('School Info'!$B$5=\"\",\"\",'School Info'!$B$5)","v":123456890}]
[]
["SUBJECT","DATE","DAY","TIME "]
[{"$f":"IF('School Info'!$J$5=\"\",\"\",'School Info'!$J$5)","v":"HINDI"},{"$f":"IF('School Info'!$K$5=\"\",\"\",'School Info'!$K$5)","v":"2001-01-01"},{"$f":"IF('School Info'!$L$5=\"\",\"\",'School Info'!$L$5)","v":"MONDAY"},{"$f":"IF('School Info'!$M$5=\"\",\"\",'School Info'!$M$5)","v":"10:00AM TO 12:00PM"}]
[{"$f":"IF('School Info'!$J$6=\"\",\"\",'School Info'!$J$6)","v":"ENGLISH"},{"$f":"IF('School Info'!$K$6=\"\",\"\",'School Info'!$K$6)","v":"2001-01-01"},{"$f":"IF('School Info'!$L$6=\"\",\"\",'School Info'!$L$6)","v":"TUESDAY"},{"$f":"IF('School Info'!$M$6=\"\",\"\",'School Info'!$M$6)","v":"10:00AM TO 12:00PM"}]
[{"$f":"IF('School Info'!$J$7=\"\",\"\",'School Info'!$J$7)","v":"SCIENCE"},{"$f":"IF('School Info'!$K$7=\"\",\"\",'School Info'!$K$7)","v":"2001-01-01"},{"$f":"IF('School Info'!$L$7=\"\",\"\",'School Info'!$L$7)","v":"WEDNESDAY"},{"$f":"IF('School Info'!$M$7=\"\",\"\",'School Info'!$M$7)","v":"10:00AM TO 12:00PM"}]
[{"$f":"IF('School Info'!$J$8=\"\",\"\",'School Info'!$J$8)","v":"MATH"},{"$f":"IF('School Info'!$K$8=\"\",\"\",'School Info'!$K$8)","v":"2001-01-01"},{"$f":"IF('School Info'!$L$8=\"\",\"\",'School Info'!$L$8)","v":"THURSDAY"},{"$f":"IF('School Info'!$M$8=\"\",\"\",'School Info'!$M$8)","v":"10:00AM TO 12:00PM"}]
[{"$f":"IF('School Info'!$J$9=\"\",\"\",'School Info'!$J$9)","v":"SOCIAL SCIENCE"},{"$f":"IF('School Info'!$K$9=\"\",\"\",'School Info'!$K$9)","v":"2001-01-01"},{"$f":"IF('School Info'!$L$9=\"\",\"\",'School Info'!$L$9)","v":"FRIDAY"},{"$f":"IF('School Info'!$M$9=\"\",\"\",'School Info'!$M$9)","v":"10:00AM TO 12:00PM"}]
[{"$f":"IF('School Info'!$J$10=\"\",\"\",'School Info'!$J$10)","v":"SANSKRIT"},{"$f":"IF('School Info'!$K$10=\"\",\"\",'School Info'!$K$10)","v":"2001-01-01"},{"$f":"IF('School Info'!$L$10=\"\",\"\",'School Info'!$L$10)","v":"SATURDAY"},{"$f":"IF('School Info'!$M$10=\"\",\"\",'School Info'!$M$10)","v":"10:00AM TO 12:00PM"}]
[]
["Note :"]
["1. परीक्षार्थी अपना प्रवेश पत्र रोजाना साथ लेकर आये | (Candidates should bring their admit card with them daily.)"]
["2. परीक्षार्थी परीक्षा केंद्र पर आधा घंटे पहले पहुचें | (Candidates should reach the examination center half an hour before.)"]
["3. परीक्षार्थी परीक्षा हेतु आवश्यक सामग्री साथ लेकर आवें | (Candidates should bring with them the necessary materials for the examination.)"]
[]
[]
[]
[]
[]
["Sig. Exam Incharge",null,null,null,null,null,"Sig. Principal "]
[".------------------------------------------------------- Cut Here------------------------------------------------------"]
[{"$f":"IF('School Info'!$B$4=\"\",\"\",'School Info'!$B$4)","v":"Mahatma Gandhi Government School Bar"}]
[null,null,"School Aff. Code :",null,{"$f":"IF('School Info'!$F$5=\"\",\"\",'School Info'!$F$5)","v":123456}]
[null,null,{"$f":"IF('School Info'!$H$5=\"\",\"\",'School Info'!$H$5)","v":"HALF YEARLY EXAM"},null,{"$f":"IF('School Info'!$H$7=\"\",\"\",'School Info'!$H$7)","v":"2025-26"}]
[null,null,"ADMIT CARD",null,null,null,null,null,{"$f":"I2839+1","v":94}]
[]
["ROLL NO :  ",{"$f":"VLOOKUP(I2868,Student_data,3,0)","v":194},null,"CLASS : ",{"$f":"IF('School Info'!$B$7=\"\",\"\",'School Info'!$B$7)","v":6},"DOB :",{"$f":"VLOOKUP(I2868,Student_data,4,0)","v":"2094-01-01"}]
["NAME :  ",{"$f":"VLOOKUP(I2868,Student_data,6,0)","v":"KARNA"},null,"MEDUIM : ",{"$f":"IF('School Info'!$E$7=\"\",\"\",'School Info'!$E$7)","v":"HINDI"},"GENDER :",{"$f":"VLOOKUP(I2868,Student_data,5,0)","v":"MALE"}]
["FATHER :  ",{"$f":"VLOOKUP(I2868,Student_data,7,0)","v":"BBB"},null,"SECTION : ",{"$f":"IF('School Info'!$F$8=\"\",\"\",'School Info'!$F$8)","v":"A"},"S.No. : ",{"$f":"VLOOKUP(I2868,Student_data,2,0)","v":0}]
["MOTHER :  ",{"$f":"VLOOKUP(I2868,Student_data,8,0)","v":"SSDDF"},null,"School DISE Code :",null,{"$f":"IF('School Info'!$B$5=\"\",\"\",'School Info'!$B$5)","v":123456890}]
[]
["SUBJECT","DATE","DAY","TIME "]
[{"$f":"IF('School Info'!$J$5=\"\",\"\",'School Info'!$J$5)","v":"HINDI"},{"$f":"IF('School Info'!$K$5=\"\",\"\",'School Info'!$K$5)","v":"2001-01-01"},{"$f":"IF('School Info'!$L$5=\"\",\"\",'School Info'!$L$5)","v":"MONDAY"},{"$f":"IF('School Info'!$M$5=\"\",\"\",'School Info'!$M$5)","v":"10:00AM TO 12:00PM"}]
[{"$f":"IF('School Info'!$J$6=\"\",\"\",'School Info'!$J$6)","v":"ENGLISH"},{"$f":"IF('School Info'!$K$6=\"\",\"\",'School Info'!$K$6)","v":"2001-01-01"},{"$f":"IF('School Info'!$L$6=\"\",\"\",'School Info'!$L$6)","v":"TUESDAY"},{"$f":"IF('School Info'!$M$6=\"\",\"\",'School Info'!$M$6)","v":"10:00AM TO 12:00PM"}]
[{"$f":"IF('School Info'!$J$7=\"\",\"\",'School Info'!$J$7)","v":"SCIENCE"},{"$f":"IF('School Info'!$K$7=\"\",\"\",'School Info'!$K$7)","v":"2001-01-01"},{"$f":"IF('School Info'!$L$7=\"\",\"\",'School Info'!$L$7)","v":"WEDNESDAY"},{"$f":"IF('School Info'!$M$7=\"\",\"\",'School Info'!$M$7)","v":"10:00AM TO 12:00PM"}]
[{"$f":"IF('School Info'!$J$8=\"\",\"\",'School Info'!$J$8)","v":"MATH"},{"$f":"IF('School Info'!$K$8=\"\",\"\",'School Info'!$K$8)","v":"2001-01-01"},{"$f":"IF('School Info'!$L$8=\"\",\"\",'School Info'!$L$8)","v":"THURSDAY"},{"$f":"IF('School Info'!$M$8=\"\",\"\",'School Info'!$M$8)","v":"10:00AM TO 12:00PM"}]
[{"$f":"IF('School Info'!$J$9=\"\",\"\",'School Info'!$J$9)","v":"SOCIAL SCIENCE"},{"$f":"IF('School Info'!$K$9=\"\",\"\",'School Info'!$K$9)","v":"2001-01-01"},{"$f":"IF('School Info'!$L$9=\"\",\"\",'School Info'!$L$9)","v":"FRIDAY"},{"$f":"IF('School Info'!$M$9=\"\",\"\",'School Info'!$M$9)","v":"10:00AM TO 12:00PM"}]
[{"$f":"IF('School Info'!$J$10=\"\",\"\",'School Info'!$J$10)","v":"SANSKRIT"},{"$f":"IF('School Info'!$K$10=\"\",\"\",'School Info'!$K$10)","v":"2001-01-01"},{"$f":"IF('School Info'!$L$10=\"\",\"\",'School Info'!$L$10)","v":"SATURDAY"},{"$f":"IF('School Info'!$M$10=\"\",\"\",'School Info'!$M$10)","v":"10:00AM TO 12:00PM"}]
[]
["Note :"]
["1. परीक्षार्थी अपना प्रवेश पत्र रोजाना साथ लेकर आये | (Candidates should bring their admit card with them daily.)"]
["2. परीक्षार्थी परीक्षा केंद्र पर आधा घंटे पहले पहुचें | (Candidates should reach the examination center half an hour before.)"]
["3. परीक्षार्थी परीक्षा हेतु आवश्यक सामग्री साथ लेकर आवें | (Candidates should bring with them the necessary materials for the examination.)"]
[]
[]
[]
[]
[]
["Sig. Exam Incharge",null,null,null,null,null,"Sig. Principal "]
[]
[{"$f":"IF('School Info'!$B$4=\"\",\"\",'School Info'!$B$4)","v":"Mahatma Gandhi Government School Bar"}]
[null,null,"School Aff. Code :",null,{"$f":"IF('School Info'!$F$5=\"\",\"\",'School Info'!$F$5)","v":123456}]
[null,null,{"$f":"IF('School Info'!$H$5=\"\",\"\",'School Info'!$H$5)","v":"HALF YEARLY EXAM"},null,{"$f":"IF('School Info'!$H$7=\"\",\"\",'School Info'!$H$7)","v":"2025-26"}]
[null,null,"ADMIT CARD",null,null,null,null,null,{"$f":"I2868+1","v":95}]
[]
["ROLL NO :  ",{"$f":"VLOOKUP(I2897,Student_data,3,0)","v":195},null,"CLASS : ",{"$f":"IF('School Info'!$B$7=\"\",\"\",'School Info'!$B$7)","v":6},"DOB :",{"$f":"VLOOKUP(I2897,Student_data,4,0)","v":"2095-01-01"}]
["NAME :  ",{"$f":"VLOOKUP(I2897,Student_data,6,0)","v":"RAJA  "},null,"MEDUIM : ",{"$f":"IF('School Info'!$E$7=\"\",\"\",'School Info'!$E$7)","v":"HINDI"},"GENDER :",{"$f":"VLOOKUP(I2897,Student_data,5,0)","v":"MALE"}]
["FATHER :  ",{"$f":"VLOOKUP(I2897,Student_data,7,0)","v":"DFD"},null,"SECTION : ",{"$f":"IF('School Info'!$F$8=\"\",\"\",'School Info'!$F$8)","v":"A"},"S.No. : ",{"$f":"VLOOKUP(I2897,Student_data,2,0)","v":0}]
["MOTHER :  ",{"$f":"VLOOKUP(I2897,Student_data,8,0)","v":"GAG"},null,"School DISE Code :",null,{"$f":"IF('School Info'!$B$5=\"\",\"\",'School Info'!$B$5)","v":123456890}]
[]
["SUBJECT","DATE","DAY","TIME "]
[{"$f":"IF('School Info'!$J$5=\"\",\"\",'School Info'!$J$5)","v":"HINDI"},{"$f":"IF('School Info'!$K$5=\"\",\"\",'School Info'!$K$5)","v":"2001-01-01"},{"$f":"IF('School Info'!$L$5=\"\",\"\",'School Info'!$L$5)","v":"MONDAY"},{"$f":"IF('School Info'!$M$5=\"\",\"\",'School Info'!$M$5)","v":"10:00AM TO 12:00PM"}]
[{"$f":"IF('School Info'!$J$6=\"\",\"\",'School Info'!$J$6)","v":"ENGLISH"},{"$f":"IF('School Info'!$K$6=\"\",\"\",'School Info'!$K$6)","v":"2001-01-01"},{"$f":"IF('School Info'!$L$6=\"\",\"\",'School Info'!$L$6)","v":"TUESDAY"},{"$f":"IF('School Info'!$M$6=\"\",\"\",'School Info'!$M$6)","v":"10:00AM TO 12:00PM"}]
[{"$f":"IF('School Info'!$J$7=\"\",\"\",'School Info'!$J$7)","v":"SCIENCE"},{"$f":"IF('School Info'!$K$7=\"\",\"\",'School Info'!$K$7)","v":"2001-01-01"},{"$f":"IF('School Info'!$L$7=\"\",\"\",'School Info'!$L$7)","v":"WEDNESDAY"},{"$f":"IF('School Info'!$M$7=\"\",\"\",'School Info'!$M$7)","v":"10:00AM TO 12:00PM"}]
[{"$f":"IF('School Info'!$J$8=\"\",\"\",'School Info'!$J$8)","v":"MATH"},{"$f":"IF('School Info'!$K$8=\"\",\"\",'School Info'!$K$8)","v":"2001-01-01"},{"$f":"IF('School Info'!$L$8=\"\",\"\",'School Info'!$L$8)","v":"THURSDAY"},{"$f":"IF('School Info'!$M$8=\"\",\"\",'School Info'!$M$8)","v":"10:00AM TO 12:00PM"}]
[{"$f":"IF('School Info'!$J$9=\"\",\"\",'School Info'!$J$9)","v":"SOCIAL SCIENCE"},{"$f":"IF('School Info'!$K$9=\"\",\"\",'School Info'!$K$9)","v":"2001-01-01"},{"$f":"IF('School Info'!$L$9=\"\",\"\",'School Info'!$L$9)","v":"FRIDAY"},{"$f":"IF('School Info'!$M$9=\"\",\"\",'School Info'!$M$9)","v":"10:00AM TO 12:00PM"}]
[{"$f":"IF('School Info'!$J$10=\"\",\"\",'School Info'!$J$10)","v":"SANSKRIT"},{"$f":"IF('School Info'!$K$10=\"\",\"\",'School Info'!$K$10)","v":"2001-01-01"},{"$f":"IF('School Info'!$L$10=\"\",\"\",'School Info'!$L$10)","v":"SATURDAY"},{"$f":"IF('School Info'!$M$10=\"\",\"\",'School Info'!$M$10)","v":"10:00AM TO 12:00PM"}]
[]
["Note :"]
["1. परीक्षार्थी अपना प्रवेश पत्र रोजाना साथ लेकर आये | (Candidates should bring their admit card with them daily.)"]
["2. परीक्षार्थी परीक्षा केंद्र पर आधा घंटे पहले पहुचें | (Candidates should reach the examination center half an hour before.)"]
["3. परीक्षार्थी परीक्षा हेतु आवश्यक सामग्री साथ लेकर आवें | (Candidates should bring with them the necessary materials for the examination.)"]
[]
[]
[]
[]
[]
["Sig. Exam Incharge",null,null,null,null,null,"Sig. Principal "]
[".------------------------------------------------------- Cut Here------------------------------------------------------"]
[{"$f":"IF('School Info'!$B$4=\"\",\"\",'School Info'!$B$4)","v":"Mahatma Gandhi Government School Bar"}]
[null,null,"School Aff. Code :",null,{"$f":"IF('School Info'!$F$5=\"\",\"\",'School Info'!$F$5)","v":123456}]
[null,null,{"$f":"IF('School Info'!$H$5=\"\",\"\",'School Info'!$H$5)","v":"HALF YEARLY EXAM"},null,{"$f":"IF('School Info'!$H$7=\"\",\"\",'School Info'!$H$7)","v":"2025-26"}]
[null,null,"ADMIT CARD",null,null,null,null,null,{"$f":"I2897+1","v":96}]
[]
["ROLL NO :  ",{"$f":"VLOOKUP(I2926,Student_data,3,0)","v":196},null,"CLASS : ",{"$f":"IF('School Info'!$B$7=\"\",\"\",'School Info'!$B$7)","v":6},"DOB :",{"$f":"VLOOKUP(I2926,Student_data,4,0)","v":"2096-01-01"}]
["NAME :  ",{"$f":"VLOOKUP(I2926,Student_data,6,0)","v":"RAJ GURUJI"},null,"MEDUIM : ",{"$f":"IF('School Info'!$E$7=\"\",\"\",'School Info'!$E$7)","v":"HINDI"},"GENDER :",{"$f":"VLOOKUP(I2926,Student_data,5,0)","v":"MALE"}]
["FATHER :  ",{"$f":"VLOOKUP(I2926,Student_data,7,0)","v":"RAJ"},null,"SECTION : ",{"$f":"IF('School Info'!$F$8=\"\",\"\",'School Info'!$F$8)","v":"A"},"S.No. : ",{"$f":"VLOOKUP(I2926,Student_data,2,0)","v":0}]
["MOTHER :  ",{"$f":"VLOOKUP(I2926,Student_data,8,0)","v":"DEVI"},null,"School DISE Code :",null,{"$f":"IF('School Info'!$B$5=\"\",\"\",'School Info'!$B$5)","v":123456890}]
[]
["SUBJECT","DATE","DAY","TIME "]
[{"$f":"IF('School Info'!$J$5=\"\",\"\",'School Info'!$J$5)","v":"HINDI"},{"$f":"IF('School Info'!$K$5=\"\",\"\",'School Info'!$K$5)","v":"2001-01-01"},{"$f":"IF('School Info'!$L$5=\"\",\"\",'School Info'!$L$5)","v":"MONDAY"},{"$f":"IF('School Info'!$M$5=\"\",\"\",'School Info'!$M$5)","v":"10:00AM TO 12:00PM"}]
[{"$f":"IF('School Info'!$J$6=\"\",\"\",'School Info'!$J$6)","v":"ENGLISH"},{"$f":"IF('School Info'!$K$6=\"\",\"\",'School Info'!$K$6)","v":"2001-01-01"},{"$f":"IF('School Info'!$L$6=\"\",\"\",'School Info'!$L$6)","v":"TUESDAY"},{"$f":"IF('School Info'!$M$6=\"\",\"\",'School Info'!$M$6)","v":"10:00AM TO 12:00PM"}]
[{"$f":"IF('School Info'!$J$7=\"\",\"\",'School Info'!$J$7)","v":"SCIENCE"},{"$f":"IF('School Info'!$K$7=\"\",\"\",'School Info'!$K$7)","v":"2001-01-01"},{"$f":"IF('School Info'!$L$7=\"\",\"\",'School Info'!$L$7)","v":"WEDNESDAY"},{"$f":"IF('School Info'!$M$7=\"\",\"\",'School Info'!$M$7)","v":"10:00AM TO 12:00PM"}]
[{"$f":"IF('School Info'!$J$8=\"\",\"\",'School Info'!$J$8)","v":"MATH"},{"$f":"IF('School Info'!$K$8=\"\",\"\",'School Info'!$K$8)","v":"2001-01-01"},{"$f":"IF('School Info'!$L$8=\"\",\"\",'School Info'!$L$8)","v":"THURSDAY"},{"$f":"IF('School Info'!$M$8=\"\",\"\",'School Info'!$M$8)","v":"10:00AM TO 12:00PM"}]
[{"$f":"IF('School Info'!$J$9=\"\",\"\",'School Info'!$J$9)","v":"SOCIAL SCIENCE"},{"$f":"IF('School Info'!$K$9=\"\",\"\",'School Info'!$K$9)","v":"2001-01-01"},{"$f":"IF('School Info'!$L$9=\"\",\"\",'School Info'!$L$9)","v":"FRIDAY"},{"$f":"IF('School Info'!$M$9=\"\",\"\",'School Info'!$M$9)","v":"10:00AM TO 12:00PM"}]
[{"$f":"IF('School Info'!$J$10=\"\",\"\",'School Info'!$J$10)","v":"SANSKRIT"},{"$f":"IF('School Info'!$K$10=\"\",\"\",'School Info'!$K$10)","v":"2001-01-01"},{"$f":"IF('School Info'!$L$10=\"\",\"\",'School Info'!$L$10)","v":"SATURDAY"},{"$f":"IF('School Info'!$M$10=\"\",\"\",'School Info'!$M$10)","v":"10:00AM TO 12:00PM"}]
[]
["Note :"]
["1. परीक्षार्थी अपना प्रवेश पत्र रोजाना साथ लेकर आये | (Candidates should bring their admit card with them daily.)"]
["2. परीक्षार्थी परीक्षा केंद्र पर आधा घंटे पहले पहुचें | (Candidates should reach the examination center half an hour before.)"]
["3. परीक्षार्थी परीक्षा हेतु आवश्यक सामग्री साथ लेकर आवें | (Candidates should bring with them the necessary materials for the examination.)"]
[]
[]
[]
[]
[]
["Sig. Exam Incharge",null,null,null,null,null,"Sig. Principal "]
[]
[{"$f":"IF('School Info'!$B$4=\"\",\"\",'School Info'!$B$4)","v":"Mahatma Gandhi Government School Bar"}]
[null,null,"School Aff. Code :",null,{"$f":"IF('School Info'!$F$5=\"\",\"\",'School Info'!$F$5)","v":123456}]
[null,null,{"$f":"IF('School Info'!$H$5=\"\",\"\",'School Info'!$H$5)","v":"HALF YEARLY EXAM"},null,{"$f":"IF('School Info'!$H$7=\"\",\"\",'School Info'!$H$7)","v":"2025-26"}]
[null,null,"ADMIT CARD",null,null,null,null,null,{"$f":"I2926+1","v":97}]
[]
["ROLL NO :  ",{"$f":"VLOOKUP(I2955,Student_data,3,0)","v":197},null,"CLASS : ",{"$f":"IF('School Info'!$B$7=\"\",\"\",'School Info'!$B$7)","v":6},"DOB :",{"$f":"VLOOKUP(I2955,Student_data,4,0)","v":"2097-01-01"}]
["NAME :  ",{"$f":"VLOOKUP(I2955,Student_data,6,0)","v":"MONU"},null,"MEDUIM : ",{"$f":"IF('School Info'!$E$7=\"\",\"\",'School Info'!$E$7)","v":"HINDI"},"GENDER :",{"$f":"VLOOKUP(I2955,Student_data,5,0)","v":"MALE"}]
["FATHER :  ",{"$f":"VLOOKUP(I2955,Student_data,7,0)","v":"RAAA"},null,"SECTION : ",{"$f":"IF('School Info'!$F$8=\"\",\"\",'School Info'!$F$8)","v":"A"},"S.No. : ",{"$f":"VLOOKUP(I2955,Student_data,2,0)","v":0}]
["MOTHER :  ",{"$f":"VLOOKUP(I2955,Student_data,8,0)","v":"DDD"},null,"School DISE Code :",null,{"$f":"IF('School Info'!$B$5=\"\",\"\",'School Info'!$B$5)","v":123456890}]
[]
["SUBJECT","DATE","DAY","TIME "]
[{"$f":"IF('School Info'!$J$5=\"\",\"\",'School Info'!$J$5)","v":"HINDI"},{"$f":"IF('School Info'!$K$5=\"\",\"\",'School Info'!$K$5)","v":"2001-01-01"},{"$f":"IF('School Info'!$L$5=\"\",\"\",'School Info'!$L$5)","v":"MONDAY"},{"$f":"IF('School Info'!$M$5=\"\",\"\",'School Info'!$M$5)","v":"10:00AM TO 12:00PM"}]
[{"$f":"IF('School Info'!$J$6=\"\",\"\",'School Info'!$J$6)","v":"ENGLISH"},{"$f":"IF('School Info'!$K$6=\"\",\"\",'School Info'!$K$6)","v":"2001-01-01"},{"$f":"IF('School Info'!$L$6=\"\",\"\",'School Info'!$L$6)","v":"TUESDAY"},{"$f":"IF('School Info'!$M$6=\"\",\"\",'School Info'!$M$6)","v":"10:00AM TO 12:00PM"}]
[{"$f":"IF('School Info'!$J$7=\"\",\"\",'School Info'!$J$7)","v":"SCIENCE"},{"$f":"IF('School Info'!$K$7=\"\",\"\",'School Info'!$K$7)","v":"2001-01-01"},{"$f":"IF('School Info'!$L$7=\"\",\"\",'School Info'!$L$7)","v":"WEDNESDAY"},{"$f":"IF('School Info'!$M$7=\"\",\"\",'School Info'!$M$7)","v":"10:00AM TO 12:00PM"}]
[{"$f":"IF('School Info'!$J$8=\"\",\"\",'School Info'!$J$8)","v":"MATH"},{"$f":"IF('School Info'!$K$8=\"\",\"\",'School Info'!$K$8)","v":"2001-01-01"},{"$f":"IF('School Info'!$L$8=\"\",\"\",'School Info'!$L$8)","v":"THURSDAY"},{"$f":"IF('School Info'!$M$8=\"\",\"\",'School Info'!$M$8)","v":"10:00AM TO 12:00PM"}]
[{"$f":"IF('School Info'!$J$9=\"\",\"\",'School Info'!$J$9)","v":"SOCIAL SCIENCE"},{"$f":"IF('School Info'!$K$9=\"\",\"\",'School Info'!$K$9)","v":"2001-01-01"},{"$f":"IF('School Info'!$L$9=\"\",\"\",'School Info'!$L$9)","v":"FRIDAY"},{"$f":"IF('School Info'!$M$9=\"\",\"\",'School Info'!$M$9)","v":"10:00AM TO 12:00PM"}]
[{"$f":"IF('School Info'!$J$10=\"\",\"\",'School Info'!$J$10)","v":"SANSKRIT"},{"$f":"IF('School Info'!$K$10=\"\",\"\",'School Info'!$K$10)","v":"2001-01-01"},{"$f":"IF('School Info'!$L$10=\"\",\"\",'School Info'!$L$10)","v":"SATURDAY"},{"$f":"IF('School Info'!$M$10=\"\",\"\",'School Info'!$M$10)","v":"10:00AM TO 12:00PM"}]
[]
["Note :"]
["1. परीक्षार्थी अपना प्रवेश पत्र रोजाना साथ लेकर आये | (Candidates should bring their admit card with them daily.)"]
["2. परीक्षार्थी परीक्षा केंद्र पर आधा घंटे पहले पहुचें | (Candidates should reach the examination center half an hour before.)"]
["3. परीक्षार्थी परीक्षा हेतु आवश्यक सामग्री साथ लेकर आवें | (Candidates should bring with them the necessary materials for the examination.)"]
[]
[]
[]
[]
[]
["Sig. Exam Incharge",null,null,null,null,null,"Sig. Principal "]
[".------------------------------------------------------- Cut Here------------------------------------------------------"]
[{"$f":"IF('School Info'!$B$4=\"\",\"\",'School Info'!$B$4)","v":"Mahatma Gandhi Government School Bar"}]
[null,null,"School Aff. Code :",null,{"$f":"IF('School Info'!$F$5=\"\",\"\",'School Info'!$F$5)","v":123456}]
[null,null,{"$f":"IF('School Info'!$H$5=\"\",\"\",'School Info'!$H$5)","v":"HALF YEARLY EXAM"},null,{"$f":"IF('School Info'!$H$7=\"\",\"\",'School Info'!$H$7)","v":"2025-26"}]
[null,null,"ADMIT CARD",null,null,null,null,null,{"$f":"I2955+1","v":98}]
[]
["ROLL NO :  ",{"$f":"VLOOKUP(I2984,Student_data,3,0)","v":198},null,"CLASS : ",{"$f":"IF('School Info'!$B$7=\"\",\"\",'School Info'!$B$7)","v":6},"DOB :",{"$f":"VLOOKUP(I2984,Student_data,4,0)","v":"2098-01-01"}]
["NAME :  ",{"$f":"VLOOKUP(I2984,Student_data,6,0)","v":"SONU"},null,"MEDUIM : ",{"$f":"IF('School Info'!$E$7=\"\",\"\",'School Info'!$E$7)","v":"HINDI"},"GENDER :",{"$f":"VLOOKUP(I2984,Student_data,5,0)","v":"MALE"}]
["FATHER :  ",{"$f":"VLOOKUP(I2984,Student_data,7,0)","v":"AAA"},null,"SECTION : ",{"$f":"IF('School Info'!$F$8=\"\",\"\",'School Info'!$F$8)","v":"A"},"S.No. : ",{"$f":"VLOOKUP(I2984,Student_data,2,0)","v":0}]
["MOTHER :  ",{"$f":"VLOOKUP(I2984,Student_data,8,0)","v":"DDS"},null,"School DISE Code :",null,{"$f":"IF('School Info'!$B$5=\"\",\"\",'School Info'!$B$5)","v":123456890}]
[]
["SUBJECT","DATE","DAY","TIME "]
[{"$f":"IF('School Info'!$J$5=\"\",\"\",'School Info'!$J$5)","v":"HINDI"},{"$f":"IF('School Info'!$K$5=\"\",\"\",'School Info'!$K$5)","v":"2001-01-01"},{"$f":"IF('School Info'!$L$5=\"\",\"\",'School Info'!$L$5)","v":"MONDAY"},{"$f":"IF('School Info'!$M$5=\"\",\"\",'School Info'!$M$5)","v":"10:00AM TO 12:00PM"}]
[{"$f":"IF('School Info'!$J$6=\"\",\"\",'School Info'!$J$6)","v":"ENGLISH"},{"$f":"IF('School Info'!$K$6=\"\",\"\",'School Info'!$K$6)","v":"2001-01-01"},{"$f":"IF('School Info'!$L$6=\"\",\"\",'School Info'!$L$6)","v":"TUESDAY"},{"$f":"IF('School Info'!$M$6=\"\",\"\",'School Info'!$M$6)","v":"10:00AM TO 12:00PM"}]
[{"$f":"IF('School Info'!$J$7=\"\",\"\",'School Info'!$J$7)","v":"SCIENCE"},{"$f":"IF('School Info'!$K$7=\"\",\"\",'School Info'!$K$7)","v":"2001-01-01"},{"$f":"IF('School Info'!$L$7=\"\",\"\",'School Info'!$L$7)","v":"WEDNESDAY"},{"$f":"IF('School Info'!$M$7=\"\",\"\",'School Info'!$M$7)","v":"10:00AM TO 12:00PM"}]
[{"$f":"IF('School Info'!$J$8=\"\",\"\",'School Info'!$J$8)","v":"MATH"},{"$f":"IF('School Info'!$K$8=\"\",\"\",'School Info'!$K$8)","v":"2001-01-01"},{"$f":"IF('School Info'!$L$8=\"\",\"\",'School Info'!$L$8)","v":"THURSDAY"},{"$f":"IF('School Info'!$M$8=\"\",\"\",'School Info'!$M$8)","v":"10:00AM TO 12:00PM"}]
[{"$f":"IF('School Info'!$J$9=\"\",\"\",'School Info'!$J$9)","v":"SOCIAL SCIENCE"},{"$f":"IF('School Info'!$K$9=\"\",\"\",'School Info'!$K$9)","v":"2001-01-01"},{"$f":"IF('School Info'!$L$9=\"\",\"\",'School Info'!$L$9)","v":"FRIDAY"},{"$f":"IF('School Info'!$M$9=\"\",\"\",'School Info'!$M$9)","v":"10:00AM TO 12:00PM"}]
[{"$f":"IF('School Info'!$J$10=\"\",\"\",'School Info'!$J$10)","v":"SANSKRIT"},{"$f":"IF('School Info'!$K$10=\"\",\"\",'School Info'!$K$10)","v":"2001-01-01"},{"$f":"IF('School Info'!$L$10=\"\",\"\",'School Info'!$L$10)","v":"SATURDAY"},{"$f":"IF('School Info'!$M$10=\"\",\"\",'School Info'!$M$10)","v":"10:00AM TO 12:00PM"}]
[]
["Note :"]
["1. परीक्षार्थी अपना प्रवेश पत्र रोजाना साथ लेकर आये | (Candidates should bring their admit card with them daily.)"]
["2. परीक्षार्थी परीक्षा केंद्र पर आधा घंटे पहले पहुचें | (Candidates should reach the examination center half an hour before.)"]
["3. परीक्षार्थी परीक्षा हेतु आवश्यक सामग्री साथ लेकर आवें | (Candidates should bring with them the necessary materials for the examination.)"]
[]
[]
[]
[]
[]
["Sig. Exam Incharge",null,null,null,null,null,"Sig. Principal "]
[]
[{"$f":"IF('School Info'!$B$4=\"\",\"\",'School Info'!$B$4)","v":"Mahatma Gandhi Government School Bar"}]
[null,null,"School Aff. Code :",null,{"$f":"IF('School Info'!$F$5=\"\",\"\",'School Info'!$F$5)","v":123456}]
[null,null,{"$f":"IF('School Info'!$H$5=\"\",\"\",'School Info'!$H$5)","v":"HALF YEARLY EXAM"},null,{"$f":"IF('School Info'!$H$7=\"\",\"\",'School Info'!$H$7)","v":"2025-26"}]
[null,null,"ADMIT CARD",null,null,null,null,null,{"$f":"I2984+1","v":99}]
[]
["ROLL NO :  ",{"$f":"VLOOKUP(I3013,Student_data,3,0)","v":199},null,"CLASS : ",{"$f":"IF('School Info'!$B$7=\"\",\"\",'School Info'!$B$7)","v":6},"DOB :",{"$f":"VLOOKUP(I3013,Student_data,4,0)","v":"2099-01-01"}]
["NAME :  ",{"$f":"VLOOKUP(I3013,Student_data,6,0)","v":"KARNA"},null,"MEDUIM : ",{"$f":"IF('School Info'!$E$7=\"\",\"\",'School Info'!$E$7)","v":"HINDI"},"GENDER :",{"$f":"VLOOKUP(I3013,Student_data,5,0)","v":"MALE"}]
["FATHER :  ",{"$f":"VLOOKUP(I3013,Student_data,7,0)","v":"BBB"},null,"SECTION : ",{"$f":"IF('School Info'!$F$8=\"\",\"\",'School Info'!$F$8)","v":"A"},"S.No. : ",{"$f":"VLOOKUP(I3013,Student_data,2,0)","v":0}]
["MOTHER :  ",{"$f":"VLOOKUP(I3013,Student_data,8,0)","v":"SSDDF"},null,"School DISE Code :",null,{"$f":"IF('School Info'!$B$5=\"\",\"\",'School Info'!$B$5)","v":123456890}]
[]
["SUBJECT","DATE","DAY","TIME "]
[{"$f":"IF('School Info'!$J$5=\"\",\"\",'School Info'!$J$5)","v":"HINDI"},{"$f":"IF('School Info'!$K$5=\"\",\"\",'School Info'!$K$5)","v":"2001-01-01"},{"$f":"IF('School Info'!$L$5=\"\",\"\",'School Info'!$L$5)","v":"MONDAY"},{"$f":"IF('School Info'!$M$5=\"\",\"\",'School Info'!$M$5)","v":"10:00AM TO 12:00PM"}]
[{"$f":"IF('School Info'!$J$6=\"\",\"\",'School Info'!$J$6)","v":"ENGLISH"},{"$f":"IF('School Info'!$K$6=\"\",\"\",'School Info'!$K$6)","v":"2001-01-01"},{"$f":"IF('School Info'!$L$6=\"\",\"\",'School Info'!$L$6)","v":"TUESDAY"},{"$f":"IF('School Info'!$M$6=\"\",\"\",'School Info'!$M$6)","v":"10:00AM TO 12:00PM"}]
[{"$f":"IF('School Info'!$J$7=\"\",\"\",'School Info'!$J$7)","v":"SCIENCE"},{"$f":"IF('School Info'!$K$7=\"\",\"\",'School Info'!$K$7)","v":"2001-01-01"},{"$f":"IF('School Info'!$L$7=\"\",\"\",'School Info'!$L$7)","v":"WEDNESDAY"},{"$f":"IF('School Info'!$M$7=\"\",\"\",'School Info'!$M$7)","v":"10:00AM TO 12:00PM"}]
[{"$f":"IF('School Info'!$J$8=\"\",\"\",'School Info'!$J$8)","v":"MATH"},{"$f":"IF('School Info'!$K$8=\"\",\"\",'School Info'!$K$8)","v":"2001-01-01"},{"$f":"IF('School Info'!$L$8=\"\",\"\",'School Info'!$L$8)","v":"THURSDAY"},{"$f":"IF('School Info'!$M$8=\"\",\"\",'School Info'!$M$8)","v":"10:00AM TO 12:00PM"}]
[{"$f":"IF('School Info'!$J$9=\"\",\"\",'School Info'!$J$9)","v":"SOCIAL SCIENCE"},{"$f":"IF('School Info'!$K$9=\"\",\"\",'School Info'!$K$9)","v":"2001-01-01"},{"$f":"IF('School Info'!$L$9=\"\",\"\",'School Info'!$L$9)","v":"FRIDAY"},{"$f":"IF('School Info'!$M$9=\"\",\"\",'School Info'!$M$9)","v":"10:00AM TO 12:00PM"}]
[{"$f":"IF('School Info'!$J$10=\"\",\"\",'School Info'!$J$10)","v":"SANSKRIT"},{"$f":"IF('School Info'!$K$10=\"\",\"\",'School Info'!$K$10)","v":"2001-01-01"},{"$f":"IF('School Info'!$L$10=\"\",\"\",'School Info'!$L$10)","v":"SATURDAY"},{"$f":"IF('School Info'!$M$10=\"\",\"\",'School Info'!$M$10)","v":"10:00AM TO 12:00PM"}]
[]
["Note :"]
["1. परीक्षार्थी अपना प्रवेश पत्र रोजाना साथ लेकर आये | (Candidates should bring their admit card with them daily.)"]
["2. परीक्षार्थी परीक्षा केंद्र पर आधा घंटे पहले पहुचें | (Candidates should reach the examination center half an hour before.)"]
["3. परीक्षार्थी परीक्षा हेतु आवश्यक सामग्री साथ लेकर आवें | (Candidates should bring with them the necessary materials for the examination.)"]
[]
[]
[]
[]
[]
["Sig. Exam Incharge",null,null,null,null,null,"Sig. Principal "]
[".------------------------------------------------------- Cut Here------------------------------------------------------"]
[{"$f":"IF('School Info'!$B$4=\"\",\"\",'School Info'!$B$4)","v":"Mahatma Gandhi Government School Bar"}]
[null,null,"School Aff. Code :",null,{"$f":"IF('School Info'!$F$5=\"\",\"\",'School Info'!$F$5)","v":123456}]
[null,null,{"$f":"IF('School Info'!$H$5=\"\",\"\",'School Info'!$H$5)","v":"HALF YEARLY EXAM"},null,{"$f":"IF('School Info'!$H$7=\"\",\"\",'School Info'!$H$7)","v":"2025-26"}]
[null,null,"ADMIT CARD",null,null,null,null,null,{"$f":"I3013+1","v":100}]
[]
["ROLL NO :  ",{"$f":"VLOOKUP(I3042,Student_data,3,0)","v":200},null,"CLASS : ",{"$f":"IF('School Info'!$B$7=\"\",\"\",'School Info'!$B$7)","v":6},"DOB :",{"$f":"VLOOKUP(I3042,Student_data,4,0)","v":"2100-01-01"}]
["NAME :  ",{"$f":"VLOOKUP(I3042,Student_data,6,0)","v":"RAJA  "},null,"MEDUIM : ",{"$f":"IF('School Info'!$E$7=\"\",\"\",'School Info'!$E$7)","v":"HINDI"},"GENDER :",{"$f":"VLOOKUP(I3042,Student_data,5,0)","v":"MALE"}]
["FATHER :  ",{"$f":"VLOOKUP(I3042,Student_data,7,0)","v":"DFD"},null,"SECTION : ",{"$f":"IF('School Info'!$F$8=\"\",\"\",'School Info'!$F$8)","v":"A"},"S.No. : ",{"$f":"VLOOKUP(I3042,Student_data,2,0)","v":0}]
["MOTHER :  ",{"$f":"VLOOKUP(I3042,Student_data,8,0)","v":"GAG"},null,"School DISE Code :",null,{"$f":"IF('School Info'!$B$5=\"\",\"\",'School Info'!$B$5)","v":123456890}]
[]
["SUBJECT","DATE","DAY","TIME "]
[{"$f":"IF('School Info'!$J$5=\"\",\"\",'School Info'!$J$5)","v":"HINDI"},{"$f":"IF('School Info'!$K$5=\"\",\"\",'School Info'!$K$5)","v":"2001-01-01"},{"$f":"IF('School Info'!$L$5=\"\",\"\",'School Info'!$L$5)","v":"MONDAY"},{"$f":"IF('School Info'!$M$5=\"\",\"\",'School Info'!$M$5)","v":"10:00AM TO 12:00PM"}]
[{"$f":"IF('School Info'!$J$6=\"\",\"\",'School Info'!$J$6)","v":"ENGLISH"},{"$f":"IF('School Info'!$K$6=\"\",\"\",'School Info'!$K$6)","v":"2001-01-01"},{"$f":"IF('School Info'!$L$6=\"\",\"\",'School Info'!$L$6)","v":"TUESDAY"},{"$f":"IF('School Info'!$M$6=\"\",\"\",'School Info'!$M$6)","v":"10:00AM TO 12:00PM"}]
[{"$f":"IF('School Info'!$J$7=\"\",\"\",'School Info'!$J$7)","v":"SCIENCE"},{"$f":"IF('School Info'!$K$7=\"\",\"\",'School Info'!$K$7)","v":"2001-01-01"},{"$f":"IF('School Info'!$L$7=\"\",\"\",'School Info'!$L$7)","v":"WEDNESDAY"},{"$f":"IF('School Info'!$M$7=\"\",\"\",'School Info'!$M$7)","v":"10:00AM TO 12:00PM"}]
[{"$f":"IF('School Info'!$J$8=\"\",\"\",'School Info'!$J$8)","v":"MATH"},{"$f":"IF('School Info'!$K$8=\"\",\"\",'School Info'!$K$8)","v":"2001-01-01"},{"$f":"IF('School Info'!$L$8=\"\",\"\",'School Info'!$L$8)","v":"THURSDAY"},{"$f":"IF('School Info'!$M$8=\"\",\"\",'School Info'!$M$8)","v":"10:00AM TO 12:00PM"}]
[{"$f":"IF('School Info'!$J$9=\"\",\"\",'School Info'!$J$9)","v":"SOCIAL SCIENCE"},{"$f":"IF('School Info'!$K$9=\"\",\"\",'School Info'!$K$9)","v":"2001-01-01"},{"$f":"IF('School Info'!$L$9=\"\",\"\",'School Info'!$L$9)","v":"FRIDAY"},{"$f":"IF('School Info'!$M$9=\"\",\"\",'School Info'!$M$9)","v":"10:00AM TO 12:00PM"}]
[{"$f":"IF('School Info'!$J$10=\"\",\"\",'School Info'!$J$10)","v":"SANSKRIT"},{"$f":"IF('School Info'!$K$10=\"\",\"\",'School Info'!$K$10)","v":"2001-01-01"},{"$f":"IF('School Info'!$L$10=\"\",\"\",'School Info'!$L$10)","v":"SATURDAY"},{"$f":"IF('School Info'!$M$10=\"\",\"\",'School Info'!$M$10)","v":"10:00AM TO 12:00PM"}]
[]
["Note :"]
["1. परीक्षार्थी अपना प्रवेश पत्र रोजाना साथ लेकर आये | (Candidates should bring their admit card with them daily.)"]
["2. परीक्षार्थी परीक्षा केंद्र पर आधा घंटे पहले पहुचें | (Candidates should reach the examination center half an hour before.)"]
["3. परीक्षार्थी परीक्षा हेतु आवश्यक सामग्री साथ लेकर आवें | (Candidates should bring with them the necessary materials for the examination.)"]
[]
[]
[]
[]
[]
["Sig. Exam Incharge",null,null,null,null,null,"Sig. Principal "]

{"sheet":"Single Admit Card","index":3,"n_rows":65,"n_cols":14,"rows_kept":65,"cut":false,"hidden":false,"merged":[[32,0,32,7],[59,0,59,7],[60,0,63,1],[60,2,63,5],[60,6,63,7],[41,1,41,2],[41,3,41,4],[41,5,41,7],[43,3,43,4],[44,3,44,4],[45,3,45,4],[46,3,46,4],[47,3,47,4],[48,3,48,4],[49,3,49,4],[40,1,40,2],[40,6,40,7],[64,0,64,1],[64,2,64,5],[64,6,64,7],[54,0,54,7],[55,0,55,7],[56,0,56,7],[57,0,57,7],[58,0,58,7],[50,3,50,4],[53,3,53,4],[51,3,51,4],[52,3,52,4],[8,1,8,2],[8,3,8,4],[8,5,8,7],[31,6,31,7],[31,0,31,1],[31,2,31,5],[24,0,24,7],[12,3,12,4],[13,3,13,4],[14,3,14,4],[17,3,17,4],[20,3,20,4],[10,3,10,4],[11,3,11,4],[18,3,18,4],[19,3,19,4],[2,9,2,14],[27,0,30,1],[27,2,30,5],[27,6,30,7],[25,0,25,7],[26,0,26,7],[3,9,5,10],[3,11,5,12],[15,3,15,4],[16,3,16,4],[3,13,5,14],[7,11,22,12],[7,13,22,14],[21,0,21,7],[22,0,22,7],[23,0,23,7],[6,1,6,2],[6,6,6,7],[7,1,7,2],[0,0,0,7],[1,2,1,3],[1,6,1,7],[2,2,2,3],[2,6,2,7],[3,2,3,4],[7,6,7,7],[5,6,5,7],[36,2,36,4],[38,6,38,7],[39,1,39,2],[39,6,39,7],[33,0,33,7],[34,2,34,3],[34,6,34,7],[35,2,35,3],[35,6,35,7]]}
[{"$f":"IF('School Info'!$B$4=\"\",\"\",'School Info'!$B$4)","v":"Mahatma Gandhi Government School Bar"}]
[null,null,"School Aff. Code :",null,{"$f":"IF('School Info'!$F$5=\"\",\"\",'School Info'!$F$5)","v":123456}]
[null,null,{"$f":"IF('School Info'!$H$5=\"\",\"\",'School Info'!$H$5)","v":"HALF YEARLY EXAM"},null,{"$f":"IF('School Info'!$H$7=\"\",\"\",'School Info'!$H$7)","v":"2025-26"},null,null,null,null,"Print Single Admit Card"]
[null,null,"ADMIT CARD",null,null,null,null,null,null,"Type Serial No \"Data Sheet\"",null,1]
[]
["ROLL NO :  ",{"$f":"VLOOKUP(L4,Student_data,3,0)","v":101},null,"CLASS : ",{"$f":"IF('School Info'!$B$7=\"\",\"\",'School Info'!$B$7)","v":6},"DOB :",{"$f":"VLOOKUP(L4,Student_data,4,0)","v":"2001-01-01"}]
["NAME :  ",{"$f":"VLOOKUP(L4,Student_data,6,0)","v":"RAJ GURUJI"},null,"MEDUIM : ",{"$f":"IF('School Info'!$E$7=\"\",\"\",'School Info'!$E$7)","v":"HINDI"},"GENDER :",{"$f":"VLOOKUP(L4,Student_data,5,0)","v":"MALE"}]
["FATHER :  ",{"$f":"VLOOKUP(L4,Student_data,7,0)","v":"RAJ"},null,"SECTION : ",{"$f":"IF('School Info'!$F$8=\"\",\"\",'School Info'!$F$8)","v":"A"},"S.No. : ",{"$f":"VLOOKUP(L4,Student_data,2,0)","v":755},null,null,null,null,"TYPE STUDENT Serial NO MAIN DATA  SHEET",null,"CHANGE SERIAL NO UP (↑↓)DOWN ARROW"]
["MOTHER :  ",{"$f":"VLOOKUP(L4,Student_data,8,0)","v":"DEVI"},null,"School DISE Code :",null,{"$f":"IF('School Info'!$B$5=\"\",\"\",'School Info'!$B$5)","v":123456890}]
[]
["SUBJECT","DATE","DAY","TIME ",null,{"$f":"IF('School Info'!N4=\"\",\"\",'School Info'!N4)","v":""},{"$f":"IF('School Info'!O4=\"\",\"\",'School Info'!O4)","v":""}]
[{"$f":"IF('School Info'!$J$5=\"\",\"\",'School Info'!$J$5)","v":"HINDI"},{"$f":"IF('School Info'!$K$5=\"\",\"\",'School Info'!$K$5)","v":"2001-01-01"},{"$f":"IF('School Info'!$L$5=\"\",\"\",'School Info'!$L$5)","v":"MONDAY"},{"$f":"IF('School Info'!$M$5=\"\",\"\",'School Info'!$M$5)","v":"10:00AM TO 12:00PM"},null,{"$f":"IF('School Info'!N5=\"\",\"\",'School Info'!N5)","v":""},{"$f":"IF('School Info'!O5=\"\",\"\",'School Info'!O5)","v":""}]
[{"$f":"IF('School Info'!$J$6=\"\",\"\",'School Info'!$J$6)","v":"ENGLISH"},{"$f":"IF('School Info'!$K$6=\"\",\"\",'School Info'!$K$6)","v":"2001-01-01"},{"$f":"IF('School Info'!$L$6=\"\",\"\",'School Info'!$L$6)","v":"TUESDAY"},{"$f":"IF('School Info'!$M$6=\"\",\"\",'School Info'!$M$6)","v":"10:00AM TO 12:00PM"},null,{"$f":"IF('School Info'!N6=\"\",\"\",'School Info'!N6)","v":""},{"$f":"IF('School Info'!O6=\"\",\"\",'School Info'!O6)","v":""}]
[{"$f":"IF('School Info'!$J$7=\"\",\"\",'School Info'!$J$7)","v":"SCIENCE"},{"$f":"IF('School Info'!$K$7=\"\",\"\",'School Info'!$K$7)","v":"2001-01-01"},{"$f":"IF('School Info'!$L$7=\"\",\"\",'School Info'!$L$7)","v":"WEDNESDAY"},{"$f":"IF('School Info'!$M$7=\"\",\"\",'School Info'!$M$7)","v":"10:00AM TO 12:00PM"},null,{"$f":"IF('School Info'!N7=\"\",\"\",'School Info'!N7)","v":""},{"$f":"IF('School Info'!O7=\"\",\"\",'School Info'!O7)","v":""}]
[{"$f":"IF('School Info'!$J$8=\"\",\"\",'School Info'!$J$8)","v":"MATH"},{"$f":"IF('School Info'!$K$8=\"\",\"\",'School Info'!$K$8)","v":"2001-01-01"},{"$f":"IF('School Info'!$L$8=\"\",\"\",'School Info'!$L$8)","v":"THURSDAY"},{"$f":"IF('School Info'!$M$8=\"\",\"\",'School Info'!$M$8)","v":"10:00AM TO 12:00PM"},null,{"$f":"IF('School Info'!N8=\"\",\"\",'School Info'!N8)","v":""},{"$f":"IF('School Info'!O8=\"\",\"\",'School Info'!O8)","v":""}]
[{"$f":"IF('School Info'!$J$9=\"\",\"\",'School Info'!$J$9)","v":"SOCIAL SCIENCE"},{"$f":"IF('School Info'!$K$9=\"\",\"\",'School Info'!$K$9)","v":"2001-01-01"},{"$f":"IF('School Info'!$L$9=\"\",\"\",'School Info'!$L$9)","v":"FRIDAY"},{"$f":"IF('School Info'!$M$9=\"\",\"\",'School Info'!$M$9)","v":"10:00AM TO 12:00PM"},null,{"$f":"IF('School Info'!N9=\"\",\"\",'School Info'!N9)","v":""},{"$f":"IF('School Info'!O9=\"\",\"\",'School Info'!O9)","v":""}]
[{"$f":"IF('School Info'!$J$10=\"\",\"\",'School Info'!$J$10)","v":"SANSKRIT"},{"$f":"IF('School Info'!$K$10=\"\",\"\",'School Info'!$K$10)","v":"2001-01-01"},{"$f":"IF('School Info'!$L$10=\"\",\"\",'School Info'!$L$10)","v":"SATURDAY"},{"$f":"IF('School Info'!$M$10=\"\",\"\",'School Info'!$M$10)","v":"10:00AM TO 12:00PM"},null,{"$f":"IF('School Info'!N10=\"\",\"\",'School Info'!N10)","v":""},{"$f":"IF('School Info'!O10=\"\",\"\",'School Info'!O10)","v":""}]
[{"$f":"IF('School Info'!$J$11=\"\",\"\",'School Info'!$J$11)","v":""},{"$f":"IF('School Info'!$K$11=\"\",\"\",'School Info'!$K$11)","v":"2001-01-02"},{"$f":"IF('School Info'!$L$11=\"\",\"\",'School Info'!$L$11)","v":"SUNDAY"},{"$f":"IF('School Info'!$M$11=\"\",\"\",'School Info'!$M$11)","v":"10:00AM TO 12:00PM"}]
[{"$f":"IF('School Info'!$J$12=\"\",\"\",'School Info'!$J$12)","v":""},{"$f":"IF('School Info'!$K$12=\"\",\"\",'School Info'!$K$12)","v":"2001-01-03"},{"$f":"IF('School Info'!$L$12=\"\",\"\",'School Info'!$L$12)","v":"MONDAY"},{"$f":"IF('School Info'!$M$12=\"\",\"\",'School Info'!$M$12)","v":"10:00AM TO 12:00PM"}]
[{"$f":"IF('School Info'!$J$13=\"\",\"\",'School Info'!$J$13)","v":""},{"$f":"IF('School Info'!$K$13=\"\",\"\",'School Info'!$K$13)","v":"2001-01-04"},{"$f":"IF('School Info'!$L$13=\"\",\"\",'School Info'!$L$13)","v":"TUESDAY"},{"$f":"IF('School Info'!$M$13=\"\",\"\",'School Info'!$M$13)","v":"10:00AM TO 12:00PM"}]
[{"$f":"IF('School Info'!$J$14=\"\",\"\",'School Info'!$J$14)","v":""},{"$f":"IF('School Info'!$K$14=\"\",\"\",'School Info'!$K$14)","v":""},{"$f":"IF('School Info'!$L$14=\"\",\"\",'School Info'!$L$14)","v":""},{"$f":"IF('School Info'!$M$14=\"\",\"\",'School Info'!$M$14)","v":""}]
[]
["Note :"]
["1. परीक्षार्थी अपना प्रवेश पत्र रोजाना साथ लेकर आये | (Candidates should bring their admit card with them daily.)"]
["2. परीक्षार्थी परीक्षा केंद्र पर आधा घंटे पहले पहुचें | (Candidates should reach the examination center half an hour before.)"]
["3. परीक्षार्थी परीक्षा हेतु आवश्यक सामग्री साथ लेकर आवें | (Candidates should bring with them the necessary materials for the examination.)"]
[]
[]
[]
[]
[]
["   Sig. Exam Incharge                                                                                                             ",null,null,null,null,null,"  Sig. Principal "]
[".------------------------------------------------------- Cut Here------------------------------------------------------"]
[{"$f":"IF('School Info'!$B$4=\"\",\"\",'School Info'!$B$4)","v":"Mahatma Gandhi Government School Bar"}]
[null,null,"School Aff. Code :",null,{"$f":"IF('School Info'!$F$5=\"\",\"\",'School Info'!$F$5)","v":123456}]
[null,null,{"$f":"IF('School Info'!$H$5=\"\",\"\",'School Info'!$H$5)","v":"HALF YEARLY EXAM"},null,{"$f":"IF('School Info'!$H$7=\"\",\"\",'School Info'!$H$7)","v":"2025-26"}]
[null,null,"ADMIT CARD",null,null,null,null,null,null,null,null,{"$f":"L4+1","v":2}]
[]
["ROLL NO :  ",{"$f":"VLOOKUP(L37,Student_data,3,0)","v":102},null,"CLASS : ",{"$f":"IF('School Info'!$B$7=\"\",\"\",'School Info'!$B$7)","v":6},"DOB :",{"$f":"VLOOKUP(L37,Student_data,4,0)","v":"2002-01-01"}]
["NAME :  ",{"$f":"VLOOKUP(L37,Student_data,6,0)","v":"lala"},null,"MEDUIM : ",{"$f":"IF('School Info'!$E$7=\"\",\"\",'School Info'!$E$7)","v":"HINDI"},"GENDER :",{"$f":"VLOOKUP(L37,Student_data,5,0)","v":"FEMALE"}]
["FATHER :  ",{"$f":"VLOOKUP(L37,Student_data,7,0)","v":"RAAA"},null,"SECTION : ",{"$f":"IF('School Info'!$F$8=\"\",\"\",'School Info'!$F$8)","v":"A"},"S.No. : ",{"$f":"VLOOKUP(L37,Student_data,2,0)","v":852}]
["MOTHER :  ",{"$f":"VLOOKUP(L37,Student_data,8,0)","v":"DDD"},null,"School DISE Code :",null,{"$f":"IF('School Info'!$B$5=\"\",\"\",'School Info'!$B$5)","v":123456890}]
[]
["SUBJECT","DATE","DAY","TIME ",null,{"$f":"IF('School Info'!N4=\"\",\"\",'School Info'!N4)","v":""},{"$f":"IF('School Info'!O4=\"\",\"\",'School Info'!O4)","v":""}]
[{"$f":"IF('School Info'!$J$5=\"\",\"\",'School Info'!$J$5)","v":"HINDI"},{"$f":"IF('School Info'!$K$5=\"\",\"\",'School Info'!$K$5)","v":"2001-01-01"},{"$f":"IF('School Info'!$L$5=\"\",\"\",'School Info'!$L$5)","v":"MONDAY"},{"$f":"IF('School Info'!$M$5=\"\",\"\",'School Info'!$M$5)","v":"10:00AM TO 12:00PM"},null,{"$f":"IF('School Info'!N5=\"\",\"\",'School Info'!N5)","v":""},{"$f":"IF('School Info'!O5=\"\",\"\",'School Info'!O5)","v":""}]
[{"$f":"IF('School Info'!$J$6=\"\",\"\",'School Info'!$J$6)","v":"ENGLISH"},{"$f":"IF('School Info'!$K$6=\"\",\"\",'School Info'!$K$6)","v":"2001-01-01"},{"$f":"IF('School Info'!$L$6=\"\",\"\",'School Info'!$L$6)","v":"TUESDAY"},{"$f":"IF('School Info'!$M$6=\"\",\"\",'School Info'!$M$6)","v":"10:00AM TO 12:00PM"},null,{"$f":"IF('School Info'!N6=\"\",\"\",'School Info'!N6)","v":""},{"$f":"IF('School Info'!O6=\"\",\"\",'School Info'!O6)","v":""}]
[{"$f":"IF('School Info'!$J$7=\"\",\"\",'School Info'!$J$7)","v":"SCIENCE"},{"$f":"IF('School Info'!$K$7=\"\",\"\",'School Info'!$K$7)","v":"2001-01-01"},{"$f":"IF('School Info'!$L$7=\"\",\"\",'School Info'!$L$7)","v":"WEDNESDAY"},{"$f":"IF('School Info'!$M$7=\"\",\"\",'School Info'!$M$7)","v":"10:00AM TO 12:00PM"},null,{"$f":"IF('School Info'!N7=\"\",\"\",'School Info'!N7)","v":""},{"$f":"IF('School Info'!O7=\"\",\"\",'School Info'!O7)","v":""}]
[{"$f":"IF('School Info'!$J$8=\"\",\"\",'School Info'!$J$8)","v":"MATH"},{"$f":"IF('School Info'!$K$8=\"\",\"\",'School Info'!$K$8)","v":"2001-01-01"},{"$f":"IF('School Info'!$L$8=\"\",\"\",'School Info'!$L$8)","v":"THURSDAY"},{"$f":"IF('School Info'!$M$8=\"\",\"\",'School Info'!$M$8)","v":"10:00AM TO 12:00PM"},null,{"$f":"IF('School Info'!N8=\"\",\"\",'School Info'!N8)","v":""},{"$f":"IF('School Info'!O8=\"\",\"\",'School Info'!O8)","v":""}]
[{"$f":"IF('School Info'!$J$9=\"\",\"\",'School Info'!$J$9)","v":"SOCIAL SCIENCE"},{"$f":"IF('School Info'!$K$9=\"\",\"\",'School Info'!$K$9)","v":"2001-01-01"},{"$f":"IF('School Info'!$L$9=\"\",\"\",'School Info'!$L$9)","v":"FRIDAY"},{"$f":"IF('School Info'!$M$9=\"\",\"\",'School Info'!$M$9)","v":"10:00AM TO 12:00PM"},null,{"$f":"IF('School Info'!N9=\"\",\"\",'School Info'!N9)","v":""},{"$f":"IF('School Info'!O9=\"\",\"\",'School Info'!O9)","v":""}]
[{"$f":"IF('School Info'!$J$10=\"\",\"\",'School Info'!$J$10)","v":"SANSKRIT"},{"$f":"IF('School Info'!$K$10=\"\",\"\",'School Info'!$K$10)","v":"2001-01-01"},{"$f":"IF('School Info'!$L$10=\"\",\"\",'School Info'!$L$10)","v":"SATURDAY"},{"$f":"IF('School Info'!$M$10=\"\",\"\",'School Info'!$M$10)","v":"10:00AM TO 12:00PM"},null,{"$f":"IF('School Info'!N10=\"\",\"\",'School Info'!N10)","v":""},{"$f":"IF('School Info'!O10=\"\",\"\",'School Info'!O10)","v":""}]
[{"$f":"IF('School Info'!$J$11=\"\",\"\",'School Info'!$J$11)","v":""},{"$f":"IF('School Info'!$K$11=\"\",\"\",'School Info'!$K$11)","v":"2001-01-02"},{"$f":"IF('School Info'!$L$11=\"\",\"\",'School Info'!$L$11)","v":"SUNDAY"},{"$f":"IF('School Info'!$M$11=\"\",\"\",'School Info'!$M$11)","v":"10:00AM TO 12:00PM"}]
[{"$f":"IF('School Info'!$J$12=\"\",\"\",'School Info'!$J$12)","v":""},{"$f":"IF('School Info'!$K$12=\"\",\"\",'School Info'!$K$12)","v":"2001-01-03"},{"$f":"IF('School Info'!$L$12=\"\",\"\",'School Info'!$L$12)","v":"MONDAY"},{"$f":"IF('School Info'!$M$12=\"\",\"\",'School Info'!$M$12)","v":"10:00AM TO 12:00PM"}]
[{"$f":"IF('School Info'!$J$13=\"\",\"\",'School Info'!$J$13)","v":""},{"$f":"IF('School Info'!$K$13=\"\",\"\",'School Info'!$K$13)","v":"2001-01-04"},{"$f":"IF('School Info'!$L$13=\"\",\"\",'School Info'!$L$13)","v":"TUESDAY"},{"$f":"IF('School Info'!$M$13=\"\",\"\",'School Info'!$M$13)","v":"10:00AM TO 12:00PM"}]
[{"$f":"IF('School Info'!$J$14=\"\",\"\",'School Info'!$J$14)","v":""},{"$f":"IF('School Info'!$K$14=\"\",\"\",'School Info'!$K$14)","v":""},{"$f":"IF('School Info'!$L$14=\"\",\"\",'School Info'!$L$14)","v":""},{"$f":"IF('School Info'!$M$14=\"\",\"\",'School Info'!$M$14)","v":""}]
[]
["Note :"]
["1. परीक्षार्थी अपना प्रवेश पत्र रोजाना साथ लेकर आये | (Candidates should bring their admit card with them daily.)"]
["2. परीक्षार्थी परीक्षा केंद्र पर आधा घंटे पहले पहुचें | (Candidates should reach the examination center half an hour before.)"]
["3. परीक्षार्थी परीक्षा हेतु आवश्यक सामग्री साथ लेकर आवें | (Candidates should bring with them the necessary materials for the examination.)"]
[]
[]
[]
[]
[]
["   Sig. Exam Incharge                                                                                                             ",null,null,null,null,null,"  Sig. Principal "]

{"sheet":"Admit Card With Photo","index":4,"n_rows":65,"n_cols":14,"rows_kept":65,"cut":false,"hidden":false,"merged":[[20,3,20,4],[50,3,50,4],[51,3,51,4],[52,3,52,4],[53,3,53,4],[25,0,25,7],[26,0,26,7],[24,0,24,7],[31,6,31,7],[31,2,31,5],[35,2,35,3],[35,6,35,7],[36,2,36,4],[38,6,38,7],[39,1,39,2],[39,6,39,7],[2,9,3,14],[4,9,6,10],[4,11,6,12],[4,13,6,14],[8,11,22,12],[8,13,22,14],[7,6,7,7],[5,6,5,7],[6,6,6,7],[8,3,8,4],[8,5,8,7],[17,3,17,4],[18,3,18,4],[19,3,19,4],[0,0,0,7],[1,6,1,7],[2,6,2,7],[11,3,11,4],[12,3,12,4],[6,1,6,2],[7,1,7,2],[8,1,8,2],[10,3,10,4],[10,5,16,7],[9,0,9,4],[9,5,9,7],[16,3,16,4],[1,2,1,3],[2,2,2,3],[3,2,3,4],[33,0,33,7],[34,2,34,3],[34,6,34,7],[13,3,13,4],[14,3,14,4],[15,3,15,4],[32,0,32,7],[27,0,30,1],[27,2,30,5],[27,6,30,7],[21,0,21,7],[22,0,22,7],[23,0,23,7],[40,1,40,2],[41,1,41,2],[41,3,41,4],[41,5,41,7],[42,0,42,4],[42,5,42,7],[40,6,40,7],[43,3,43,4],[43,5,49,7],[44,3,44,4],[45,3,45,4],[46,3,46,4],[47,3,47,4],[48,3,48,4],[49,3,49,4],[54,0,54,7],[55,0,55,7],[56,0,56,7],[57,0,57,7],[58,0,58,7],[59,0,59,7],[60,0,63,1],[60,2,63,5],[60,6,63,7],[64,2,64,5],[64,6,64,7]]}
[{"$f":"IF('School Info'!$B$4=\"\",\"\",'School Info'!$B$4)","v":"Mahatma Gandhi Government School Bar"}]
[null,null,"School Aff. Code :",null,{"$f":"IF('School Info'!$F$5=\"\",\"\",'School Info'!$F$5)","v":123456}]
[null,null,{"$f":"IF('School Info'!$H$5=\"\",\"\",'School Info'!$H$5)","v":"HALF YEARLY EXAM"},null,{"$f":"IF('School Info'!$H$7=\"\",\"\",'School Info'!$H$7)","v":"2025-26"},null,null,null,null,"Print Single Admit Card"]
[null,null,"ADMIT CARD"]
[null,null,null,null,null,null,null,null,null,"Type Serial No \"Data Sheet\"",null,3]
["ROLL NO :  ",{"$f":"VLOOKUP(L5,Student_data,3,0)","v":103},null,"CLASS : ",{"$f":"IF('School Info'!$B$7=\"\",\"\",'School Info'!$B$7)","v":6},"DOB :",{"$f":"VLOOKUP(L5,Student_data,4,0)","v":"2003-01-01"}]
["NAME :  ",{"$f":"VLOOKUP(L5,Student_data,6,0)","v":"SONU"},null,"MEDUIM : ",{"$f":"IF('School Info'!$E$7=\"\",\"\",'School Info'!$E$7)","v":"HINDI"},"GENDER :",{"$f":"VLOOKUP(L5,Student_data,5,0)","v":"FEMALE"}]
["FATHER :  ",{"$f":"VLOOKUP(L5,Student_data,7,0)","v":"AAA"},null,"SECTION : ",{"$f":"IF('School Info'!$F$8=\"\",\"\",'School Info'!$F$8)","v":"A"},"S.No. : ",{"$f":"VLOOKUP(L5,Student_data,2,0)","v":901}]
["MOTHER :  ",{"$f":"VLOOKUP(L5,Student_data,8,0)","v":"DDS"},null,"School DISE Code :",null,{"$f":"IF('School Info'!$B$5=\"\",\"\",'School Info'!$B$5)","v":123456890},null,null,null,null,null,"TYPE STUDENT Serial No MAIN DATA  SHEET",null,"CHANGE SERIAL NO UP (↑↓)DOWN ARROW"]
[null,null,null,null,null,"Student Photo"]
["SUBJECT","DATE","DAY","TIME "]
[{"$f":"IF('School Info'!$J$5=\"\",\"\",'School Info'!$J$5)","v":"HINDI"},{"$f":"IF('School Info'!$K$5=\"\",\"\",'School Info'!$K$5)","v":"2001-01-01"},{"$f":"IF('School Info'!$L$5=\"\",\"\",'School Info'!$L$5)","v":"MONDAY"},{"$f":"IF('School Info'!$M$5=\"\",\"\",'School Info'!$M$5)","v":"10:00AM TO 12:00PM"}]
[{"$f":"IF('School Info'!$J$6=\"\",\"\",'School Info'!$J$6)","v":"ENGLISH"},{"$f":"IF('School Info'!$K$6=\"\",\"\",'School Info'!$K$6)","v":"2001-01-01"},{"$f":"IF('School Info'!$L$6=\"\",\"\",'School Info'!$L$6)","v":"TUESDAY"},{"$f":"IF('School Info'!$M$6=\"\",\"\",'School Info'!$M$6)","v":"10:00AM TO 12:00PM"}]
[{"$f":"IF('School Info'!$J$7=\"\",\"\",'School Info'!$J$7)","v":"SCIENCE"},{"$f":"IF('School Info'!$K$7=\"\",\"\",'School Info'!$K$7)","v":"2001-01-01"},{"$f":"IF('School Info'!$L$7=\"\",\"\",'School Info'!$L$7)","v":"WEDNESDAY"},{"$f":"IF('School Info'!$M$7=\"\",\"\",'School Info'!$M$7)","v":"10:00AM TO 12:00PM"}]
[{"$f":"IF('School Info'!$J$8=\"\",\"\",'School Info'!$J$8)","v":"MATH"},{"$f":"IF('School Info'!$K$8=\"\",\"\",'School Info'!$K$8)","v":"2001-01-01"},{"$f":"IF('School Info'!$L$8=\"\",\"\",'School Info'!$L$8)","v":"THURSDAY"},{"$f":"IF('School Info'!$M$8=\"\",\"\",'School Info'!$M$8)","v":"10:00AM TO 12:00PM"}]
[{"$f":"IF('School Info'!$J$9=\"\",\"\",'School Info'!$J$9)","v":"SOCIAL SCIENCE"},{"$f":"IF('School Info'!$K$9=\"\",\"\",'School Info'!$K$9)","v":"2001-01-01"},{"$f":"IF('School Info'!$L$9=\"\",\"\",'School Info'!$L$9)","v":"FRIDAY"},{"$f":"IF('School Info'!$M$9=\"\",\"\",'School Info'!$M$9)","v":"10:00AM TO 12:00PM"}]
[{"$f":"IF('School Info'!$J$10=\"\",\"\",'School Info'!$J$10)","v":"SANSKRIT"},{"$f":"IF('School Info'!$K$10=\"\",\"\",'School Info'!$K$10)","v":"2001-01-01"},{"$f":"IF('School Info'!$L$10=\"\",\"\",'School Info'!$L$10)","v":"SATURDAY"},{"$f":"IF('School Info'!$M$10=\"\",\"\",'School Info'!$M$10)","v":"10:00AM TO 12:00PM"}]
[{"$f":"IF('School Info'!$J$11=\"\",\"\",'School Info'!$J$11)","v":""},{"$f":"IF('School Info'!$K$11=\"\",\"\",'School Info'!$K$11)","v":"2001-01-02"},{"$f":"IF('School Info'!$L$11=\"\",\"\",'School Info'!$L$11)","v":"SUNDAY"},{"$f":"IF('School Info'!$M$11=\"\",\"\",'School Info'!$M$11)","v":"10:00AM TO 12:00PM"}]
[{"$f":"IF('School Info'!$J$12=\"\",\"\",'School Info'!$J$12)","v":""},{"$f":"IF('School Info'!$K$12=\"\",\"\",'School Info'!$K$12)","v":"2001-01-03"},{"$f":"IF('School Info'!$L$12=\"\",\"\",'School Info'!$L$12)","v":"MONDAY"},{"$f":"IF('School Info'!$M$12=\"\",\"\",'School Info'!$M$12)","v":"10:00AM TO 12:00PM"}]
[{"$f":"IF('School Info'!$J$13=\"\",\"\",'School Info'!$J$13)","v":""},{"$f":"IF('School Info'!$K$13=\"\",\"\",'School Info'!$K$13)","v":"2001-01-04"},{"$f":"IF('School Info'!$L$13=\"\",\"\",'School Info'!$L$13)","v":"TUESDAY"},{"$f":"IF('School Info'!$M$13=\"\",\"\",'School Info'!$M$13)","v":"10:00AM TO 12:00PM"}]
[{"$f":"IF('School Info'!$J$14=\"\",\"\",'School Info'!$J$14)","v":""},{"$f":"IF('School Info'!$K$14=\"\",\"\",'School Info'!$K$14)","v":""},{"$f":"IF('School Info'!$L$14=\"\",\"\",'School Info'!$L$14)","v":""},{"$f":"IF('School Info'!$M$14=\"\",\"\",'School Info'!$M$14)","v":""}]
[]
["Note :"]
["1. परीक्षार्थी अपना प्रवेश पत्र रोजाना साथ लेकर आये | (Candidates should bring their admit card with them daily.)"]
["2. परीक्षार्थी परीक्षा केंद्र पर आधा घंटे पहले पहुचें | (Candidates should reach the examination center half an hour before.)"]
["3. परीक्षार्थी परीक्षा हेतु आवश्यक सामग्री साथ लेकर आवें | (Candidates should bring with them the necessary materials for the examination.)"]
[]
[]
[]
[]
[]
["   Sig. Exam Incharge      ",null,null,null,null,null,"Sig. Principal "]
[".------------------------------------------------------- Cut Here------------------------------------------------------"]
[{"$f":"IF('School Info'!$B$4=\"\",\"\",'School Info'!$B$4)","v":"Mahatma Gandhi Government School Bar"}]
[null,null,"School Aff. Code :",null,{"$f":"IF('School Info'!$F$5=\"\",\"\",'School Info'!$F$5)","v":123456}]
[null,null,{"$f":"IF('School Info'!$H$5=\"\",\"\",'School Info'!$H$5)","v":"HALF YEARLY EXAM"},null,{"$f":"IF('School Info'!$H$7=\"\",\"\",'School Info'!$H$7)","v":"2025-26"}]
[null,null,"ADMIT CARD",null,null,null,null,null,null,null,null,{"$f":"L5+1","v":4}]
[]
["ROLL NO :  ",{"$f":"VLOOKUP(L37,Student_data,3,0)","v":104},null,"CLASS : ",{"$f":"IF('School Info'!$B$7=\"\",\"\",'School Info'!$B$7)","v":6},"DOB :",{"$f":"VLOOKUP(L37,Student_data,4,0)","v":"2004-01-01"}]
["NAME :  ",{"$f":"VLOOKUP(L37,Student_data,6,0)","v":"KARNA"},null,"MEDUIM : ",{"$f":"IF('School Info'!$E$7=\"\",\"\",'School Info'!$E$7)","v":"HINDI"},"GENDER :",{"$f":"VLOOKUP(L37,Student_data,5,0)","v":"MALE"}]
["FATHER :  ",{"$f":"VLOOKUP(L37,Student_data,7,0)","v":"BBB"},null,"SECTION : ",{"$f":"IF('School Info'!$F$8=\"\",\"\",'School Info'!$F$8)","v":"A"},"S.No. : ",{"$f":"VLOOKUP(L37,Student_data,2,0)","v":222}]
["MOTHER :  ",{"$f":"VLOOKUP(L37,Student_data,8,0)","v":"SSDDF"},null,"School DISE Code :",null,{"$f":"IF('School Info'!$B$5=\"\",\"\",'School Info'!$B$5)","v":123456890}]
[null,null,null,null,null,"Student Photo"]
["SUBJECT","DATE","DAY","TIME "]
[{"$f":"IF('School Info'!$J$5=\"\",\"\",'School Info'!$J$5)","v":"HINDI"},{"$f":"IF('School Info'!$K$5=\"\",\"\",'School Info'!$K$5)","v":"2001-01-01"},{"$f":"IF('School Info'!$L$5=\"\",\"\",'School Info'!$L$5)","v":"MONDAY"},{"$f":"IF('School Info'!$M$5=\"\",\"\",'School Info'!$M$5)","v":"10:00AM TO 12:00PM"}]
[{"$f":"IF('School Info'!$J$6=\"\",\"\",'School Info'!$J$6)","v":"ENGLISH"},{"$f":"IF('School Info'!$K$6=\"\",\"\",'School Info'!$K$6)","v":"2001-01-01"},{"$f":"IF('School Info'!$L$6=\"\",\"\",'School Info'!$L$6)","v":"TUESDAY"},{"$f":"IF('School Info'!$M$6=\"\",\"\",'School Info'!$M$6)","v":"10:00AM TO 12:00PM"}]
[{"$f":"IF('School Info'!$J$7=\"\",\"\",'School Info'!$J$7)","v":"SCIENCE"},{"$f":"IF('School Info'!$K$7=\"\",\"\",'School Info'!$K$7)","v":"2001-01-01"},{"$f":"IF('School Info'!$L$7=\"\",\"\",'School Info'!$L$7)","v":"WEDNESDAY"},{"$f":"IF('School Info'!$M$7=\"\",\"\",'School Info'!$M$7)","v":"10:00AM TO 12:00PM"}]
[{"$f":"IF('School Info'!$J$8=\"\",\"\",'School Info'!$J$8)","v":"MATH"},{"$f":"IF('School Info'!$K$8=\"\",\"\",'School Info'!$K$8)","v":"2001-01-01"},{"$f":"IF('School Info'!$L$8=\"\",\"\",'School Info'!$L$8)","v":"THURSDAY"},{"$f":"IF('School Info'!$M$8=\"\",\"\",'School Info'!$M$8)","v":"10:00AM TO 12:00PM"}]
[{"$f":"IF('School Info'!$J$9=\"\",\"\",'School Info'!$J$9)","v":"SOCIAL SCIENCE"},{"$f":"IF('School Info'!$K$9=\"\",\"\",'School Info'!$K$9)","v":"2001-01-01"},{"$f":"IF('School Info'!$L$9=\"\",\"\",'School Info'!$L$9)","v":"FRIDAY"},{"$f":"IF('School Info'!$M$9=\"\",\"\",'School Info'!$M$9)","v":"10:00AM TO 12:00PM"}]
[{"$f":"IF('School Info'!$J$10=\"\",\"\",'School Info'!$J$10)","v":"SANSKRIT"},{"$f":"IF('School Info'!$K$10=\"\",\"\",'School Info'!$K$10)","v":"2001-01-01"},{"$f":"IF('School Info'!$L$10=\"\",\"\",'School Info'!$L$10)","v":"SATURDAY"},{"$f":"IF('School Info'!$M$10=\"\",\"\",'School Info'!$M$10)","v":"10:00AM TO 12:00PM"}]
[{"$f":"IF('School Info'!$J$11=\"\",\"\",'School Info'!$J$11)","v":""},{"$f":"IF('School Info'!$K$11=\"\",\"\",'School Info'!$K$11)","v":"2001-01-02"},{"$f":"IF('School Info'!$L$11=\"\",\"\",'School Info'!$L$11)","v":"SUNDAY"},{"$f":"IF('School Info'!$M$11=\"\",\"\",'School Info'!$M$11)","v":"10:00AM TO 12:00PM"}]
[{"$f":"IF('School Info'!$J$12=\"\",\"\",'School Info'!$J$12)","v":""},{"$f":"IF('School Info'!$K$12=\"\",\"\",'School Info'!$K$12)","v":"2001-01-03"},{"$f":"IF('School Info'!$L$12=\"\",\"\",'School Info'!$L$12)","v":"MONDAY"},{"$f":"IF('School Info'!$M$12=\"\",\"\",'School Info'!$M$12)","v":"10:00AM TO 12:00PM"}]
[{"$f":"IF('School Info'!$J$13=\"\",\"\",'School Info'!$J$13)","v":""},{"$f":"IF('School Info'!$K$13=\"\",\"\",'School Info'!$K$13)","v":"2001-01-04"},{"$f":"IF('School Info'!$L$13=\"\",\"\",'School Info'!$L$13)","v":"TUESDAY"},{"$f":"IF('School Info'!$M$13=\"\",\"\",'School Info'!$M$13)","v":"10:00AM TO 12:00PM"}]
[{"$f":"IF('School Info'!$J$14=\"\",\"\",'School Info'!$J$14)","v":""},{"$f":"IF('School Info'!$K$14=\"\",\"\",'School Info'!$K$14)","v":""},{"$f":"IF('School Info'!$L$14=\"\",\"\",'School Info'!$L$14)","v":""},{"$f":"IF('School Info'!$M$14=\"\",\"\",'School Info'!$M$14)","v":""}]
[]
["Note :"]
["1. परीक्षार्थी अपना प्रवेश पत्र रोजाना साथ लेकर आये | (Candidates should bring their admit card with them daily.)"]
["2. परीक्षार्थी परीक्षा केंद्र पर आधा घंटे पहले पहुचें | (Candidates should reach the examination center half an hour before.)"]
["3. परीक्षार्थी परीक्षा हेतु आवश्यक सामग्री साथ लेकर आवें | (Candidates should bring with them the necessary materials for the examination.)"]
[]
[]
[]
[]
[]
["   Sig. Exam Incharge      ",null,null,null,null,null,"Sig. Principal "]