{"text_format":"1","workbook":"xlsx","n_sheets":9,"sheets":["Home-AC","Data-English","Certificate-English","Data-Hindi","Certificate-Hindi","Blank copy-English","Blank copy-Hindi","Sheet3","Template as per IFMS 3.0"],"not_rendered":{"charts":0,"images":2,"macros":1,"external_links":0,"defined_names":15,"comments":0,"pivot_tables":0},"unopened":[],"bounds":{"document_bytes":16777216,"sheet_cells":100000,"rows_first":2000,"rows_last":500,"rows_between":2000,"halvings":0,"cell_chars":16384,"cell_head_chars":4096},"cells_cut":0,"cells_raw":0,"read":"whole","date_system":"1900"}

{"sheet":"Home-AC","index":0,"n_rows":27,"n_cols":8,"rows_kept":27,"cut":false,"hidden":false,"merged":[[1,0,1,8],[22,2,24,8],[22,1,24,1],[26,2,26,8],[18,0,20,8],[3,1,5,3],[3,5,5,8],[8,1,10,3],[8,5,10,8],[14,1,16,2],[14,4,16,5],[14,7,16,8]]}
[]
["Prepare Accounts Personnel Certificate for Pension Purpose"]
[]
[null,"Data-English format",null,null,null,"Accounts Certificate-English"]
[]
[]
[]
[]
[null,"Data-Hindi format",null,null,null,"Accounts Certificate-Hindi"]
[]
[]
[]
[]
[]
[null,"Blank copy-English",null,null,"Blank copy-Hindi",null,null,"Template as per IFMS 3.0"]
[]
[]
[]
["User may prepare Accounts Certiicate in Enlish &  Hindi language as per requirement. The Basic difference is as under"]
[]
{"$rows_left_out":8}
{"sheet":"Data-English","index":1,"n_rows":104,"n_cols":23,"rows_kept":104,"cut":false,"hidden":false,"merged":[[1,20,2,20],[1,21,2,21],[1,0,2,0],[1,1,2,1],[1,6,2,6],[1,7,2,7],[1,8,2,8],[1,4,2,5],[1,9,2,9],[1,2,2,3],[1,13,1,15],[1,16,1,18],[1,12,2,12],[1,11,2,11]]}
[null,"Home-AC",null,null,null,null,null,null,"Home-AC",null,null,null,null,null,null,null,null,null,null,null,"Home-AC"]
["S.N.","Name of Office (Where certificate is issuing)","Name of Employee",null,"Name of Father/Mother/Spouse of employee",null,"Relation with employee","Designation of employee","Place of posting","Retirement Date/End date of Service (dd/mm/yyyy)","Applicable Pay Scale","Pay Scale/Grade Pay/Pay Level","Last Pay","Qualifying Service Period",null,null,"Detail of Accounts Personnel",null,null,"Certificate Type","Dispatch File Number","Dispatched Date"]
[null,null,null,null,null,null,null,null,null,null,"IV/V/\nVI/VII",null,null,"Years","Months","Days","Name","Designation","Office Name","(Original/Revised)"]
[1,"XYZ","Shree","ABCD","Shree","PQRS","Son","Patwari","OFFICE OF THE….","2016-09-30","V Pay","2650-65-3300-70-4000",85100,37,6,12,"PQRS","AAO-I",{"$f":"B4","v":"XYZ"},"Original","F2/Accounts/Certificate/2023/","2022-12-25",{"$f":"CONCATENATE(\"(\",Q4,\")\")","v":"(PQRS)"}]
[null,null,null,null,null,null,null,null,null,null,null,null,null,null,null,null,null,null,null,null,null,null,{"$f":"CONCATENATE(\"(\",Q5,\")\")","v":"()"}]
[null,null,null,null,null,null,null,null,null,null,null,null,null,null,null,null,null,null,null,null,null,null,"()"]
[null,null,null,null,null,null,null,null,null,null,null,null,null,null,null,null,null,null,null,null,null,null,"()"]
[null,null,null,null,null,null,null,null,null,null,null,null,null,null,null,null,null,null,null,null,null,null,"()"]
[null,null,null,null,null,null,null,null,null,null,null,null,null,null,null,null,null,null,null,null,null,null,"()"]
[null,null,null,null,null,null,null,null,null,null,null,null,null,null,null,null,null,null,null,null,null,null,"()"]
[null,null,null,null,null,null,null,null,null,null,null,null,null,null,null,null,null,null,null,null,null,null,"()"]
[null,null,null,null,null,null,null,null,null,null,null,null,null,null,null,null,null,null,null,null,null,null,"()"]
[null,null,null,null,null,null,null,null,null,null,null,null,null,null,null,null,null,null,null,null,null,null,"()"]
[null,null,null,null,null,null,null,null,null,null,null,null,null,null,null,null,null,null,null,null,null,null,"()"]
[null,null,null,null,null,null,null,null,null,null,null,null,null,null,null,null,null,null,null,null,null,null,"()"]
[null,null,null,null,null,null,null,null,null,null,null,null,null,null,null,null,null,null,null,null,null,null,"()"]
[null,null,null,null,null,null,null,null,null,null,null,null,null,null,null,null,null,null,null,null,null,null,"()"]
[null,null,null,null,null,null,null,null,null,null,null,null,null,null,null,null,null,null,null,null,null,null,"()"]
[null,null,null,null,null,null,null,null,null,null,null,null,null,null,null,null,null,null,null,null,null,null,"()"]
[null,null,null,null,null,null,null,null,null,null,null,null,null,null,null,null,null,null,null,null,null,null,"()"]
{"$rows_left_out":85}
{"sheet":"Certificate-English","index":2,"n_rows":34,"n_cols":14,"rows_kept":34,"cut":false,"hidden":false,"merged":[[0,13,1,15],[0,10,1,10],[20,0,24,0],[2,1,2,5],[2,7,2,8],[15,1,15,8],[4,4,4,8],[6,3,6,8],[7,3,7,8],[16,4,16,8],[5,5,5,8],[4,0,18,0],[5,1,5,2],[9,1,12,8],[13,1,13,2],[0,0,0,8],[41,10,41,11],[17,1,17,8],[20,1,24,8],[27,5,27,8],[28,5,28,8],[29,5,31,8],[27,3,27,4],[28,3,28,4],[29,3,29,4],[33,0,35,8],[16,1,16,2],[14,7,14,8],[14,4,14,6],[14,1,14,3],[1,0,1,8],[13,3,13,8],[8,6,8,7],[3,0,3,6],[3,7,3,8]]}
["Rajasthan Government",null,null,null,null,null,null,null,null,"Home-AC",1,null,null,"Change your S.N. (as your data in sheet \"Data\""]
[{"$f":"INDEX('Data-English'!$B$4:$B$103,MATCH('Certificate-English'!$K$1,'Data-English'!$A$4:$A$103,0))","v":"XYZ"}]
["S.N.",{"$f":"IF(INDEX('Data-English'!$U$4:$U$103,MATCH('Certificate-English'!$K$1,'Data-English'!$A$4:$A$103,0))=\"\",\"\",INDEX('Data-English'!$U$4:$U$103,MATCH('Certificate-English'!$K$1,'Data-English'!$A$4:$A$103,0)))","v":"F2/Accounts/Certificate/2023/"},null,null,null,null,"Date:",{"$f":"IF(INDEX('Data-English'!$V$4:$V$103,MATCH('Certificate-English'!$K$1,'Data-English'!$A$4:$A$103,0))=\"\",\"\",INDEX('Data-English'!$V$4:$V$103,MATCH('Certificate-English'!$K$1,'Data-English'!$A$4:$A$103,0)))","v":"2022-12-25"}]
["Accounts Personnel Certificate",null,null,null,null,null,null,{"$f":"IF(INDEX('Data-English'!$T$4:$T$103,MATCH('Certificate-English'!$K$1,'Data-English'!$A$4:$A$103,0))=\"\",\"\",INDEX('Data-English'!$T$4:$T$103,MATCH('Certificate-English'!$K$1,'Data-English'!$A$4:$A$103,0)))","v":"Original"}]
["i.✔","It is certified that",null,{"$f":"INDEX('Data-English'!$C$4:$C$103,MATCH('Certificate-English'!$K$1,'Data-English'!$A$4:$A$103,0))","v":"Shree"},{"$f":"INDEX('Data-English'!$D$4:$D$103,MATCH('Certificate-English'!$K$1,'Data-English'!$A$4:$A$103,0))","v":"ABCD"}]
[null,{"$f":"INDEX('Data-English'!$G$4:$G$103,MATCH('Certificate-English'!$K$1,'Data-English'!$A$4:$A$103,0))","v":"Son"},null,"of",{"$f":"INDEX('Data-English'!$E$4:$E$103,MATCH('Certificate-English'!$K$1,'Data-English'!$A$4:$A$103,0))","v":"Shree"},{"$f":"INDEX('Data-English'!$F$4:$F$103,MATCH('Certificate-English'!$K$1,'Data-English'!$A$4:$A$103,0))","v":"PQRS"}]
[null,"who’s post is",null,{"$f":"INDEX('Data-English'!$H$4:$H$103,MATCH('Certificate-English'!$K$1,'Data-English'!$A$4:$A$103,0))","v":"Patwari"}]
[null," place of posting",null,{"$f":"INDEX('Data-English'!$I$4:$I$103,MATCH('Certificate-English'!$K$1,'Data-English'!$A$4:$A$103,0))","v":"OFFICE OF THE…."}]
[null,"is retiring/ has retired/ Death from date",null,null,null,null,{"$f":"INDEX('Data-English'!$J$4:$J$103,MATCH('Certificate-English'!$K$1,'Data-English'!$A$4:$A$103,0))","v":"2016-09-30"},null," As per "]
[null,"record  in the  service book, Salary/Approved Increment in Salary, Approved Pay Scale, sectioned ACP/ selection scales made to employee is checked and found in accordance to the Rules/Instructions of Government of Rajasthan, and his/her latest salary is"]
[]
[]
[]
[null,{"$f":"INDEX('Data-English'!$M$4:$M$103,MATCH('Certificate-English'!$K$1,'Data-English'!$A$4:$A$103,0))","v":85100},null,{"$f":"CONCATENATE(\"(\",SpellNumber(B14),\")\")","v":"(Rupees EightyFive Thousand One Hundred  Only )"}]
[null,{"$f":"Sheet3!O32","v":"Pay Scale in V Pay"},null,null,{"$f":"INDEX('Data-English'!$L$4:$L$103,MATCH('Certificate-English'!$K$1,'Data-English'!$A$4:$A$103,0))","v":"2650-65-3300-70-4000"},null,null,"on which pension"]
[null,"is to be calculated, is shown correctly.  "]
[null,"Service period of ",null,{"$f":"D5","v":"Shree"},{"$f":"E5","v":"ABCD"}]
[null,"has been verified from the service book, total duration of the service "]
[null,"book is ",{"$f":"INDEX('Data-English'!$N$4:$N$103,MATCH('Certificate-English'!$K$1,'Data-English'!$A$4:$A$103,0))","v":37},"Year",{"$f":"INDEX('Data-English'!$O$4:$O$103,MATCH('Certificate-English'!$K$1,'Data-English'!$A$4:$A$103,0))","v":6},"Months",{"$f":"INDEX('Data-English'!$P$4:$P$103,MATCH('Certificate-English'!$K$1,'Data-English'!$A$4:$A$103,0))","v":12},"Days."]
[]
{"$rows_left_out":15}
{"sheet":"Data-Hindi","index":3,"n_rows":104,"n_cols":21,"rows_kept":104,"cut":false,"hidden":false,"merged":[[1,7,2,7],[1,8,2,8],[1,0,2,0],[1,1,2,1],[1,2,2,3],[1,4,2,5],[1,6,2,6],[1,18,2,18],[1,19,2,19],[1,9,2,9],[1,10,2,10],[1,11,2,11],[1,15,1,17],[1,12,1,14]]}
[null,"Home-AC",null,null,null,null,null,null,"Home-AC"]
["Øaekd","dk;kZy; dk uke","dkfeZd dk uke",null,"dkfeZd ds firk@ekrk@iRuh  dk uke",null,"dkfeZd ls lEcU/k","dkfeZd dk in ","vfUre inLFkkiu LFkku ","lsokfuo`r fnukad","vfUre osru","is& ysoy","lsok vof/k",null,null,"ys[kkdehZ izek.k i= tkjh djus okys dkfeZd dk fooj.k",null,null,"QkbZy uEcj@fMLisp uEcj","fnukad"]
[null,null,null,null,null,null,null,null,null,null,null,null,"o\"kZ","ekg","fnol","uke","inuke","dk;kZy; dk uke"]
[1,"vk;qDr mifuos'ku foHkkx] chdkusj","श्री",",chlhMh","श्री",",DlokbZtsM","पुत्र ","iVokjh","mifuos'ku rglhynkj] ","2016-09-30",77700,"L-14",37,6,20,"izos'k dqekj 'kekZ","lgk;d ys[kkf/kdkjh xzsM&izFke","vk;qDr mifuos'ku foHkkx] chdkusj",",Q2¼ ½ys[kk@isa'ku@2018&19@ 1192","2022-12-25",{"$f":"CONCATENATE(\"¼\",P4,\"½\")","v":"¼izos'k dqekj 'kekZ½"}]
[null,null,null,null,null,null,null,null,null,null,null,null,null,null,null,null,null,null,null,null,{"$f":"CONCATENATE(\"¼\",P5,\"½\")","v":"¼½"}]
[null,null,null,null,null,null,null,null,null,null,null,null,null,null,null,null,null,null,null,null,"¼½"]
[null,null,null,null,null,null,null,null,null,null,null,null,null,null,null,null,null,null,null,null,"¼½"]
[null,null,null,null,null,null,null,null,null,null,null,null,null,null,null,null,null,null,null,null,"¼½"]
[null,null,null,null,null,null,null,null,null,null,null,null,null,null,null,null,null,null,null,null,"¼½"]
[null,null,null,null,null,null,null,null,null,null,null,null,null,null,null,null,null,null,null,null,"¼½"]
[null,null,null,null,null,null,null,null,null,null,null,null,null,null,null,null,null,null,null,null,"¼½"]
[null,null,null,null,null,null,null,null,null,null,null,null,null,null,null,null,null,null,null,null,"¼½"]
[null,null,null,null,null,null,null,null,null,null,null,null,null,null,null,null,null,null,null,null,"¼½"]
[null,null,null,null,null,null,null,null,null,null,null,null,null,null,null,null,null,null,null,null,"¼½"]
[null,null,null,null,null,null,null,null,null,null,null,null,null,null,null,null,null,null,null,null,"¼½"]
[null,null,null,null,null,null,null,null,null,null,null,null,null,null,null,null,null,null,null,null,"¼½"]
[null,null,null,null,null,null,null,null,null,null,null,null,null,null,null,null,null,null,null,null,"¼½"]
[null,null,null,null,null,null,null,null,null,null,null,null,null,null,null,null,null,null,null,null,"¼½"]
[null,null,null,null,null,null,null,null,null,null,null,null,null,null,null,null,null,null,null,null,"¼½"]
[null,null,null,null,null,null,null,null,null,null,null,null,null,null,null,null,null,null,null,null,"¼½"]
{"$rows_left_out":85}
{"sheet":"Certificate-Hindi","index":4,"n_rows":26,"n_cols":14,"rows_kept":26,"cut":false,"hidden":false,"merged":[[3,12,3,13],[0,0,0,9],[1,2,1,9],[2,1,2,6],[2,8,2,9],[3,0,3,9],[1,0,1,1],[8,2,8,9],[22,2,22,4],[20,2,20,4],[20,5,21,9],[22,5,23,9],[19,5,19,9],[14,1,14,4],[14,5,14,9],[15,0,15,5],[9,0,10,9],[0,13,1,15],[11,0,11,1],[25,0,27,9],[4,0,4,9],[7,8,7,9],[12,0,12,1],[6,1,6,5],[5,7,5,10],[5,1,5,4],[8,0,8,1],[6,7,6,9],[13,0,13,9],[7,0,7,7],[12,2,12,3],[12,4,12,10],[11,2,11,9]]}
["राज. सरकार ",null,null,null,null,null,null,null,null,null,null,1,null,"Change your S.N. (as your data in sheet \"Data\""]
["कार्यालय का नाम",null,{"$f":"INDEX('Data-Hindi'!$B$4:$B$103,MATCH('Certificate-Hindi'!$L$1,'Data-Hindi'!$A$4:$A$103,0))","v":"vk;qDr mifuos'ku foHkkx] chdkusj"}]
["क्रंमाक",{"$f":"IF(INDEX('Data-Hindi'!$S$4:$S$103,MATCH('Certificate-Hindi'!$L$1,'Data-Hindi'!$A$4:$A$103,0))=\"\",\"\",INDEX('Data-Hindi'!$S$4:$S$103,MATCH('Certificate-Hindi'!$L$1,'Data-Hindi'!$A$4:$A$103,0)))","v":",Q2¼ ½ys[kk@isa'ku@2018&19@ 1192"},null,null,null,null,null,"दिनांक",{"$f":"IF(INDEX('Data-Hindi'!$T$4:$T$103,MATCH('Certificate-Hindi'!$L$1,'Data-Hindi'!$A$4:$A$103,0))=\"\",\"\",INDEX('Data-Hindi'!$T$4:$T$103,MATCH('Certificate-Hindi'!$L$1,'Data-Hindi'!$A$4:$A$103,0)))","v":"2022-12-25"}]
["लेखाकर्मी का प्रमाण-पत्र",null,null,null,null,null,null,null,null,null,null,null,"Home-AC"]
["                 प्रमाणित किया जाता है कि इस कार्यालय के अधीन"]
[{"$f":"INDEX('Data-Hindi'!$C$4:$C$103,MATCH('Certificate-Hindi'!$L$1,'Data-Hindi'!$A$4:$A$103,0))","v":"श्री"},{"$f":"INDEX('Data-Hindi'!$D$4:$D$103,MATCH('Certificate-Hindi'!$L$1,'Data-Hindi'!$A$4:$A$103,0))","v":",chlhMh"},null,null,null,{"$f":"INDEX('Data-Hindi'!$G$4:$G$103,MATCH('Certificate-Hindi'!$L$1,'Data-Hindi'!$A$4:$A$103,0))","v":"पुत्र "},{"$f":"INDEX('Data-Hindi'!$E$4:$E$103,MATCH('Certificate-Hindi'!$L$1,'Data-Hindi'!$A$4:$A$103,0))","v":"श्री"},{"$f":"INDEX('Data-Hindi'!$F$4:$F$103,MATCH('Certificate-Hindi'!$L$1,'Data-Hindi'!$A$4:$A$103,0))","v":",DlokbZtsM"}]
["पद",{"$f":"INDEX('Data-Hindi'!$H$4:$H$103,MATCH('Certificate-Hindi'!$L$1,'Data-Hindi'!$A$4:$A$103,0))","v":"iVokjh"},null,null,null,null,null,"पदस्थापन स्थान  "]
[{"$f":"INDEX('Data-Hindi'!$I$4:$I$103,MATCH('Certificate-Hindi'!$L$1,'Data-Hindi'!$A$4:$A$103,0))","v":"mifuos'ku rglhynkj] "},null,null,null,null,null,null,null,"से दिनांक"]
[{"$f":"INDEX('Data-Hindi'!$J$4:J$103,MATCH('Certificate-Hindi'!$L$1,'Data-Hindi'!$A$4:$A$103,0))","v":"2016-09-30"},null,"को सेवानिवृत हो रहे है/हो चुके है के सेवाभिलेख के आधार  पर समय-"]
["समय पर किये गये वेतन/स्वीकृति की गयी एसीपी/ चयनित वेतनमानों को राजस्थान सरकार  के नियमों/ निर्देशों के क्रम में जॉंच कर ली गयी है तथा इनका  अन्तिम वेतन रूपये"]
[]
[{"$f":"INDEX('Data-Hindi'!$K$4:$K$103,MATCH('Certificate-Hindi'!$L$1,'Data-Hindi'!$A$4:$A$103,0))","v":77700},null,{"$f":"CONCATENATE(\"(\",SpellNumber(A12),\")\")","v":"(Rupees SeventySeven Thousand Seven Hundred  Only )"}]
["पे-मैट्रिक्स लेवल",null,{"$f":"INDEX('Data-Hindi'!$L$4:$L$103,MATCH('Certificate-Hindi'!$L$1,'Data-Hindi'!$A$4:$A$103,0))","v":"L-14"},null,"जिस पर पेंशन परिलाभों की गणना की गयी है/की जानी है,"]
[" सही रूप से निकाला गया है ।"]
[{"$f":"A6","v":"श्री"},{"$f":"B6","v":",chlhMh"},null,null,null,"की कुल अर्हकारी सेवा अवधि का सत्यापन "]
["सेवा  पुस्तिका से कर लिया गया है, जिसकी अवधि",null,null,null,null,null,{"$f":"INDEX('Data-Hindi'!$M$4:$M$103,MATCH('Certificate-Hindi'!$L$1,'Data-Hindi'!$A$4:$A$103,0))","v":37},"वर्ष",{"$f":"INDEX('Data-Hindi'!$N$4:N$103,MATCH('Certificate-Hindi'!$L$1,'Data-Hindi'!$A$4:$A$103,0))","v":6},"माह"]
["एवं",{"$f":"INDEX('Data-Hindi'!$O$4:$O$103,MATCH('Certificate-Hindi'!$L$1,'Data-Hindi'!$A$4:$A$103,0))","v":20},"दिवस है।"]
[]
[]
[null,null,null,null,null,{"$f":"INDEX('Data-Hindi'!$U$4:$U$103,MATCH('Certificate-Hindi'!$L$1,'Data-Hindi'!$A$4:$A$103,0))","v":"¼izos'k dqekj 'kekZ½"}]
{"$rows_left_out":7}
{"sheet":"Blank copy-English","index":5,"n_rows":30,"n_cols":11,"rows_kept":30,"cut":false,"hidden":false,"merged":[[17,1,17,8],[20,0,24,0],[20,1,24,8],[41,10,41,11],[27,3,27,4],[27,5,27,8],[28,3,28,4],[28,5,28,8],[29,3,29,4],[29,5,31,8],[4,0,18,0],[4,4,4,8],[5,1,5,2],[5,5,5,8],[6,3,6,8],[7,3,7,8],[13,1,13,2],[13,3,13,8],[15,1,15,8],[16,1,16,2],[16,4,16,8],[14,1,14,2],[14,3,14,4],[14,5,14,8],[8,5,8,7],[9,1,12,8],[0,0,0,8],[1,0,1,8],[2,1,2,5],[2,7,2,8],[3,0,3,8]]}
["Rajasthan Government"]
[null,null,null,null,null,null,null,null,null,null,"Home-AC"]
["S.N.",null,null,null,null,null,"Date:"]
["Accounts Personnel Certificate"]
["i.","It is certified that"]
[null,null,null,"of"]
[null,"who’s post is"]
[null," place of posting"]
[null,"is retiring/has retired from date",null,null,null,null,null,null," As per "]
[null,"record  in the  service book, Salary/Approved Increment in Salary, Approved Pay Scale, sectioned ACP/ selection scales made to employee is checked and found in accordance to the Rules/Instructions of Government of Rajasthan, and his/her latest salary is"]
[]
[]
[]
[null,0]
[null,"of pay matrix level",null,null,null,"on which pension is to be calculated,"]
[null," is shown correctly.  "]
[null," Service period of "]
[null,"has been verified from the service book, total duration of the service "]
[null,"book is ",null,"Year",null,"Months",null,"Days."]
[]
{"$rows_left_out":11}
{"sheet":"Blank copy-Hindi","index":6,"n_rows":23,"n_cols":13,"rows_kept":23,"cut":false,"hidden":false,"merged":[[7,0,7,7],[7,8,7,9],[0,0,0,9],[1,0,1,1],[1,2,1,9],[2,1,2,6],[2,8,2,9],[3,0,3,9],[4,0,4,9],[5,1,5,4],[5,7,5,10],[6,1,6,5],[6,7,6,9],[8,0,8,1],[8,2,8,10],[9,0,9,10],[10,0,10,10],[11,1,11,2],[11,4,11,9],[12,0,12,1],[12,2,12,4],[12,5,12,10],[13,0,13,9],[14,1,14,5],[14,6,14,9],[15,6,15,7],[19,5,19,8],[20,2,20,4],[20,5,21,9],[22,2,22,4],[22,5,23,9]]}
["राज. सरकार ",null,null,null,null,null,null,null,null,null,null,1]
["कार्यालय का नाम",null,null,null,null,null,null,null,null,null,null,null,"Home-AC"]
["क्रंमाक",null,null,null,null,null,null,"दिनांक"]
["लेखाकर्मी का प्रमाण-पत्र"]
["                 प्रमाणित किया जाता है कि इस कार्यालय के अधीन"]
["श्री",null,null,null,null,"श्री","पुत्र "]
["पद",null,null,null,null,null,null,"पदस्थापन स्थान  "]
[null,null,null,null,null,null,null,null,"से दिनांक"]
[null,null,"को सेवानिवृत हो रहे है/हो चुके है के सेवाभिलेख के आधार  पर "]
["समय-समय  पर किये  गये वेतन/स्वीकृति की गयी  एसीपी/चयनित वेतनमानों को"]
["राजस्थान सरकार के नियमों/निर्देशों के क्रम में जॉंच कर ली गयी है तथा इनका अन्तिम",null,null,null,null,null,null,null,null,null,null,null,"½"]
["वेतन रूपये \n",null,null,"(",null,null,null,null,null,null,")",null,55500]
["पे-मैट्रिक्स लेवल",null,null,null,null,"जिस पर पेंशन परिलाभों की गणना की गयी"]
["है/की जानी है, सही रूप से निकाला गया है ।"]
[{"$f":"A6","v":"श्री"},null,null,null,null,null,"की कुल अहंकारी सेवा अवधि का"]
[" सत्यापन सेवा पुस्तिका से कर लिया गया है, ",null,null,null,null,null,"जिसकी अवधि",null,null,"वर्ष"]
[null,"माह","एवं",null,null,"दिवस है।"]
[]
[]
[null,null,null,null,"¼",null,null,null,null,"½"]
{"$rows_left_out":4}
{"sheet":"Sheet3","index":7,"n_rows":35,"n_cols":17,"rows_kept":35,"cut":false,"hidden":true,"merged":[]}
[]
[]
["Saluation",null,"Son_of",null,"Levels",null,"Saluation_english",null,"Relation",null,null,null,"Grade Pay","IV Pay","V Pay","VI Pay","VII Pay"]
["श्री",null,"पुत्र ",null,"L-1",null,"Shree",null,"Son",null,null,null,1300,"750-12-798-13-850-15-940","2550-55-2660-60-3200",1300,"L-1"]
["श्रीमती",null,"पुत्री",null,"L-2",null,"Smt.",null,"Daughter",null,null,null,1400,"775-13-840-15-1005-20-1025","2610-60-3150-65-3540",1400,"L-2"]
["सुश्री",null,"पत्नी",null,"L-3",null,"Ms.",null,"Wife",null,null,null,1650,"800-15-950-20-1250","2650-65-3300-70-4000",1650,"L-3"]
["कुमारी",null,null,null,"L-4",null,"Kumari",null,null,null,null,null,1800,"825-15-900-20-1200-25-1350","2750-70-3800-75-4400",1800,"L-4"]
["स्व.",null,null,null,"L-5",null,"Late shree",null,null,null,null,null,1850,"910-20-1150-25-1400-30-1520","2950-75-4075-80-4475",1850,"L-5"]
[null,null,null,null,"L-6",null,null,null,null,null,null,null,1900,"950-20-1150-25-1400-30-1640-40-1680","3050-75-3950-80-4590",1900,"L-6"]
[null,null,null,null,"L-7",null,null,null,null,null,null,null,2000,"975-25-1100-30-1640-40-1720","3200-85-4900",2000,"L-7"]
[null,null,null,null,"L-8",null,null,null,null,null,null,null,2100,"1025-25-1100-30-1640-40-1800","3400-90-5200",2100,"L-8"]
[null,null,null,null,"L-9",null,null,null,null,null,null,null,2400,"1200-30-1560-40-2000-50-2050","4000-100-6000",2400,"L-9"]
[null,null,null,null,"L-10",null,null,null,null,null,null,null,2800,"1200-30-1560-40-2000-50-2050","4500-125-7000",2800,"L-10"]
[null,null,null,null,"L-11",null,null,null,null,null,null,null,3200,"1400-40-1600-50-2300-60-2600","5000-150-8000",3200,"L-11"]
[null,null,null,null,"L-12",null,null,null,null,null,null,null,3600,"1640-60-2600-75-2900","5500-175-9000",3600,"L-12"]
[null,null,null,null,"L-13",null,null,null,null,null,null,null,4200,"2000-60-2300-75-3200","6500-200-10500",4200,"L-13"]
[null,null,null,null,"L-14",null,null,null,null,null,null,null,4800,"2000-60-2300-75-3200-100-3500","7500-250-12000",4800,"L-14"]
[null,null,null,null,"L-15",null,null,null,null,null,null,null,5400,"2200-75-2800-100-4000","8000-275-13500",5400,"L-15"]
[null,null,null,null,"L-16",null,null,null,null,null,null,null,6000,"2500-75-2800-100-4000-125-4250","8000-275-13500",6000,"L-16"]
[null,null,null,null,"L-l7",null,null,null,null,null,null,null,6600,"2650-75-2800-100-4000-125-4500","9000-300-14400",6600,"L-17"]
{"$rows_left_out":16}
{"sheet":"Template as per IFMS 3.0","index":8,"n_rows":2,"n_cols":13,"rows_kept":2,"cut":false,"hidden":false,"merged":[]}
[]
[null,null,null,null,null,null,null,null,null,null,null,null,"Home-AC"]